Skip to content

Instantly share code, notes, and snippets.

Embed
What would you like to do?
C:\Users\jasew\workspace\servo (master -> origin)
λ .\mach.bat build -d
Compiling bytes v0.4.6
Compiling expat-sys v2.1.6
Compiling harfbuzz-sys v0.2.1
Compiling fontsan v0.4.0 (https://github.com/servo/fontsan#29e879c8)
Compiling heartbeats-simple-sys v0.4.1
Compiling mozangle v0.1.7
Compiling libz-sys v1.0.18
Compiling openssl v0.9.24
Compiling unicase v1.4.0
Compiling rand v0.3.22
Compiling parking_lot_core v0.2.13
Compiling termcolor v0.3.6
Compiling tempfile v3.0.2
Compiling walkdir v2.1.4
Compiling clipboard v0.5.0
Compiling atty v0.2.3
Compiling time v0.1.37
Compiling servo_allocator v0.0.1 (C:\Users\jasew\workspace\servo\components\allocator)
Compiling miow v0.2.1
Compiling serde_derive v1.0.66
Compiling cssparser v0.24.0
Compiling num-derive v0.2.2
error: failed to run custom build command for `fontsan v0.4.0 (https://github.com/servo/fontsan#29e879c8)`
process didn't exit successfully: `C:\Users\jasew\workspace\servo\target\debug\build\fontsan-b6290b2be9a9d424\build-script-build` (exit code: 101)
--- stdout
running: "cmake" "C:\\Users\\jasew\\.cargo\\git\\checkouts\\fontsan-75864180be477bc9\\29e879c\\src" "-G" "Visual Studio 15 2017 Win64" "-DCMAKE_INSTALL_PREFIX=C:\\Users\\jasew\\workspace\\servo\\target\\debug\\build\\fontsan-45e0f51d830893f8\\out" "-DCMAKE_C_FLAGS= /nologo /MD" "-DCMAKE_C_FLAGS_DEBUG= /nologo /MD" "-DCMAKE_CXX_FLAGS= /nologo /MD" "-DCMAKE_CXX_FLAGS_DEBUG= /nologo /MD" "-DCMAKE_BUILD_TYPE=Debug"
-- Configuring incomplete, errors occurred!
See also "C:/Users/jasew/workspace/servo/target/debug/build/fontsan-45e0f51d830893f8/out/build/CMakeFiles/CMakeOutput.log".
--- stderr
CMake Error at CMakeLists.txt:1 (project):
Failed to run MSBuild command:
C:/Program Files (x86)/Microsoft Visual Studio/2017/Community/MSBuild/15.0/Bin/MSBuild.exe
to get the value of VCTargetsPath:
Microsoft (R) Build Engine version 15.1.1012.6693
Copyright (C) Microsoft Corporation. All rights reserved.
Build started 17/10/2018 18:15:47.
Project "C:\Users\jasew\workspace\servo\target\debug\build\fontsan-45e0f51d830893f8\out\build\CMakeFiles\3.10.1\VCTargetsPath.vcxproj" on node 1 (default targets).
C:\Program Files (x86)\MSBuild\Microsoft.Cpp\v4.0\v140\Microsoft.Cpp.Platform.targets(57,5): error MSB8020: The build tools for v141 (Platform Toolset = 'v141') cannot be found. To build using the v141 build tools, please install v141 build tools. Alternatively, you may upgrade to the current Visual Studio tools by selecting the Project menu or right-click the solution, and then selecting "Retarget solution". [C:\Users\jasew\workspace\servo\target\debug\build\fontsan-45e0f51d830893f8\out\build\CMakeFiles\3.10.1\VCTargetsPath.vcxproj]
Done Building Project "C:\Users\jasew\workspace\servo\target\debug\build\fontsan-45e0f51d830893f8\out\build\CMakeFiles\3.10.1\VCTargetsPath.vcxproj" (default targets) -- FAILED.
Build FAILED.
"C:\Users\jasew\workspace\servo\target\debug\build\fontsan-45e0f51d830893f8\out\build\CMakeFiles\3.10.1\VCTargetsPath.vcxproj" (default target) (1) ->
(PlatformPrepareForBuild target) ->
C:\Program Files (x86)\MSBuild\Microsoft.Cpp\v4.0\v140\Microsoft.Cpp.Platform.targets(57,5): error MSB8020: The build tools for v141 (Platform Toolset = 'v141') cannot be found. To build using the v141 build tools, please install v141 build tools. Alternatively, you may upgrade to the current Visual Studio tools by selecting the Project menu or right-click the solution, and then selecting "Retarget solution". [C:\Users\jasew\workspace\servo\target\debug\build\fontsan-45e0f51d830893f8\out\build\CMakeFiles\3.10.1\VCTargetsPath.vcxproj]
0 Warning(s)
1 Error(s)
Time Elapsed 00:00:00.51
Exit code: 1
thread 'main' panicked at '
command did not execute successfully, got: exit code: 1
build script failed, must exit now', C:\Users\jasew\.cargo\registry\src\github.com-1ecc6299db9ec823\cmake-0.1.29\src\lib.rs:632:5
stack backtrace:
0: std::sys::windows::backtrace::unwind_backtrace
at /rustc/8c4ad4e9e42f4bcbdbb784692b936c2462061abc\src/libstd\sys\windows\backtrace\mod.rs:91
1: std::sys_common::backtrace::print
at /rustc/8c4ad4e9e42f4bcbdbb784692b936c2462061abc\src/libstd\sys_common\backtrace.rs:59
2: std::panicking::default_hook::{{closure}}
at /rustc/8c4ad4e9e42f4bcbdbb784692b936c2462061abc\src/libstd\panicking.rs:211
3: std::panicking::default_hook
at /rustc/8c4ad4e9e42f4bcbdbb784692b936c2462061abc\src/libstd\panicking.rs:227
4: std::panicking::rust_panic_with_hook
at /rustc/8c4ad4e9e42f4bcbdbb784692b936c2462061abc\src/libstd\panicking.rs:476
5: std::panicking::continue_panic_fmt
at /rustc/8c4ad4e9e42f4bcbdbb784692b936c2462061abc\src/libstd\panicking.rs:390
6: std::panicking::begin_panic_fmt
at /rustc/8c4ad4e9e42f4bcbdbb784692b936c2462061abc\src/libstd\panicking.rs:345
7: cmake::fail
at C:\Users\jasew\.cargo\registry\src\github.com-1ecc6299db9ec823\cmake-0.1.29\src\lib.rs:632
8: cmake::run
at C:\Users\jasew\.cargo\registry\src\github.com-1ecc6299db9ec823\cmake-0.1.29\src\lib.rs:613
9: cmake::Config::build
at C:\Users\jasew\.cargo\registry\src\github.com-1ecc6299db9ec823\cmake-0.1.29\src\lib.rs:481
10: build_script_build::main
at .\build.rs:8
11: std::rt::lang_start::{{closure}}<()>
at \libstd\rt.rs:74
12: std::panicking::try::do_call<closure,i32>
at /rustc/8c4ad4e9e42f4bcbdbb784692b936c2462061abc\src/libstd\panicking.rs:310
13: panic_unwind::__rust_maybe_catch_panic
at /rustc/8c4ad4e9e42f4bcbdbb784692b936c2462061abc\src/libpanic_unwind\lib.rs:102
14: std::rt::lang_start_internal
at /rustc/8c4ad4e9e42f4bcbdbb784692b936c2462061abc\src/libstd\rt.rs:58
15: std::rt::lang_start<()>
at \libstd\rt.rs:74
16: main
17: __scrt_common_main_seh
at f:\dd\vctools\crt\vcstartup\src\startup\exe_common.inl:253
18: BaseThreadInitThunk
19: RtlUserThreadStart
warning: build failed, waiting for other jobs to finish...
error: failed to run custom build command for `expat-sys v2.1.6`
process didn't exit successfully: `C:\Users\jasew\workspace\servo\target\debug\build\expat-sys-87aece3bd1bfdd66\build-script-build` (exit code: 101)
--- stdout
running: "cmake" "C:\\Users\\jasew\\.cargo\\registry\\src\\github.com-1ecc6299db9ec823\\expat-sys-2.1.6\\expat" "-G" "Visual Studio 15 2017 Win64" "-DBUILD_shared=OFF" "-DBUILD_tools=OFF" "-DBUILD_examples=OFF" "-DBUILD_tests=OFF" "-DCMAKE_INSTALL_PREFIX=C:\\Users\\jasew\\workspace\\servo\\target\\debug\\build\\expat-sys-5400eba7befa7229\\out" "-DCMAKE_C_FLAGS= /nologo /MD" "-DCMAKE_C_FLAGS_DEBUG= /nologo /MD" "-DCMAKE_CXX_FLAGS= /nologo /MD" "-DCMAKE_CXX_FLAGS_DEBUG= /nologo /MD" "-DCMAKE_BUILD_TYPE=Debug"
-- Configuring incomplete, errors occurred!
See also "C:/Users/jasew/workspace/servo/target/debug/build/expat-sys-5400eba7befa7229/out/build/CMakeFiles/CMakeOutput.log".
--- stderr
CMake Error at CMakeLists.txt:4 (project):
Failed to run MSBuild command:
C:/Program Files (x86)/Microsoft Visual Studio/2017/Community/MSBuild/15.0/Bin/MSBuild.exe
to get the value of VCTargetsPath:
Microsoft (R) Build Engine version 15.1.1012.6693
Copyright (C) Microsoft Corporation. All rights reserved.
Build started 17/10/2018 18:15:47.
Project "C:\Users\jasew\workspace\servo\target\debug\build\expat-sys-5400eba7befa7229\out\build\CMakeFiles\3.10.1\VCTargetsPath.vcxproj" on node 1 (default targets).
C:\Program Files (x86)\MSBuild\Microsoft.Cpp\v4.0\v140\Microsoft.Cpp.Platform.targets(57,5): error MSB8020: The build tools for v141 (Platform Toolset = 'v141') cannot be found. To build using the v141 build tools, please install v141 build tools. Alternatively, you may upgrade to the current Visual Studio tools by selecting the Project menu or right-click the solution, and then selecting "Retarget solution". [C:\Users\jasew\workspace\servo\target\debug\build\expat-sys-5400eba7befa7229\out\build\CMakeFiles\3.10.1\VCTargetsPath.vcxproj]
Done Building Project "C:\Users\jasew\workspace\servo\target\debug\build\expat-sys-5400eba7befa7229\out\build\CMakeFiles\3.10.1\VCTargetsPath.vcxproj" (default targets) -- FAILED.
Build FAILED.
"C:\Users\jasew\workspace\servo\target\debug\build\expat-sys-5400eba7befa7229\out\build\CMakeFiles\3.10.1\VCTargetsPath.vcxproj" (default target) (1) ->
(PlatformPrepareForBuild target) ->
C:\Program Files (x86)\MSBuild\Microsoft.Cpp\v4.0\v140\Microsoft.Cpp.Platform.targets(57,5): error MSB8020: The build tools for v141 (Platform Toolset = 'v141') cannot be found. To build using the v141 build tools, please install v141 build tools. Alternatively, you may upgrade to the current Visual Studio tools by selecting the Project menu or right-click the solution, and then selecting "Retarget solution". [C:\Users\jasew\workspace\servo\target\debug\build\expat-sys-5400eba7befa7229\out\build\CMakeFiles\3.10.1\VCTargetsPath.vcxproj]
0 Warning(s)
1 Error(s)
Time Elapsed 00:00:00.51
Exit code: 1
thread 'main' panicked at '
command did not execute successfully, got: exit code: 1
build script failed, must exit now', C:\Users\jasew\.cargo\registry\src\github.com-1ecc6299db9ec823\cmake-0.1.29\src\lib.rs:632:5
stack backtrace:
0: std::sys::windows::backtrace::unwind_backtrace
at /rustc/8c4ad4e9e42f4bcbdbb784692b936c2462061abc\src/libstd\sys\windows\backtrace\mod.rs:91
1: std::sys_common::backtrace::print
at /rustc/8c4ad4e9e42f4bcbdbb784692b936c2462061abc\src/libstd\sys_common\backtrace.rs:59
2: std::panicking::default_hook::{{closure}}
at /rustc/8c4ad4e9e42f4bcbdbb784692b936c2462061abc\src/libstd\panicking.rs:211
3: std::panicking::default_hook
at /rustc/8c4ad4e9e42f4bcbdbb784692b936c2462061abc\src/libstd\panicking.rs:227
4: std::panicking::rust_panic_with_hook
at /rustc/8c4ad4e9e42f4bcbdbb784692b936c2462061abc\src/libstd\panicking.rs:476
5: std::panicking::continue_panic_fmt
at /rustc/8c4ad4e9e42f4bcbdbb784692b936c2462061abc\src/libstd\panicking.rs:390
6: std::panicking::begin_panic_fmt
at /rustc/8c4ad4e9e42f4bcbdbb784692b936c2462061abc\src/libstd\panicking.rs:345
7: cmake::fail
at C:\Users\jasew\.cargo\registry\src\github.com-1ecc6299db9ec823\cmake-0.1.29\src\lib.rs:632
8: cmake::run
at C:\Users\jasew\.cargo\registry\src\github.com-1ecc6299db9ec823\cmake-0.1.29\src\lib.rs:613
9: cmake::Config::build
at C:\Users\jasew\.cargo\registry\src\github.com-1ecc6299db9ec823\cmake-0.1.29\src\lib.rs:481
10: build_script_build::main
at .\build.rs:21
11: std::rt::lang_start::{{closure}}<()>
at \libstd\rt.rs:74
12: std::panicking::try::do_call<closure,i32>
at /rustc/8c4ad4e9e42f4bcbdbb784692b936c2462061abc\src/libstd\panicking.rs:310
13: panic_unwind::__rust_maybe_catch_panic
at /rustc/8c4ad4e9e42f4bcbdbb784692b936c2462061abc\src/libpanic_unwind\lib.rs:102
14: std::rt::lang_start_internal
at /rustc/8c4ad4e9e42f4bcbdbb784692b936c2462061abc\src/libstd\rt.rs:58
15: std::rt::lang_start<()>
at \libstd\rt.rs:74
16: main
17: __scrt_common_main_seh
at f:\dd\vctools\crt\vcstartup\src\startup\exe_common.inl:253
18: BaseThreadInitThunk
19: RtlUserThreadStart
warning: build failed, waiting for other jobs to finish...
error: failed to run custom build command for `harfbuzz-sys v0.2.1`
process didn't exit successfully: `C:\Users\jasew\workspace\servo\target\debug\build\harfbuzz-sys-721dff5335d7ebe2\build-script-build` (exit code: 101)
--- stdout
cargo:rerun-if-env-changed=HARFBUZZ_SYS_NO_PKG_CONFIG
running: "cmake" "C:\\Users\\jasew\\.cargo\\registry\\src\\github.com-1ecc6299db9ec823\\harfbuzz-sys-0.2.1\\harfbuzz" "-G" "Visual Studio 15 2017 Win64" "-DCMAKE_INSTALL_PREFIX=C:\\Users\\jasew\\workspace\\servo\\target\\debug\\build\\harfbuzz-sys-5965645a2ee52c77\\out" "-DCMAKE_C_FLAGS= /nologo /MD" "-DCMAKE_C_FLAGS_DEBUG= /nologo /MD" "-DCMAKE_CXX_FLAGS= /nologo /MD" "-DCMAKE_CXX_FLAGS_DEBUG= /nologo /MD" "-DCMAKE_BUILD_TYPE=Debug"
-- Configuring incomplete, errors occurred!
See also "C:/Users/jasew/workspace/servo/target/debug/build/harfbuzz-sys-5965645a2ee52c77/out/build/CMakeFiles/CMakeOutput.log".
--- stderr
CMake Error at CMakeLists.txt:2 (project):
Failed to run MSBuild command:
C:/Program Files (x86)/Microsoft Visual Studio/2017/Community/MSBuild/15.0/Bin/MSBuild.exe
to get the value of VCTargetsPath:
Microsoft (R) Build Engine version 15.1.1012.6693
Copyright (C) Microsoft Corporation. All rights reserved.
Build started 17/10/2018 18:15:47.
Project "C:\Users\jasew\workspace\servo\target\debug\build\harfbuzz-sys-5965645a2ee52c77\out\build\CMakeFiles\3.10.1\VCTargetsPath.vcxproj" on node 1 (default targets).
C:\Program Files (x86)\MSBuild\Microsoft.Cpp\v4.0\v140\Microsoft.Cpp.Platform.targets(57,5): error MSB8020: The build tools for v141 (Platform Toolset = 'v141') cannot be found. To build using the v141 build tools, please install v141 build tools. Alternatively, you may upgrade to the current Visual Studio tools by selecting the Project menu or right-click the solution, and then selecting "Retarget solution". [C:\Users\jasew\workspace\servo\target\debug\build\harfbuzz-sys-5965645a2ee52c77\out\build\CMakeFiles\3.10.1\VCTargetsPath.vcxproj]
Done Building Project "C:\Users\jasew\workspace\servo\target\debug\build\harfbuzz-sys-5965645a2ee52c77\out\build\CMakeFiles\3.10.1\VCTargetsPath.vcxproj" (default targets) -- FAILED.
Build FAILED.
"C:\Users\jasew\workspace\servo\target\debug\build\harfbuzz-sys-5965645a2ee52c77\out\build\CMakeFiles\3.10.1\VCTargetsPath.vcxproj" (default target) (1) ->
(PlatformPrepareForBuild target) ->
C:\Program Files (x86)\MSBuild\Microsoft.Cpp\v4.0\v140\Microsoft.Cpp.Platform.targets(57,5): error MSB8020: The build tools for v141 (Platform Toolset = 'v141') cannot be found. To build using the v141 build tools, please install v141 build tools. Alternatively, you may upgrade to the current Visual Studio tools by selecting the Project menu or right-click the solution, and then selecting "Retarget solution". [C:\Users\jasew\workspace\servo\target\debug\build\harfbuzz-sys-5965645a2ee52c77\out\build\CMakeFiles\3.10.1\VCTargetsPath.vcxproj]
0 Warning(s)
1 Error(s)
Time Elapsed 00:00:00.51
Exit code: 1
thread 'main' panicked at '
command did not execute successfully, got: exit code: 1
build script failed, must exit now', C:\Users\jasew\.cargo\registry\src\github.com-1ecc6299db9ec823\cmake-0.1.29\src\lib.rs:632:5
stack backtrace:
0: std::sys::windows::backtrace::unwind_backtrace
at /rustc/8c4ad4e9e42f4bcbdbb784692b936c2462061abc\src/libstd\sys\windows\backtrace\mod.rs:91
1: std::sys_common::backtrace::print
at /rustc/8c4ad4e9e42f4bcbdbb784692b936c2462061abc\src/libstd\sys_common\backtrace.rs:59
2: std::panicking::default_hook::{{closure}}
at /rustc/8c4ad4e9e42f4bcbdbb784692b936c2462061abc\src/libstd\panicking.rs:211
3: std::panicking::default_hook
at /rustc/8c4ad4e9e42f4bcbdbb784692b936c2462061abc\src/libstd\panicking.rs:227
4: std::panicking::rust_panic_with_hook
at /rustc/8c4ad4e9e42f4bcbdbb784692b936c2462061abc\src/libstd\panicking.rs:476
5: std::panicking::continue_panic_fmt
at /rustc/8c4ad4e9e42f4bcbdbb784692b936c2462061abc\src/libstd\panicking.rs:390
6: std::panicking::begin_panic_fmt
at /rustc/8c4ad4e9e42f4bcbdbb784692b936c2462061abc\src/libstd\panicking.rs:345
7: cmake::fail
at C:\Users\jasew\.cargo\registry\src\github.com-1ecc6299db9ec823\cmake-0.1.29\src\lib.rs:632
8: cmake::run
at C:\Users\jasew\.cargo\registry\src\github.com-1ecc6299db9ec823\cmake-0.1.29\src\lib.rs:613
9: cmake::Config::build
at C:\Users\jasew\.cargo\registry\src\github.com-1ecc6299db9ec823\cmake-0.1.29\src\lib.rs:481
10: build_script_build::main
at .\build.rs:21
11: std::rt::lang_start::{{closure}}<()>
at \libstd\rt.rs:74
12: std::panicking::try::do_call<closure,i32>
at /rustc/8c4ad4e9e42f4bcbdbb784692b936c2462061abc\src/libstd\panicking.rs:310
13: panic_unwind::__rust_maybe_catch_panic
at /rustc/8c4ad4e9e42f4bcbdbb784692b936c2462061abc\src/libpanic_unwind\lib.rs:102
14: std::rt::lang_start_internal
at /rustc/8c4ad4e9e42f4bcbdbb784692b936c2462061abc\src/libstd\rt.rs:58
15: std::rt::lang_start<()>
at \libstd\rt.rs:74
16: main
17: __scrt_common_main_seh
at f:\dd\vctools\crt\vcstartup\src\startup\exe_common.inl:253
18: BaseThreadInitThunk
19: RtlUserThreadStart
warning: build failed, waiting for other jobs to finish...
error: failed to run custom build command for `heartbeats-simple-sys v0.4.1`
process didn't exit successfully: `C:\Users\jasew\workspace\servo\target\debug\build\heartbeats-simple-sys-2f763401bf8f55d9\build-script-build` (exit code: 101)
--- stdout
running: "cmake" "C:\\Users\\jasew\\.cargo\\registry\\src\\github.com-1ecc6299db9ec823\\heartbeats-simple-sys-0.4.1/heartbeats-simple" "-G" "Visual Studio 15 2017 Win64" "-DCMAKE_INSTALL_PREFIX=C:\\Users\\jasew\\workspace\\servo\\target\\debug\\build\\heartbeats-simple-sys-4a4f65e2c478996b\\out" "-DCMAKE_C_FLAGS= /nologo /MD" "-DCMAKE_C_FLAGS_DEBUG= /nologo /MD" "-DCMAKE_CXX_FLAGS= /nologo /MD" "-DCMAKE_CXX_FLAGS_DEBUG= /nologo /MD" "-DCMAKE_BUILD_TYPE=Debug"
-- Configuring incomplete, errors occurred!
See also "C:/Users/jasew/workspace/servo/target/debug/build/heartbeats-simple-sys-4a4f65e2c478996b/out/build/CMakeFiles/CMakeOutput.log".
--- stderr
CMake Error at CMakeLists.txt:3 (project):
Failed to run MSBuild command:
C:/Program Files (x86)/Microsoft Visual Studio/2017/Community/MSBuild/15.0/Bin/MSBuild.exe
to get the value of VCTargetsPath:
Microsoft (R) Build Engine version 15.1.1012.6693
Copyright (C) Microsoft Corporation. All rights reserved.
Build started 17/10/2018 18:15:47.
Project "C:\Users\jasew\workspace\servo\target\debug\build\heartbeats-simple-sys-4a4f65e2c478996b\out\build\CMakeFiles\3.10.1\VCTargetsPath.vcxproj" on node 1 (default targets).
C:\Program Files (x86)\MSBuild\Microsoft.Cpp\v4.0\v140\Microsoft.Cpp.Platform.targets(57,5): error MSB8020: The build tools for v141 (Platform Toolset = 'v141') cannot be found. To build using the v141 build tools, please install v141 build tools. Alternatively, you may upgrade to the current Visual Studio tools by selecting the Project menu or right-click the solution, and then selecting "Retarget solution". [C:\Users\jasew\workspace\servo\target\debug\build\heartbeats-simple-sys-4a4f65e2c478996b\out\build\CMakeFiles\3.10.1\VCTargetsPath.vcxproj]
Done Building Project "C:\Users\jasew\workspace\servo\target\debug\build\heartbeats-simple-sys-4a4f65e2c478996b\out\build\CMakeFiles\3.10.1\VCTargetsPath.vcxproj" (default targets) -- FAILED.
Build FAILED.
"C:\Users\jasew\workspace\servo\target\debug\build\heartbeats-simple-sys-4a4f65e2c478996b\out\build\CMakeFiles\3.10.1\VCTargetsPath.vcxproj" (default target) (1) ->
(PlatformPrepareForBuild target) ->
C:\Program Files (x86)\MSBuild\Microsoft.Cpp\v4.0\v140\Microsoft.Cpp.Platform.targets(57,5): error MSB8020: The build tools for v141 (Platform Toolset = 'v141') cannot be found. To build using the v141 build tools, please install v141 build tools. Alternatively, you may upgrade to the current Visual Studio tools by selecting the Project menu or right-click the solution, and then selecting "Retarget solution". [C:\Users\jasew\workspace\servo\target\debug\build\heartbeats-simple-sys-4a4f65e2c478996b\out\build\CMakeFiles\3.10.1\VCTargetsPath.vcxproj]
0 Warning(s)
1 Error(s)
Time Elapsed 00:00:00.51
Exit code: 1
thread 'main' panicked at '
command did not execute successfully, got: exit code: 1
build script failed, must exit now', C:\Users\jasew\.cargo\registry\src\github.com-1ecc6299db9ec823\cmake-0.1.29\src\lib.rs:632:5
stack backtrace:
0: std::sys::windows::backtrace::unwind_backtrace
at /rustc/8c4ad4e9e42f4bcbdbb784692b936c2462061abc\src/libstd\sys\windows\backtrace\mod.rs:91
1: std::sys_common::backtrace::print
at /rustc/8c4ad4e9e42f4bcbdbb784692b936c2462061abc\src/libstd\sys_common\backtrace.rs:59
2: std::panicking::default_hook::{{closure}}
at /rustc/8c4ad4e9e42f4bcbdbb784692b936c2462061abc\src/libstd\panicking.rs:211
3: std::panicking::default_hook
at /rustc/8c4ad4e9e42f4bcbdbb784692b936c2462061abc\src/libstd\panicking.rs:227
4: std::panicking::rust_panic_with_hook
at /rustc/8c4ad4e9e42f4bcbdbb784692b936c2462061abc\src/libstd\panicking.rs:476
5: std::panicking::continue_panic_fmt
at /rustc/8c4ad4e9e42f4bcbdbb784692b936c2462061abc\src/libstd\panicking.rs:390
6: std::panicking::begin_panic_fmt
at /rustc/8c4ad4e9e42f4bcbdbb784692b936c2462061abc\src/libstd\panicking.rs:345
7: cmake::fail
at C:\Users\jasew\.cargo\registry\src\github.com-1ecc6299db9ec823\cmake-0.1.29\src\lib.rs:632
8: cmake::run
at C:\Users\jasew\.cargo\registry\src\github.com-1ecc6299db9ec823\cmake-0.1.29\src\lib.rs:613
9: cmake::Config::build
at C:\Users\jasew\.cargo\registry\src\github.com-1ecc6299db9ec823\cmake-0.1.29\src\lib.rs:481
10: build_script_build::main
at .\build.rs:13
11: std::rt::lang_start::{{closure}}<()>
at \libstd\rt.rs:74
12: std::panicking::try::do_call<closure,i32>
at /rustc/8c4ad4e9e42f4bcbdbb784692b936c2462061abc\src/libstd\panicking.rs:310
13: panic_unwind::__rust_maybe_catch_panic
at /rustc/8c4ad4e9e42f4bcbdbb784692b936c2462061abc\src/libpanic_unwind\lib.rs:102
14: std::rt::lang_start_internal
at /rustc/8c4ad4e9e42f4bcbdbb784692b936c2462061abc\src/libstd\rt.rs:58
15: std::rt::lang_start<()>
at \libstd\rt.rs:74
16: main
17: __scrt_common_main_seh
at f:\dd\vctools\crt\vcstartup\src\startup\exe_common.inl:253
18: BaseThreadInitThunk
19: RtlUserThreadStart
warning: build failed, waiting for other jobs to finish...
warning: not embedding natvis: lld-link may not support the flag
warning: not embedding natvis: lld-link may not support the flag
warning: not embedding natvis: lld-link may not support the flag
error: build failed
Build FAILED in 0:00:17
Sign up for free to join this conversation on GitHub. Already have an account? Sign in to comment
You can’t perform that action at this time.