Skip to content

Instantly share code, notes, and snippets.

Embed
What would you like to do?
Build started 16.12.2015 09:45:17.
__________________________________________________
Project "/Users/jhf/Projects/Customer A (Project 1)/SampleApp/Droid/SampleApp.Droid.csproj" (SignAndroidPackage target(s)):
Target _BuildSdkCache:
Skipping target "_BuildSdkCache" because its outputs are up-to-date.
Target PrepareForBuild:
Configuration: Release Platform: AnyCPU
Target _GenerateAndroidAssetsDir:
No output files were specified for target _GenerateAndroidAssetsDir, skipping.
Target _ResolveMonoAndroidSdks:
MonoAndroid Tools: /Library/Frameworks/Xamarin.Android.framework/Versions/Current/lib/mandroid/
MonoAndroid Binaries: /Library/Frameworks/Xamarin.Android.framework/Versions/Current/bin/
Android Platform API level: 23
TargetFrameworkVersion: v6.0
Android NDK: /Users/jhf/Library/Developer/Xamarin/android-ndk/android-ndk-r10d/
Android SDK: /Users/jhf/Library/Developer/Xamarin/android-sdk-mac_x86/
Android SDK Build Tools: /Users/jhf/Library/Developer/Xamarin/android-sdk-mac_x86/build-tools/23.0.1/
Java SDK: /usr/
Target _ValidateAndroidPackageProperties:
PackageName: com.companyname.sampleapp
Target _ResolveLibraryProjectImports:
Skipping target "_ResolveLibraryProjectImports" because its outputs are up-to-date.
Target _BuildLibraryImportsCache:
Skipping target "_BuildLibraryImportsCache" because its outputs are up-to-date.
Target _BuildAdditionalResourcesCache:
Skipping target "_BuildAdditionalResourcesCache" because its outputs are up-to-date.
Target _CreateAdditionalResourceCache:
Skipping target "_CreateAdditionalResourceCache" because its outputs are up-to-date.
Target _GenerateAndroidResourceDir:
Skipping target "_GenerateAndroidResourceDir" because its outputs are up-to-date.
Target _UpdateAndroidResgen:
Skipping target "_UpdateAndroidResgen" because its outputs are up-to-date.
Target _GenerateJavaDesignerForComponent:
No input files were specified for target _GenerateJavaDesignerForComponent, skipping.
Target GenerateSatelliteAssemblies:
No input files were specified for target GenerateSatelliteAssemblies, skipping.
Target _CoreXamlG:
No input files were specified for target _CoreXamlG, skipping.
Target GenerateTargetFrameworkMonikerAttribute:
Skipping target "GenerateTargetFrameworkMonikerAttribute" because its outputs are up-to-date.
Target CoreCompile:
Skipping target "CoreCompile" because its outputs are up-to-date.
Target _ScanAssemblies:
Skipping target "_ScanAssemblies" because its outputs are up-to-date.
Target _CreateIntermediateAssembliesDir:
Skipping target "_CreateIntermediateAssembliesDir" because its outputs are up-to-date.
Target _CopyConfigFiles:
No output files were specified for target _CopyConfigFiles, skipping.
Target _CopyIntermediateAssemblies:
Skipping target "_CopyIntermediateAssemblies" because its outputs are up-to-date.
Target _ConvertPdbFiles:
No output files were specified for target _ConvertPdbFiles, skipping.
Target _CopyMdbFiles:
Skipping target "_CopyMdbFiles" because its outputs are up-to-date.
Target _StripEmbeddedLibraries:
Skipping target "_StripEmbeddedLibraries" because its outputs are up-to-date.
Target _LinkAssemblies:
Skipping target "_LinkAssemblies" because its outputs are up-to-date.
Target _GenerateJavaStubs:
Skipping target "_GenerateJavaStubs" because its outputs are up-to-date.
Target _AddStaticResources:
Skipping target "_AddStaticResources" because its outputs are up-to-date.
Target _GeneratePackageManagerJava:
Skipping target "_GeneratePackageManagerJava" because its outputs are up-to-date.
Target _CreateBaseApk:
Skipping target "_CreateBaseApk" because its outputs are up-to-date.
Target _CompileJava:
Skipping target "_CompileJava" because its outputs are up-to-date.
Target _CompileToDalvik:
Skipping target "_CompileToDalvik" because its outputs are up-to-date.
Target _RemoveRegisterAttribute:
Creating directory '/Users/jhf/Projects/Customer A (Project 1)/SampleApp/Droid/obj/Release/android/assets/shrunk'
Copying file from '/Users/jhf/Projects/Customer A (Project 1)/SampleApp/Droid/obj/Release/android/assets/System.dll' to '/Users/jhf/Projects/Customer A (Project 1)/SampleApp/Droid/obj/Release/android/assets/shrunk/System.dll'
Copying file from '/Users/jhf/Projects/Customer A (Project 1)/SampleApp/Droid/obj/Release/android/assets/System.Xml.dll' to '/Users/jhf/Projects/Customer A (Project 1)/SampleApp/Droid/obj/Release/android/assets/shrunk/System.Xml.dll'
Copying file from '/Users/jhf/Projects/Customer A (Project 1)/SampleApp/Droid/obj/Release/android/assets/Mono.Android.dll' to '/Users/jhf/Projects/Customer A (Project 1)/SampleApp/Droid/obj/Release/android/assets/shrunk/Mono.Android.dll'
Copying file from '/Users/jhf/Projects/Customer A (Project 1)/SampleApp/Droid/obj/Release/android/assets/System.Core.dll' to '/Users/jhf/Projects/Customer A (Project 1)/SampleApp/Droid/obj/Release/android/assets/shrunk/System.Core.dll'
Copying file from '/Users/jhf/Projects/Customer A (Project 1)/SampleApp/Droid/obj/Release/android/assets/mscorlib.dll' to '/Users/jhf/Projects/Customer A (Project 1)/SampleApp/Droid/obj/Release/android/assets/shrunk/mscorlib.dll'
Copying file from '/Users/jhf/Projects/Customer A (Project 1)/SampleApp/Droid/obj/Release/android/assets/System.Runtime.Serialization.dll' to '/Users/jhf/Projects/Customer A (Project 1)/SampleApp/Droid/obj/Release/android/assets/shrunk/System.Runtime.Serialization.dll'
Copying file from '/Users/jhf/Projects/Customer A (Project 1)/SampleApp/Droid/obj/Release/android/assets/System.Net.Http.dll' to '/Users/jhf/Projects/Customer A (Project 1)/SampleApp/Droid/obj/Release/android/assets/shrunk/System.Net.Http.dll'
Copying file from '/Users/jhf/Projects/Customer A (Project 1)/SampleApp/Droid/obj/Release/android/assets/System.ServiceModel.dll' to '/Users/jhf/Projects/Customer A (Project 1)/SampleApp/Droid/obj/Release/android/assets/shrunk/System.ServiceModel.dll'
Target _BuildApkEmbed:
[AOT] "/Users/jhf/Projects/Customer A (Project 1)/SampleApp/Droid/obj/Release/android/assets/SampleApp.Droid.dll"
[aot-compiler stderr] sh: -c: line 0: syntax error near unexpected token `('
[aot-compiler stderr] sh: -c: line 0: `"/Users/jhf/Library/Developer/Xamarin/android-ndk/android-ndk-r10d/toolchains/arm-linux-androideabi-4.9/prebuilt/darwin-x86_64/bin/arm-linux-androideabi-ld" -shared -o /Users/jhf/Projects/Customer A (Project 1)/SampleApp/Droid/obj/Release/aot/armeabi-v7a/libaot-SampleApp.Droid.dll.so.tmp /Users/jhf/Projects/Customer A (Project 1)/SampleApp/Droid/obj/Release/aot/armeabi-v7a/temp-llvm.o /var/folders/gh/x6k7g93s7897h_zk46p1kjs00000gn/T/mono_aot_CdzNpq.o /Users/jhf/Library/Developer/Xamarin/android-ndk/android-ndk-r10d/toolchains/arm-linux-androideabi-4.9/prebuilt/darwin-x86_64/lib/gcc/arm-linux-androideabi/4.9/libgcc.a /Users/jhf/Library/Developer/Xamarin/android-ndk/android-ndk-r10d/platforms/android-21/arch-arm/usr/lib/libc.so /Users/jhf/Library/Developer/Xamarin/android-ndk/android-ndk-r10d/platforms/android-21/arch-arm/usr/lib/libm.so'
[aot-compiler stderr] AOT of image /Users/jhf/Projects/Customer A (Project 1)/SampleApp/Droid/obj/Release/android/assets/SampleApp.Droid.dll failed.
[aot-compiler stdout] Mono Ahead of Time compiler - compiling assembly /Users/jhf/Projects/Customer A (Project 1)/SampleApp/Droid/obj/Release/android/assets/SampleApp.Droid.dll
[aot-compiler stdout] Executing opt: "/Library/Frameworks/Xamarin.Android.framework/Versions/Current/bin/opt" -f -targetlibinfo -no-aa -basicaa -notti -instcombine -simplifycfg -inline-cost -inline -sroa -domtree -early-cse -lazy-value-info -correlated-propagation -simplifycfg -instcombine -simplifycfg -reassociate -domtree -loops -loop-simplify -lcssa -loop-rotate -licm -lcssa -loop-unswitch -instcombine -scalar-evolution -loop-simplify -lcssa -indvars -loop-idiom -loop-deletion -loop-unroll -memdep -gvn -memdep -memcpyopt -sccp -instcombine -lazy-value-info -correlated-propagation -domtree -memdep -adce -simplifycfg -instcombine -strip-dead-prototypes -domtree -verify -o "/Users/jhf/Projects/Customer A (Project 1)/SampleApp/Droid/obj/Release/aot/armeabi-v7a/temp.opt.bc" "/Users/jhf/Projects/Customer A (Project 1)/SampleApp/Droid/obj/Release/aot/armeabi-v7a/temp.bc"
[aot-compiler stdout] Executing llc: "/Library/Frameworks/Xamarin.Android.framework/Versions/Current/bin/llc" -mattr=+vfp2,-neon,+d16 -asm-verbose=false -disable-gnu-eh-frame -enable-mono-eh-frame -mtriple=armv7-linux-gnueabi -mono-eh-frame-symbol=mono_aot_SampleApp_Droid_eh_frame -relocation-model=pic -filetype=obj -o "/Users/jhf/Projects/Customer A (Project 1)/SampleApp/Droid/obj/Release/aot/armeabi-v7a/temp-llvm.o" "/Users/jhf/Projects/Customer A (Project 1)/SampleApp/Droid/obj/Release/aot/armeabi-v7a/temp.opt.bc"
[aot-compiler stdout] Code: 0(0%) Info: 19(2%) Ex Info: 27(3%) Unwind Info: 0(0%) Class Info: 523(67%) PLT: 8(0%) GOT Info: 69(8%) Offsets: 135(17%) GOT: 52
[aot-compiler stdout] Compiled: 9/9 (100%), LLVM: 9 (100%), No GOT slots: 8 (88%), Direct calls: 0 (100%)
[aot-compiler stdout] Executing the native assembler: "/Users/jhf/Library/Developer/Xamarin/android-ndk/android-ndk-r10d/toolchains/arm-linux-androideabi-4.9/prebuilt/darwin-x86_64/bin/arm-linux-androideabi-as" -mfpu=vfp3 -o /var/folders/gh/x6k7g93s7897h_zk46p1kjs00000gn/T/mono_aot_CdzNpq.o /var/folders/gh/x6k7g93s7897h_zk46p1kjs00000gn/T/mono_aot_CdzNpq
[aot-compiler stdout] Executing the native linker: "/Users/jhf/Library/Developer/Xamarin/android-ndk/android-ndk-r10d/toolchains/arm-linux-androideabi-4.9/prebuilt/darwin-x86_64/bin/arm-linux-androideabi-ld" -shared -o /Users/jhf/Projects/Customer A (Project 1)/SampleApp/Droid/obj/Release/aot/armeabi-v7a/libaot-SampleApp.Droid.dll.so.tmp /Users/jhf/Projects/Customer A (Project 1)/SampleApp/Droid/obj/Release/aot/armeabi-v7a/temp-llvm.o /var/folders/gh/x6k7g93s7897h_zk46p1kjs00000gn/T/mono_aot_CdzNpq.o /Users/jhf/Library/Developer/Xamarin/android-ndk/android-ndk-r10d/toolchains/arm-linux-androideabi-4.9/prebuilt/darwin-x86_64/lib/gcc/arm-linux-androideabi/4.9/libgcc.a /Users/jhf/Library/Developer/Xamarin/android-ndk/android-ndk-r10d/platforms/android-21/arch-arm/usr/lib/libc.so /Users/jhf/Library/Developer/Xamarin/android-ndk/android-ndk-r10d/platforms/android-21/arch-arm/usr/lib/libm.so
: error XA3001: Could not AOT the assembly: /Users/jhf/Projects/Customer A (Project 1)/SampleApp/Droid/obj/Release/android/assets/SampleApp.Droid.dll
Task "Aot" execution -- FAILED
Done building target "_BuildApkEmbed" in project "/Users/jhf/Projects/Customer A (Project 1)/SampleApp/Droid/SampleApp.Droid.csproj".-- FAILED
Done building project "/Users/jhf/Projects/Customer A (Project 1)/SampleApp/Droid/SampleApp.Droid.csproj".-- FAILED
Build FAILED.
Errors:
/Users/jhf/Projects/Customer A (Project 1)/SampleApp/Droid/SampleApp.Droid.csproj (SignAndroidPackage) ->
/Library/Frameworks/Mono.framework/External/xbuild/Xamarin/Android/Xamarin.Android.Common.targets (_BuildApkEmbed target) ->
: error XA3001: Could not AOT the assembly: /Users/jhf/Projects/Customer A (Project 1)/SampleApp/Droid/obj/Release/android/assets/SampleApp.Droid.dll
0 Warning(s)
1 Error(s)
Time Elapsed 00:00:01.5113840
Package creation failed.
Sign up for free to join this conversation on GitHub. Already have an account? Sign in to comment