Skip to content

Instantly share code, notes, and snippets.

Embed
What would you like to do?
specs result for dynjs
bestPractice/Sbp_12.5_A9_T3 failed in non-strict mode as expected
bestPractice/Sbp_12.6.1_A13_T3 failed in non-strict mode as expected
bestPractice/Sbp_12.6.2_A13_T3 failed in non-strict mode as expected
bestPractice/Sbp_12.6.4_A13_T3 failed in non-strict mode as expected
=== bestPractice/Sbp_7.8.4_A6.1_T4 was expected to fail in non-strict mode, but didn't ===
=== bestPractice/Sbp_7.8.4_A6.2_T1 was expected to fail in non-strict mode, but didn't ===
=== bestPractice/Sbp_7.8.4_A6.2_T2 was expected to fail in non-strict mode, but didn't ===
=== bestPractice/Sbp_7.9_A9_T3 failed in non-strict mode ===
--- errors ---
Exception in thread "main" org.dynjs.parser.SyntaxError: /var/folders/vt/nrnb_cw95ps51fgmm9rq2mpw0000gn/T/test262-Lyte7s.js line 2180:16 no viable alternative at input 'true'
at org.dynjs.runtime.DynJS.parseSourceCode(DynJS.java:188)
at org.dynjs.runtime.DynJS.parseSourceCode(DynJS.java:176)
at org.dynjs.runtime.DynJS.compile(DynJS.java:151)
at org.dynjs.runtime.DynJS.execute(DynJS.java:89)
at org.dynjs.runtime.DynJS.execute(DynJS.java:80)
at org.dynjs.runtime.DynJS.execute(DynJS.java:76)
at org.dynjs.cli.Main.executeFile(Main.java:73)
at org.dynjs.cli.Main.run(Main.java:60)
at org.dynjs.cli.Main.main(Main.java:46)
===
=== bestPractice/Sbp_7.9_A9_T4 failed in non-strict mode ===
--- errors ---
Exception in thread "main" org.antlr.runtime.tree.RewriteEmptyStreamException: rule statement
at org.antlr.runtime.tree.RewriteRuleElementStream._next(RewriteRuleElementStream.java:157)
at org.antlr.runtime.tree.RewriteRuleElementStream.nextTree(RewriteRuleElementStream.java:144)
at org.dynjs.parser.ES3Parser.doStatement(ES3Parser.java:7566)
at org.dynjs.parser.ES3Parser.iterationStatement(ES3Parser.java:7389)
at org.dynjs.parser.ES3Parser.statementTail(ES3Parser.java:6355)
at org.dynjs.parser.ES3Parser.statement(ES3Parser.java:6219)
at org.dynjs.parser.ES3Parser.sourceElement(ES3Parser.java:10672)
at org.dynjs.parser.ES3Parser.program(ES3Parser.java:10590)
at org.dynjs.runtime.DynJS.parseSourceCode(DynJS.java:185)
at org.dynjs.runtime.DynJS.parseSourceCode(DynJS.java:176)
at org.dynjs.runtime.DynJS.compile(DynJS.java:151)
at org.dynjs.runtime.DynJS.execute(DynJS.java:89)
at org.dynjs.runtime.DynJS.execute(DynJS.java:80)
at org.dynjs.runtime.DynJS.execute(DynJS.java:76)
at org.dynjs.cli.Main.executeFile(Main.java:73)
at org.dynjs.cli.Main.run(Main.java:60)
at org.dynjs.cli.Main.main(Main.java:46)
===
bestPractice/Sbp_A10_T1 passed in non-strict mode
bestPractice/Sbp_A10_T2 passed in non-strict mode
bestPractice/Sbp_A1_T1 failed in strict mode as expected
bestPractice/Sbp_A2_T1 failed in strict mode as expected
bestPractice/Sbp_A2_T2 failed in strict mode as expected
bestPractice/Sbp_A3_T1 failed in strict mode as expected
bestPractice/Sbp_A3_T2 failed in strict mode as expected
bestPractice/Sbp_A4_T1 failed in strict mode as expected
bestPractice/Sbp_A4_T2 failed in strict mode as expected
bestPractice/Sbp_A5_T1 failed in strict mode as expected
bestPractice/Sbp_A5_T2 failed in strict mode as expected
ch06/6.1 passed in non-strict mode
ch07/7.2/S7.2_A1.1_T1 passed in non-strict mode
ch07/7.2/S7.2_A1.1_T2 passed in non-strict mode
=== ch07/7.2/S7.2_A1.2_T1 failed in non-strict mode ===
--- errors ---
Exception in thread "main" org.dynjs.exception.ThrowException: ReferenceError: v1v is not defined
at <global>.<eval>(<eval>:1)
at org.dynjs.runtime.Reference.getValue(Reference.java:47)
at org.dynjs.runtime.Types.getValue(Types.java:347)
at org.dynjs.gen.Program3.execute(Unknown Source)
at org.dynjs.runtime.ExecutionContext.execute(ExecutionContext.java:122)
at org.dynjs.runtime.DynJS.execute(DynJS.java:101)
at org.dynjs.runtime.DynJS.execute(DynJS.java:95)
at org.dynjs.runtime.DynJS.evaluate(DynJS.java:123)
at org.dynjs.runtime.builtins.Eval.call(Eval.java:36)
at org.dynjs.runtime.AbstractNativeFunction.call(AbstractNativeFunction.java:62)
at org.dynjs.runtime.ExecutionContext.call(ExecutionContext.java:139)
at org.dynjs.gen.Program0.execute(Unknown Source)
at org.dynjs.runtime.ExecutionContext.execute(ExecutionContext.java:122)
at org.dynjs.runtime.DynJS.execute(DynJS.java:90)
at org.dynjs.runtime.DynJS.execute(DynJS.java:80)
at org.dynjs.runtime.DynJS.execute(DynJS.java:76)
at org.dynjs.cli.Main.executeFile(Main.java:73)
at org.dynjs.cli.Main.run(Main.java:60)
at org.dynjs.cli.Main.main(Main.java:46)
===
=== ch07/7.2/S7.2_A1.2_T2 failed in non-strict mode ===
--- errors ---
Exception in thread "main" org.dynjs.exception.ThrowException: ReferenceError: v1 is not defined
at <global>.<eval>(<eval>:1)
at org.dynjs.runtime.Reference.getValue(Reference.java:47)
at org.dynjs.runtime.Types.getValue(Types.java:347)
at org.dynjs.gen.Program1.execute(Unknown Source)
at org.dynjs.runtime.ExecutionContext.execute(ExecutionContext.java:122)
at org.dynjs.runtime.DynJS.execute(DynJS.java:101)
at org.dynjs.runtime.DynJS.execute(DynJS.java:95)
at org.dynjs.runtime.DynJS.evaluate(DynJS.java:123)
at org.dynjs.runtime.builtins.Eval.call(Eval.java:36)
at org.dynjs.runtime.AbstractNativeFunction.call(AbstractNativeFunction.java:62)
at org.dynjs.runtime.ExecutionContext.call(ExecutionContext.java:139)
at org.dynjs.gen.Program0.execute(Unknown Source)
at org.dynjs.runtime.ExecutionContext.execute(ExecutionContext.java:122)
at org.dynjs.runtime.DynJS.execute(DynJS.java:90)
at org.dynjs.runtime.DynJS.execute(DynJS.java:80)
at org.dynjs.runtime.DynJS.execute(DynJS.java:76)
at org.dynjs.cli.Main.executeFile(Main.java:73)
at org.dynjs.cli.Main.run(Main.java:60)
at org.dynjs.cli.Main.main(Main.java:46)
===
ch07/7.2/S7.2_A1.3_T1 passed in non-strict mode
ch07/7.2/S7.2_A1.3_T2 passed in non-strict mode
ch07/7.2/S7.2_A1.4_T1 passed in non-strict mode
ch07/7.2/S7.2_A1.4_T2 passed in non-strict mode
ch07/7.2/S7.2_A1.5_T1 passed in non-strict mode
ch07/7.2/S7.2_A1.5_T2 passed in non-strict mode
ch07/7.2/S7.2_A2.1_T1 passed in non-strict mode
ch07/7.2/S7.2_A2.1_T2 passed in non-strict mode
ch07/7.2/S7.2_A2.2_T1 passed in non-strict mode
ch07/7.2/S7.2_A2.2_T2 passed in non-strict mode
ch07/7.2/S7.2_A2.3_T1 passed in non-strict mode
ch07/7.2/S7.2_A2.3_T2 passed in non-strict mode
ch07/7.2/S7.2_A2.4_T1 passed in non-strict mode
ch07/7.2/S7.2_A2.4_T2 passed in non-strict mode
ch07/7.2/S7.2_A2.5_T1 passed in non-strict mode
ch07/7.2/S7.2_A2.5_T2 passed in non-strict mode
ch07/7.2/S7.2_A3.1_T1 passed in non-strict mode
ch07/7.2/S7.2_A3.1_T2 passed in non-strict mode
ch07/7.2/S7.2_A3.2_T1 passed in non-strict mode
ch07/7.2/S7.2_A3.2_T2 passed in non-strict mode
ch07/7.2/S7.2_A3.3_T1 passed in non-strict mode
ch07/7.2/S7.2_A3.3_T2 passed in non-strict mode
ch07/7.2/S7.2_A3.4_T1 passed in non-strict mode
ch07/7.2/S7.2_A3.4_T2 passed in non-strict mode
ch07/7.2/S7.2_A3.5_T1 passed in non-strict mode
ch07/7.2/S7.2_A3.5_T2 passed in non-strict mode
ch07/7.2/S7.2_A4.1_T1 passed in non-strict mode
ch07/7.2/S7.2_A4.1_T2 passed in non-strict mode
ch07/7.2/S7.2_A4.2_T1 passed in non-strict mode
ch07/7.2/S7.2_A4.2_T2 passed in non-strict mode
ch07/7.2/S7.2_A4.3_T1 passed in non-strict mode
ch07/7.2/S7.2_A4.3_T2 passed in non-strict mode
ch07/7.2/S7.2_A4.4_T1 passed in non-strict mode
ch07/7.2/S7.2_A4.4_T2 passed in non-strict mode
ch07/7.2/S7.2_A4.5_T1 passed in non-strict mode
ch07/7.2/S7.2_A4.5_T2 passed in non-strict mode
ch07/7.2/S7.2_A5_T1 failed in non-strict mode as expected
ch07/7.2/S7.2_A5_T2 failed in non-strict mode as expected
ch07/7.2/S7.2_A5_T3 failed in non-strict mode as expected
ch07/7.2/S7.2_A5_T4 failed in non-strict mode as expected
ch07/7.2/S7.2_A5_T5 failed in non-strict mode as expected
ch07/7.3/7.3-1 passed in non-strict mode
=== ch07/7.3/7.3-10 failed in non-strict mode ===
--- errors ---
Exception in thread "main" org.dynjs.exception.ThrowException: Test case returned non-true value!
at <global>.testFailed(/var/folders/vt/nrnb_cw95ps51fgmm9rq2mpw0000gn/T/test262-KsxDlU.js:289)
at <global>.$ERROR(/var/folders/vt/nrnb_cw95ps51fgmm9rq2mpw0000gn/T/test262-KsxDlU.js:305)
at <global>.runTestCase(/var/folders/vt/nrnb_cw95ps51fgmm9rq2mpw0000gn/T/test262-KsxDlU.js:902)
at <global>.<eval>(<eval>:1)
at org.dynjs.gen.Function13.call(Unknown Source)
at org.dynjs.runtime.ExecutionContext.call(ExecutionContext.java:139)
at org.dynjs.gen.Function17.call(Unknown Source)
at org.dynjs.runtime.ExecutionContext.call(ExecutionContext.java:139)
at org.dynjs.gen.ThenBlock22.call(Unknown Source)
at org.dynjs.gen.Function47.call(Unknown Source)
at org.dynjs.runtime.ExecutionContext.call(ExecutionContext.java:139)
at org.dynjs.gen.Program0.execute(Unknown Source)
at org.dynjs.runtime.ExecutionContext.execute(ExecutionContext.java:122)
at org.dynjs.runtime.DynJS.execute(DynJS.java:90)
at org.dynjs.runtime.DynJS.execute(DynJS.java:80)
at org.dynjs.runtime.DynJS.execute(DynJS.java:76)
at org.dynjs.cli.Main.executeFile(Main.java:73)
at org.dynjs.cli.Main.run(Main.java:60)
at org.dynjs.cli.Main.main(Main.java:46)
===
ch07/7.3/7.3-11 passed in non-strict mode
ch07/7.3/7.3-12 passed in non-strict mode
ch07/7.3/7.3-13 passed in non-strict mode
ch07/7.3/7.3-14 passed in non-strict mode
ch07/7.3/7.3-15 passed in non-strict mode
ch07/7.3/7.3-2 passed in non-strict mode
ch07/7.3/7.3-3 passed in non-strict mode
ch07/7.3/7.3-4 passed in non-strict mode
ch07/7.3/7.3-5 passed in non-strict mode
ch07/7.3/7.3-6 passed in non-strict mode
ch07/7.3/7.3-7 passed in non-strict mode
ch07/7.3/7.3-8 passed in non-strict mode
=== ch07/7.3/7.3-9 failed in non-strict mode ===
--- errors ---
Exception in thread "main" org.dynjs.exception.ThrowException: Test case returned non-true value!
at <global>.testFailed(/var/folders/vt/nrnb_cw95ps51fgmm9rq2mpw0000gn/T/test262-bd5jPv.js:289)
at <global>.$ERROR(/var/folders/vt/nrnb_cw95ps51fgmm9rq2mpw0000gn/T/test262-bd5jPv.js:305)
at <global>.runTestCase(/var/folders/vt/nrnb_cw95ps51fgmm9rq2mpw0000gn/T/test262-bd5jPv.js:902)
at <global>.<eval>(<eval>:1)
at org.dynjs.gen.Function13.call(Unknown Source)
at org.dynjs.runtime.ExecutionContext.call(ExecutionContext.java:139)
at org.dynjs.gen.Function17.call(Unknown Source)
at org.dynjs.runtime.ExecutionContext.call(ExecutionContext.java:139)
at org.dynjs.gen.ThenBlock22.call(Unknown Source)
at org.dynjs.gen.Function47.call(Unknown Source)
at org.dynjs.runtime.ExecutionContext.call(ExecutionContext.java:139)
at org.dynjs.gen.Program0.execute(Unknown Source)
at org.dynjs.runtime.ExecutionContext.execute(ExecutionContext.java:122)
at org.dynjs.runtime.DynJS.execute(DynJS.java:90)
at org.dynjs.runtime.DynJS.execute(DynJS.java:80)
at org.dynjs.runtime.DynJS.execute(DynJS.java:76)
at org.dynjs.cli.Main.executeFile(Main.java:73)
at org.dynjs.cli.Main.run(Main.java:60)
at org.dynjs.cli.Main.main(Main.java:46)
===
ch07/7.3/S7.3_A1.1_T1 passed in non-strict mode
ch07/7.3/S7.3_A1.1_T2 passed in non-strict mode
ch07/7.3/S7.3_A1.2_T1 passed in non-strict mode
ch07/7.3/S7.3_A1.2_T2 passed in non-strict mode
ch07/7.3/S7.3_A1.3 passed in non-strict mode
ch07/7.3/S7.3_A1.4 passed in non-strict mode
ch07/7.3/S7.3_A2.1_T1 failed in non-strict mode as expected
ch07/7.3/S7.3_A2.1_T2 failed in non-strict mode as expected
ch07/7.3/S7.3_A2.2_T1 failed in non-strict mode as expected
ch07/7.3/S7.3_A2.2_T2 failed in non-strict mode as expected
ch07/7.3/S7.3_A2.3 failed in non-strict mode as expected
ch07/7.3/S7.3_A2.4 failed in non-strict mode as expected
ch07/7.3/S7.3_A3.1_T1 failed in non-strict mode as expected
ch07/7.3/S7.3_A3.1_T2 failed in non-strict mode as expected
ch07/7.3/S7.3_A3.1_T3 failed in non-strict mode as expected
ch07/7.3/S7.3_A3.2_T1 failed in non-strict mode as expected
ch07/7.3/S7.3_A3.2_T2 failed in non-strict mode as expected
ch07/7.3/S7.3_A3.2_T3 failed in non-strict mode as expected
ch07/7.3/S7.3_A3.3_T1 failed in non-strict mode as expected
ch07/7.3/S7.3_A3.3_T2 failed in non-strict mode as expected
ch07/7.3/S7.3_A3.4_T1 failed in non-strict mode as expected
ch07/7.3/S7.3_A3.4_T2 failed in non-strict mode as expected
ch07/7.3/S7.3_A4_T1 passed in non-strict mode
ch07/7.3/S7.3_A4_T2 passed in non-strict mode
ch07/7.3/S7.3_A4_T3 passed in non-strict mode
ch07/7.3/S7.3_A4_T4 passed in non-strict mode
ch07/7.3/S7.3_A5.1_T1 passed in non-strict mode
ch07/7.3/S7.3_A5.1_T2 passed in non-strict mode
ch07/7.3/S7.3_A5.2_T1 passed in non-strict mode
ch07/7.3/S7.3_A5.2_T2 passed in non-strict mode
ch07/7.3/S7.3_A5.3 passed in non-strict mode
ch07/7.3/S7.3_A5.4 passed in non-strict mode
ch07/7.3/S7.3_A6_T1 failed in non-strict mode as expected
ch07/7.3/S7.3_A6_T2 failed in non-strict mode as expected
ch07/7.3/S7.3_A6_T3 failed in non-strict mode as expected
ch07/7.3/S7.3_A6_T4 failed in non-strict mode as expected
ch07/7.3/S7.3_A7_T1 passed in non-strict mode
ch07/7.3/S7.3_A7_T2 passed in non-strict mode
ch07/7.3/S7.3_A7_T3 passed in non-strict mode
ch07/7.3/S7.3_A7_T4 passed in non-strict mode
ch07/7.3/S7.3_A7_T5 passed in non-strict mode
ch07/7.3/S7.3_A7_T6 passed in non-strict mode
ch07/7.3/S7.3_A7_T7 passed in non-strict mode
ch07/7.3/S7.3_A7_T8 passed in non-strict mode
ch07/7.4/S7.4_A1_T1 passed in non-strict mode
ch07/7.4/S7.4_A1_T2 passed in non-strict mode
ch07/7.4/S7.4_A2_T1 passed in non-strict mode
=== ch07/7.4/S7.4_A2_T2 was expected to fail in non-strict mode, but didn't ===
=== ch07/7.4/S7.4_A3 was expected to fail in non-strict mode, but didn't ===
ch07/7.4/S7.4_A4_T1 failed in non-strict mode as expected
ch07/7.4/S7.4_A4_T2 passed in non-strict mode
ch07/7.4/S7.4_A4_T3 passed in non-strict mode
ch07/7.4/S7.4_A4_T4 failed in non-strict mode as expected
ch07/7.4/S7.4_A4_T5 passed in non-strict mode
ch07/7.4/S7.4_A4_T6 passed in non-strict mode
ch07/7.4/S7.4_A4_T7 passed in non-strict mode
ch07/7.4/S7.4_A5 passed in non-strict mode
ch07/7.4/S7.4_A6 passed in non-strict mode
ch07/7.6/7.6-1 passed in non-strict mode
ch07/7.6/7.6-10 passed in non-strict mode
ch07/7.6/7.6-11 passed in non-strict mode
ch07/7.6/7.6-12 passed in non-strict mode
ch07/7.6/7.6-13 passed in non-strict mode
ch07/7.6/7.6-14 passed in non-strict mode
ch07/7.6/7.6-15 passed in non-strict mode
ch07/7.6/7.6-16 passed in non-strict mode
ch07/7.6/7.6-17 passed in non-strict mode
ch07/7.6/7.6-18 passed in non-strict mode
ch07/7.6/7.6-19 passed in non-strict mode
ch07/7.6/7.6-2 passed in non-strict mode
ch07/7.6/7.6-20 passed in non-strict mode
ch07/7.6/7.6-21 passed in non-strict mode
ch07/7.6/7.6-22 passed in non-strict mode
ch07/7.6/7.6-23 passed in non-strict mode
ch07/7.6/7.6-24 passed in non-strict mode
ch07/7.6/7.6-25 passed in non-strict mode
ch07/7.6/7.6-26 passed in non-strict mode
ch07/7.6/7.6-27 passed in non-strict mode
ch07/7.6/7.6-28 passed in non-strict mode
ch07/7.6/7.6-29 passed in non-strict mode
ch07/7.6/7.6-3 passed in non-strict mode
ch07/7.6/7.6-30 passed in non-strict mode
ch07/7.6/7.6-31 passed in non-strict mode
ch07/7.6/7.6-32 passed in non-strict mode
ch07/7.6/7.6-33 passed in non-strict mode
ch07/7.6/7.6-34 passed in non-strict mode
ch07/7.6/7.6-35 passed in non-strict mode
ch07/7.6/7.6-36 passed in non-strict mode
ch07/7.6/7.6-4 passed in non-strict mode
ch07/7.6/7.6-5 passed in non-strict mode
ch07/7.6/7.6-6 passed in non-strict mode
ch07/7.6/7.6-7 passed in non-strict mode
ch07/7.6/7.6-8 passed in non-strict mode
ch07/7.6/7.6-9 passed in non-strict mode
ch07/7.6/S7.6_A1.2_T1 passed in non-strict mode
=== ch07/7.6/S7.6_A1.2_T2 failed in non-strict mode ===
--- errors ---
Exception in thread "main" org.dynjs.exception.ThrowException: ReferenceError: $ is not defined
at <global>.<eval>(/var/folders/vt/nrnb_cw95ps51fgmm9rq2mpw0000gn/T/test262-L3RGcQ.js:2179)
at org.dynjs.runtime.Reference.getValue(Reference.java:47)
at org.dynjs.runtime.Types.getValue(Types.java:347)
at org.dynjs.gen.Program0.execute(Unknown Source)
at org.dynjs.runtime.ExecutionContext.execute(ExecutionContext.java:122)
at org.dynjs.runtime.DynJS.execute(DynJS.java:90)
at org.dynjs.runtime.DynJS.execute(DynJS.java:80)
at org.dynjs.runtime.DynJS.execute(DynJS.java:76)
at org.dynjs.cli.Main.executeFile(Main.java:73)
at org.dynjs.cli.Main.run(Main.java:60)
at org.dynjs.cli.Main.main(Main.java:46)
===
ch07/7.6/S7.6_A1.2_T3 passed in non-strict mode
ch07/7.6/S7.6_A1.3_T1 passed in non-strict mode
=== ch07/7.6/S7.6_A1.3_T2 failed in non-strict mode ===
--- errors ---
Exception in thread "main" org.dynjs.exception.ThrowException: ReferenceError: _ is not defined
at <global>.<eval>(/var/folders/vt/nrnb_cw95ps51fgmm9rq2mpw0000gn/T/test262-GL56E4.js:2179)
at org.dynjs.runtime.Reference.getValue(Reference.java:47)
at org.dynjs.runtime.Types.getValue(Types.java:347)
at org.dynjs.gen.Program0.execute(Unknown Source)
at org.dynjs.runtime.ExecutionContext.execute(ExecutionContext.java:122)
at org.dynjs.runtime.DynJS.execute(DynJS.java:90)
at org.dynjs.runtime.DynJS.execute(DynJS.java:80)
at org.dynjs.runtime.DynJS.execute(DynJS.java:76)
at org.dynjs.cli.Main.executeFile(Main.java:73)
at org.dynjs.cli.Main.run(Main.java:60)
at org.dynjs.cli.Main.main(Main.java:46)
===
ch07/7.6/S7.6_A1.3_T3 passed in non-strict mode
=== ch07/7.6/S7.6_A2.1_T1 failed in non-strict mode ===
--- errors ---
Exception in thread "main" org.dynjs.exception.ThrowException: #6.2: var \u0078x = 1; xx === 6. Actual: 3
at <global>.testFailed(/var/folders/vt/nrnb_cw95ps51fgmm9rq2mpw0000gn/T/test262-UYF_4U.js:289)
at <global>.$ERROR(/var/folders/vt/nrnb_cw95ps51fgmm9rq2mpw0000gn/T/test262-UYF_4U.js:305)
at <global>.<eval>(<eval>:2239)
at org.dynjs.gen.Function13.call(Unknown Source)
at org.dynjs.runtime.ExecutionContext.call(ExecutionContext.java:139)
at org.dynjs.gen.Function17.call(Unknown Source)
at org.dynjs.runtime.ExecutionContext.call(ExecutionContext.java:139)
at org.dynjs.gen.CatchBlock28.call(Unknown Source)
at org.dynjs.runtime.ExecutionContext.executeCatch(ExecutionContext.java:235)
at org.dynjs.gen.Program0.execute(Unknown Source)
at org.dynjs.runtime.ExecutionContext.execute(ExecutionContext.java:122)
at org.dynjs.runtime.DynJS.execute(DynJS.java:90)
at org.dynjs.runtime.DynJS.execute(DynJS.java:80)
at org.dynjs.runtime.DynJS.execute(DynJS.java:76)
at org.dynjs.cli.Main.executeFile(Main.java:73)
at org.dynjs.cli.Main.run(Main.java:60)
at org.dynjs.cli.Main.main(Main.java:46)
===
=== ch07/7.6/S7.6_A2.1_T2 failed in non-strict mode ===
--- errors ---
Exception in thread "main" org.dynjs.exception.ThrowException: #6.2: var \u0078$ = 1; x$ === 6. Actual: 2
at <global>.testFailed(/var/folders/vt/nrnb_cw95ps51fgmm9rq2mpw0000gn/T/test262-sYuRvB.js:289)
at <global>.$ERROR(/var/folders/vt/nrnb_cw95ps51fgmm9rq2mpw0000gn/T/test262-sYuRvB.js:305)
at <global>.<eval>(<eval>:2239)
at org.dynjs.gen.Function13.call(Unknown Source)
at org.dynjs.runtime.ExecutionContext.call(ExecutionContext.java:139)
at org.dynjs.gen.Function17.call(Unknown Source)
at org.dynjs.runtime.ExecutionContext.call(ExecutionContext.java:139)
at org.dynjs.gen.CatchBlock28.call(Unknown Source)
at org.dynjs.runtime.ExecutionContext.executeCatch(ExecutionContext.java:235)
at org.dynjs.gen.Program0.execute(Unknown Source)
at org.dynjs.runtime.ExecutionContext.execute(ExecutionContext.java:122)
at org.dynjs.runtime.DynJS.execute(DynJS.java:90)
at org.dynjs.runtime.DynJS.execute(DynJS.java:80)
at org.dynjs.runtime.DynJS.execute(DynJS.java:76)
at org.dynjs.cli.Main.executeFile(Main.java:73)
at org.dynjs.cli.Main.run(Main.java:60)
at org.dynjs.cli.Main.main(Main.java:46)
===
=== ch07/7.6/S7.6_A2.1_T3 failed in non-strict mode ===
--- errors ---
Exception in thread "main" org.dynjs.exception.ThrowException: #6.2: var \u0078_ = 1; x_ === 6. Actual: 2
at <global>.testFailed(/var/folders/vt/nrnb_cw95ps51fgmm9rq2mpw0000gn/T/test262-LQa4JN.js:289)
at <global>.$ERROR(/var/folders/vt/nrnb_cw95ps51fgmm9rq2mpw0000gn/T/test262-LQa4JN.js:305)
at <global>.<eval>(<eval>:2239)
at org.dynjs.gen.Function13.call(Unknown Source)
at org.dynjs.runtime.ExecutionContext.call(ExecutionContext.java:139)
at org.dynjs.gen.Function17.call(Unknown Source)
at org.dynjs.runtime.ExecutionContext.call(ExecutionContext.java:139)
at org.dynjs.gen.CatchBlock28.call(Unknown Source)
at org.dynjs.runtime.ExecutionContext.executeCatch(ExecutionContext.java:235)
at org.dynjs.gen.Program0.execute(Unknown Source)
at org.dynjs.runtime.ExecutionContext.execute(ExecutionContext.java:122)
at org.dynjs.runtime.DynJS.execute(DynJS.java:90)
at org.dynjs.runtime.DynJS.execute(DynJS.java:80)
at org.dynjs.runtime.DynJS.execute(DynJS.java:76)
at org.dynjs.cli.Main.executeFile(Main.java:73)
at org.dynjs.cli.Main.run(Main.java:60)
at org.dynjs.cli.Main.main(Main.java:46)
===
=== ch07/7.6/S7.6_A2.1_T4 failed in non-strict mode ===
--- errors ---
Exception in thread "main" org.dynjs.exception.ThrowException: ReferenceError: xx is not defined
at <global>.<eval>(/var/folders/vt/nrnb_cw95ps51fgmm9rq2mpw0000gn/T/test262-CHWIjh.js:2184)
at org.dynjs.runtime.Reference.getValue(Reference.java:47)
at org.dynjs.runtime.Types.getValue(Types.java:347)
at org.dynjs.gen.CatchBlock21.call(Unknown Source)
at org.dynjs.runtime.ExecutionContext.executeCatch(ExecutionContext.java:235)
at org.dynjs.gen.Program0.execute(Unknown Source)
at org.dynjs.runtime.ExecutionContext.execute(ExecutionContext.java:122)
at org.dynjs.runtime.DynJS.execute(DynJS.java:90)
at org.dynjs.runtime.DynJS.execute(DynJS.java:80)
at org.dynjs.runtime.DynJS.execute(DynJS.java:76)
at org.dynjs.cli.Main.executeFile(Main.java:73)
at org.dynjs.cli.Main.run(Main.java:60)
at org.dynjs.cli.Main.main(Main.java:46)
===
=== ch07/7.6/S7.6_A4.1_T1 failed in non-strict mode ===
--- errors ---
Exception in thread "main" org.dynjs.exception.ThrowException: ReferenceError: A is not defined
at <global>.<eval>(/var/folders/vt/nrnb_cw95ps51fgmm9rq2mpw0000gn/T/test262-Q8l029.js:2179)
at org.dynjs.runtime.Reference.getValue(Reference.java:47)
at org.dynjs.runtime.Types.getValue(Types.java:347)
at org.dynjs.gen.Program0.execute(Unknown Source)
at org.dynjs.runtime.ExecutionContext.execute(ExecutionContext.java:122)
at org.dynjs.runtime.DynJS.execute(DynJS.java:90)
at org.dynjs.runtime.DynJS.execute(DynJS.java:80)
at org.dynjs.runtime.DynJS.execute(DynJS.java:76)
at org.dynjs.cli.Main.executeFile(Main.java:73)
at org.dynjs.cli.Main.run(Main.java:60)
at org.dynjs.cli.Main.main(Main.java:46)
===
=== ch07/7.6/S7.6_A4.1_T2 failed in non-strict mode ===
--- errors ---
Exception in thread "main" org.dynjs.exception.ThrowException: ReferenceError: a is not defined
at <global>.<eval>(/var/folders/vt/nrnb_cw95ps51fgmm9rq2mpw0000gn/T/test262-mdV8o4.js:2179)
at org.dynjs.runtime.Reference.getValue(Reference.java:47)
at org.dynjs.runtime.Types.getValue(Types.java:347)
at org.dynjs.gen.Program0.execute(Unknown Source)
at org.dynjs.runtime.ExecutionContext.execute(ExecutionContext.java:122)
at org.dynjs.runtime.DynJS.execute(DynJS.java:90)
at org.dynjs.runtime.DynJS.execute(DynJS.java:80)
at org.dynjs.runtime.DynJS.execute(DynJS.java:76)
at org.dynjs.cli.Main.executeFile(Main.java:73)
at org.dynjs.cli.Main.run(Main.java:60)
at org.dynjs.cli.Main.main(Main.java:46)
===
=== ch07/7.6/S7.6_A4.2_T1 failed in non-strict mode ===
--- errors ---
Exception in thread "main" org.dynjs.exception.ThrowException: ReferenceError: А is not defined
at <global>.<eval>(/var/folders/vt/nrnb_cw95ps51fgmm9rq2mpw0000gn/T/test262-NDz3Eb.js:2179)
at org.dynjs.runtime.Reference.getValue(Reference.java:47)
at org.dynjs.runtime.Types.getValue(Types.java:347)
at org.dynjs.gen.Program0.execute(Unknown Source)
at org.dynjs.runtime.ExecutionContext.execute(ExecutionContext.java:122)
at org.dynjs.runtime.DynJS.execute(DynJS.java:90)
at org.dynjs.runtime.DynJS.execute(DynJS.java:80)
at org.dynjs.runtime.DynJS.execute(DynJS.java:76)
at org.dynjs.cli.Main.executeFile(Main.java:73)
at org.dynjs.cli.Main.run(Main.java:60)
at org.dynjs.cli.Main.main(Main.java:46)
===
=== ch07/7.6/S7.6_A4.2_T2 failed in non-strict mode ===
--- errors ---
Exception in thread "main" org.dynjs.exception.ThrowException: ReferenceError: а is not defined
at <global>.<eval>(/var/folders/vt/nrnb_cw95ps51fgmm9rq2mpw0000gn/T/test262-kueLQj.js:2179)
at org.dynjs.runtime.Reference.getValue(Reference.java:47)
at org.dynjs.runtime.Types.getValue(Types.java:347)
at org.dynjs.gen.Program0.execute(Unknown Source)
at org.dynjs.runtime.ExecutionContext.execute(ExecutionContext.java:122)
at org.dynjs.runtime.DynJS.execute(DynJS.java:90)
at org.dynjs.runtime.DynJS.execute(DynJS.java:80)
at org.dynjs.runtime.DynJS.execute(DynJS.java:76)
at org.dynjs.cli.Main.executeFile(Main.java:73)
at org.dynjs.cli.Main.run(Main.java:60)
at org.dynjs.cli.Main.main(Main.java:46)
===
=== ch07/7.6/S7.6_A4.3_T1 failed in non-strict mode ===
--- errors ---
Exception in thread "main" org.dynjs.exception.ThrowException: ReferenceError: $0 is not defined
at <global>.<eval>(/var/folders/vt/nrnb_cw95ps51fgmm9rq2mpw0000gn/T/test262-eI_dKt.js:2179)
at org.dynjs.runtime.Reference.getValue(Reference.java:47)
at org.dynjs.runtime.Types.getValue(Types.java:347)
at org.dynjs.gen.Program0.execute(Unknown Source)
at org.dynjs.runtime.ExecutionContext.execute(ExecutionContext.java:122)
at org.dynjs.runtime.DynJS.execute(DynJS.java:90)
at org.dynjs.runtime.DynJS.execute(DynJS.java:80)
at org.dynjs.runtime.DynJS.execute(DynJS.java:76)
at org.dynjs.cli.Main.executeFile(Main.java:73)
at org.dynjs.cli.Main.run(Main.java:60)
at org.dynjs.cli.Main.main(Main.java:46)
===
=== ch07/7.6/7.6.1/7.6.1-1-1 failed in non-strict mode ===
--- errors ---
Exception in thread "main" org.dynjs.parser.SyntaxError: /var/folders/vt/nrnb_cw95ps51fgmm9rq2mpw0000gn/T/test262-_yWH0o.js line 2179:12 mismatched input 'null' expecting RBRACE
/var/folders/vt/nrnb_cw95ps51fgmm9rq2mpw0000gn/T/test262-_yWH0o.js line 2179:16 no viable alternative at input ':'
/var/folders/vt/nrnb_cw95ps51fgmm9rq2mpw0000gn/T/test262-_yWH0o.js line 2180:16 no viable alternative at input ':'
/var/folders/vt/nrnb_cw95ps51fgmm9rq2mpw0000gn/T/test262-_yWH0o.js line 2181:17 no viable alternative at input ':'
at org.dynjs.runtime.DynJS.parseSourceCode(DynJS.java:188)
at org.dynjs.runtime.DynJS.parseSourceCode(DynJS.java:176)
at org.dynjs.runtime.DynJS.compile(DynJS.java:151)
at org.dynjs.runtime.DynJS.execute(DynJS.java:89)
at org.dynjs.runtime.DynJS.execute(DynJS.java:80)
at org.dynjs.runtime.DynJS.execute(DynJS.java:76)
at org.dynjs.cli.Main.executeFile(Main.java:73)
at org.dynjs.cli.Main.run(Main.java:60)
at org.dynjs.cli.Main.main(Main.java:46)
===
=== ch07/7.6/7.6.1/7.6.1-1-10 failed in non-strict mode ===
--- errors ---
Exception in thread "main" org.dynjs.parser.SyntaxError: /var/folders/vt/nrnb_cw95ps51fgmm9rq2mpw0000gn/T/test262-chtPSw.js line 2179:12 missing RBRACE at 'in'
/var/folders/vt/nrnb_cw95ps51fgmm9rq2mpw0000gn/T/test262-chtPSw.js line 2179:14 no viable alternative at input ':'
/var/folders/vt/nrnb_cw95ps51fgmm9rq2mpw0000gn/T/test262-chtPSw.js line 2180:12 no viable alternative at input 'try'
/var/folders/vt/nrnb_cw95ps51fgmm9rq2mpw0000gn/T/test262-chtPSw.js line 2180:15 mismatched input ':' expecting LBRACE
/var/folders/vt/nrnb_cw95ps51fgmm9rq2mpw0000gn/T/test262-chtPSw.js line 2181:12 no viable alternative at input 'class'
at org.dynjs.runtime.DynJS.parseSourceCode(DynJS.java:188)
at org.dynjs.runtime.DynJS.parseSourceCode(DynJS.java:176)
at org.dynjs.runtime.DynJS.compile(DynJS.java:151)
at org.dynjs.runtime.DynJS.execute(DynJS.java:89)
at org.dynjs.runtime.DynJS.execute(DynJS.java:80)
at org.dynjs.runtime.DynJS.execute(DynJS.java:76)
at org.dynjs.cli.Main.executeFile(Main.java:73)
at org.dynjs.cli.Main.run(Main.java:60)
at org.dynjs.cli.Main.main(Main.java:46)
===
=== ch07/7.6/7.6.1/7.6.1-1-11 failed in non-strict mode ===
--- errors ---
Exception in thread "main" org.dynjs.parser.SyntaxError: /var/folders/vt/nrnb_cw95ps51fgmm9rq2mpw0000gn/T/test262-GCZ44Q.js line 2179:12 mismatched input 'enum' expecting RBRACE
/var/folders/vt/nrnb_cw95ps51fgmm9rq2mpw0000gn/T/test262-GCZ44Q.js line 2180:12 no viable alternative at input 'extends'
/var/folders/vt/nrnb_cw95ps51fgmm9rq2mpw0000gn/T/test262-GCZ44Q.js line 2181:12 no viable alternative at input 'super'
at org.dynjs.runtime.DynJS.parseSourceCode(DynJS.java:188)
at org.dynjs.runtime.DynJS.parseSourceCode(DynJS.java:176)
at org.dynjs.runtime.DynJS.compile(DynJS.java:151)
at org.dynjs.runtime.DynJS.execute(DynJS.java:89)
at org.dynjs.runtime.DynJS.execute(DynJS.java:80)
at org.dynjs.runtime.DynJS.execute(DynJS.java:76)
at org.dynjs.cli.Main.executeFile(Main.java:73)
at org.dynjs.cli.Main.run(Main.java:60)
at org.dynjs.cli.Main.main(Main.java:46)
===
=== ch07/7.6/7.6.1/7.6.1-1-12 failed in non-strict mode ===
--- errors ---
Exception in thread "main" org.dynjs.parser.SyntaxError: /var/folders/vt/nrnb_cw95ps51fgmm9rq2mpw0000gn/T/test262-JoWOiU.js line 2179:12 mismatched input 'const' expecting RBRACE
/var/folders/vt/nrnb_cw95ps51fgmm9rq2mpw0000gn/T/test262-JoWOiU.js line 2180:12 no viable alternative at input 'export'
/var/folders/vt/nrnb_cw95ps51fgmm9rq2mpw0000gn/T/test262-JoWOiU.js line 2181:12 no viable alternative at input 'import'
at org.dynjs.runtime.DynJS.parseSourceCode(DynJS.java:188)
at org.dynjs.runtime.DynJS.parseSourceCode(DynJS.java:176)
at org.dynjs.runtime.DynJS.compile(DynJS.java:151)
at org.dynjs.runtime.DynJS.execute(DynJS.java:89)
at org.dynjs.runtime.DynJS.execute(DynJS.java:80)
at org.dynjs.runtime.DynJS.execute(DynJS.java:76)
at org.dynjs.cli.Main.executeFile(Main.java:73)
at org.dynjs.cli.Main.run(Main.java:60)
at org.dynjs.cli.Main.main(Main.java:46)
===
ch07/7.6/7.6.1/7.6.1-1-13 passed in non-strict mode
ch07/7.6/7.6.1/7.6.1-1-14 passed in non-strict mode
ch07/7.6/7.6.1/7.6.1-1-15 passed in non-strict mode
ch07/7.6/7.6.1/7.6.1-1-16 passed in non-strict mode
=== ch07/7.6/7.6.1/7.6.1-1-2 failed in non-strict mode ===
--- errors ---
Exception in thread "main" org.dynjs.parser.SyntaxError: /var/folders/vt/nrnb_cw95ps51fgmm9rq2mpw0000gn/T/test262-m2ac0M.js line 2179:12 mismatched input 'break' expecting RBRACE
/var/folders/vt/nrnb_cw95ps51fgmm9rq2mpw0000gn/T/test262-m2ac0M.js line 2179:17 no viable alternative at input ':'
/var/folders/vt/nrnb_cw95ps51fgmm9rq2mpw0000gn/T/test262-m2ac0M.js line 2180:12 no viable alternative at input 'case'
/var/folders/vt/nrnb_cw95ps51fgmm9rq2mpw0000gn/T/test262-m2ac0M.js line 2181:12 no viable alternative at input 'do'
/var/folders/vt/nrnb_cw95ps51fgmm9rq2mpw0000gn/T/test262-m2ac0M.js line 2181:14 no viable alternative at input ':'
at org.dynjs.runtime.DynJS.parseSourceCode(DynJS.java:188)
at org.dynjs.runtime.DynJS.parseSourceCode(DynJS.java:176)
at org.dynjs.runtime.DynJS.compile(DynJS.java:151)
at org.dynjs.runtime.DynJS.execute(DynJS.java:89)
at org.dynjs.runtime.DynJS.execute(DynJS.java:80)
at org.dynjs.runtime.DynJS.execute(DynJS.java:76)
at org.dynjs.cli.Main.executeFile(Main.java:73)
at org.dynjs.cli.Main.run(Main.java:60)
at org.dynjs.cli.Main.main(Main.java:46)
===
=== ch07/7.6/7.6.1/7.6.1-1-3 failed in non-strict mode ===
--- errors ---
Exception in thread "main" org.dynjs.parser.SyntaxError: /var/folders/vt/nrnb_cw95ps51fgmm9rq2mpw0000gn/T/test262-AOnqsN.js line 2179:12 missing RBRACE at 'instanceof'
/var/folders/vt/nrnb_cw95ps51fgmm9rq2mpw0000gn/T/test262-AOnqsN.js line 2179:22 no viable alternative at input ':'
/var/folders/vt/nrnb_cw95ps51fgmm9rq2mpw0000gn/T/test262-AOnqsN.js line 2180:18 no viable alternative at input ':'
/var/folders/vt/nrnb_cw95ps51fgmm9rq2mpw0000gn/T/test262-AOnqsN.js line 2181:12 no viable alternative at input 'else'
at org.dynjs.runtime.DynJS.parseSourceCode(DynJS.java:188)
at org.dynjs.runtime.DynJS.parseSourceCode(DynJS.java:176)
at org.dynjs.runtime.DynJS.compile(DynJS.java:151)
at org.dynjs.runtime.DynJS.execute(DynJS.java:89)
at org.dynjs.runtime.DynJS.execute(DynJS.java:80)
at org.dynjs.runtime.DynJS.execute(DynJS.java:76)
at org.dynjs.cli.Main.executeFile(Main.java:73)
at org.dynjs.cli.Main.run(Main.java:60)
at org.dynjs.cli.Main.main(Main.java:46)
===
=== ch07/7.6/7.6.1/7.6.1-1-4 failed in non-strict mode ===
--- errors ---
Exception in thread "main" org.dynjs.parser.SyntaxError: /var/folders/vt/nrnb_cw95ps51fgmm9rq2mpw0000gn/T/test262-GulHj3.js line 2179:12 mismatched input 'new' expecting RBRACE
/var/folders/vt/nrnb_cw95ps51fgmm9rq2mpw0000gn/T/test262-GulHj3.js line 2179:15 no viable alternative at input ':'
/var/folders/vt/nrnb_cw95ps51fgmm9rq2mpw0000gn/T/test262-GulHj3.js line 2180:12 no viable alternative at input 'var'
/var/folders/vt/nrnb_cw95ps51fgmm9rq2mpw0000gn/T/test262-GulHj3.js line 2180:15 mismatched input ':' expecting Identifier
/var/folders/vt/nrnb_cw95ps51fgmm9rq2mpw0000gn/T/test262-GulHj3.js line 2181:12 no viable alternative at input 'catch'
at org.dynjs.runtime.DynJS.parseSourceCode(DynJS.java:188)
at org.dynjs.runtime.DynJS.parseSourceCode(DynJS.java:176)
at org.dynjs.runtime.DynJS.compile(DynJS.java:151)
at org.dynjs.runtime.DynJS.execute(DynJS.java:89)
at org.dynjs.runtime.DynJS.execute(DynJS.java:80)
at org.dynjs.runtime.DynJS.execute(DynJS.java:76)
at org.dynjs.cli.Main.executeFile(Main.java:73)
at org.dynjs.cli.Main.run(Main.java:60)
at org.dynjs.cli.Main.main(Main.java:46)
===
=== ch07/7.6/7.6.1/7.6.1-1-5 failed in non-strict mode ===
--- errors ---
Exception in thread "main" org.dynjs.parser.SyntaxError: /var/folders/vt/nrnb_cw95ps51fgmm9rq2mpw0000gn/T/test262-PF2QLs.js line 2179:12 mismatched input 'finally' expecting RBRACE
/var/folders/vt/nrnb_cw95ps51fgmm9rq2mpw0000gn/T/test262-PF2QLs.js line 2180:12 no viable alternative at input 'return'
/var/folders/vt/nrnb_cw95ps51fgmm9rq2mpw0000gn/T/test262-PF2QLs.js line 2180:18 no viable alternative at input ':'
/var/folders/vt/nrnb_cw95ps51fgmm9rq2mpw0000gn/T/test262-PF2QLs.js line 2181:16 no viable alternative at input ':'
at org.dynjs.runtime.DynJS.parseSourceCode(DynJS.java:188)
at org.dynjs.runtime.DynJS.parseSourceCode(DynJS.java:176)
at org.dynjs.runtime.DynJS.compile(DynJS.java:151)
at org.dynjs.runtime.DynJS.execute(DynJS.java:89)
at org.dynjs.runtime.DynJS.execute(DynJS.java:80)
at org.dynjs.runtime.DynJS.execute(DynJS.java:76)
at org.dynjs.cli.Main.executeFile(Main.java:73)
at org.dynjs.cli.Main.run(Main.java:60)
at org.dynjs.cli.Main.main(Main.java:46)
===
=== ch07/7.6/7.6.1/7.6.1-1-6 failed in non-strict mode ===
--- errors ---
Exception in thread "main" org.dynjs.parser.SyntaxError: /var/folders/vt/nrnb_cw95ps51fgmm9rq2mpw0000gn/T/test262-k5ETMw.js line 2179:12 mismatched input 'continue' expecting RBRACE
/var/folders/vt/nrnb_cw95ps51fgmm9rq2mpw0000gn/T/test262-k5ETMw.js line 2179:20 no viable alternative at input ':'
/var/folders/vt/nrnb_cw95ps51fgmm9rq2mpw0000gn/T/test262-k5ETMw.js line 2180:12 no viable alternative at input 'for'
/var/folders/vt/nrnb_cw95ps51fgmm9rq2mpw0000gn/T/test262-k5ETMw.js line 2180:15 mismatched input ':' expecting LPAREN
/var/folders/vt/nrnb_cw95ps51fgmm9rq2mpw0000gn/T/test262-k5ETMw.js line 2181:12 no viable alternative at input 'switch'
/var/folders/vt/nrnb_cw95ps51fgmm9rq2mpw0000gn/T/test262-k5ETMw.js line 2181:18 mismatched input ':' expecting LPAREN
at org.dynjs.runtime.DynJS.parseSourceCode(DynJS.java:188)
at org.dynjs.runtime.DynJS.parseSourceCode(DynJS.java:176)
at org.dynjs.runtime.DynJS.compile(DynJS.java:151)
at org.dynjs.runtime.DynJS.execute(DynJS.java:89)
at org.dynjs.runtime.DynJS.execute(DynJS.java:80)
at org.dynjs.runtime.DynJS.execute(DynJS.java:76)
at org.dynjs.cli.Main.executeFile(Main.java:73)
at org.dynjs.cli.Main.run(Main.java:60)
at org.dynjs.cli.Main.main(Main.java:46)
===
=== ch07/7.6/7.6.1/7.6.1-1-7 failed in non-strict mode ===
--- errors ---
Exception in thread "main" org.dynjs.parser.SyntaxError: /var/folders/vt/nrnb_cw95ps51fgmm9rq2mpw0000gn/T/test262-RAT9f6.js line 2179:12 mismatched input 'while' expecting RBRACE
/var/folders/vt/nrnb_cw95ps51fgmm9rq2mpw0000gn/T/test262-RAT9f6.js line 2179:17 mismatched input ':' expecting LPAREN
/var/folders/vt/nrnb_cw95ps51fgmm9rq2mpw0000gn/T/test262-RAT9f6.js line 2180:12 no viable alternative at input 'debugger'
/var/folders/vt/nrnb_cw95ps51fgmm9rq2mpw0000gn/T/test262-RAT9f6.js line 2181:20 mismatched input ':' expecting LPAREN
at org.dynjs.runtime.DynJS.parseSourceCode(DynJS.java:188)
at org.dynjs.runtime.DynJS.parseSourceCode(DynJS.java:176)
at org.dynjs.runtime.DynJS.compile(DynJS.java:151)
at org.dynjs.runtime.DynJS.execute(DynJS.java:89)
at org.dynjs.runtime.DynJS.execute(DynJS.java:80)
at org.dynjs.runtime.DynJS.execute(DynJS.java:76)
at org.dynjs.cli.Main.executeFile(Main.java:73)
at org.dynjs.cli.Main.run(Main.java:60)
at org.dynjs.cli.Main.main(Main.java:46)
===
=== ch07/7.6/7.6.1/7.6.1-1-8 failed in non-strict mode ===
--- errors ---
Exception in thread "main" org.dynjs.parser.SyntaxError: /var/folders/vt/nrnb_cw95ps51fgmm9rq2mpw0000gn/T/test262-V0v3X8.js line 2179:12 mismatched input 'this' expecting RBRACE
/var/folders/vt/nrnb_cw95ps51fgmm9rq2mpw0000gn/T/test262-V0v3X8.js line 2179:16 no viable alternative at input ':'
/var/folders/vt/nrnb_cw95ps51fgmm9rq2mpw0000gn/T/test262-V0v3X8.js line 2180:12 no viable alternative at input 'with'
/var/folders/vt/nrnb_cw95ps51fgmm9rq2mpw0000gn/T/test262-V0v3X8.js line 2180:16 mismatched input ':' expecting LPAREN
/var/folders/vt/nrnb_cw95ps51fgmm9rq2mpw0000gn/T/test262-V0v3X8.js line 2181:12 no viable alternative at input 'default'
at org.dynjs.runtime.DynJS.parseSourceCode(DynJS.java:188)
at org.dynjs.runtime.DynJS.parseSourceCode(DynJS.java:176)
at org.dynjs.runtime.DynJS.compile(DynJS.java:151)
at org.dynjs.runtime.DynJS.execute(DynJS.java:89)
at org.dynjs.runtime.DynJS.execute(DynJS.java:80)
at org.dynjs.runtime.DynJS.execute(DynJS.java:76)
at org.dynjs.cli.Main.executeFile(Main.java:73)
at org.dynjs.cli.Main.run(Main.java:60)
at org.dynjs.cli.Main.main(Main.java:46)
===
=== ch07/7.6/7.6.1/7.6.1-1-9 failed in non-strict mode ===
--- errors ---
Exception in thread "main" org.dynjs.parser.SyntaxError: /var/folders/vt/nrnb_cw95ps51fgmm9rq2mpw0000gn/T/test262-yY6aSr.js line 2179:12 mismatched input 'if' expecting RBRACE
/var/folders/vt/nrnb_cw95ps51fgmm9rq2mpw0000gn/T/test262-yY6aSr.js line 2179:14 mismatched input ':' expecting LPAREN
/var/folders/vt/nrnb_cw95ps51fgmm9rq2mpw0000gn/T/test262-yY6aSr.js line 2180:12 no viable alternative at input 'throw'
/var/folders/vt/nrnb_cw95ps51fgmm9rq2mpw0000gn/T/test262-yY6aSr.js line 2180:17 no viable alternative at input ':'
/var/folders/vt/nrnb_cw95ps51fgmm9rq2mpw0000gn/T/test262-yY6aSr.js line 2181:18 no viable alternative at input ':'
at org.dynjs.runtime.DynJS.parseSourceCode(DynJS.java:188)
at org.dynjs.runtime.DynJS.parseSourceCode(DynJS.java:176)
at org.dynjs.runtime.DynJS.compile(DynJS.java:151)
at org.dynjs.runtime.DynJS.execute(DynJS.java:89)
at org.dynjs.runtime.DynJS.execute(DynJS.java:80)
at org.dynjs.runtime.DynJS.execute(DynJS.java:76)
at org.dynjs.cli.Main.executeFile(Main.java:73)
at org.dynjs.cli.Main.run(Main.java:60)
at org.dynjs.cli.Main.main(Main.java:46)
===
=== ch07/7.6/7.6.1/7.6.1-2-1 failed in non-strict mode ===
--- errors ---
Exception in thread "main" org.dynjs.parser.SyntaxError: /var/folders/vt/nrnb_cw95ps51fgmm9rq2mpw0000gn/T/test262-EMFoaQ.js line 2179:19 mismatched input 'null' expecting Identifier
/var/folders/vt/nrnb_cw95ps51fgmm9rq2mpw0000gn/T/test262-EMFoaQ.js line 2180:16 mismatched input 'true' expecting Identifier
/var/folders/vt/nrnb_cw95ps51fgmm9rq2mpw0000gn/T/test262-EMFoaQ.js line 2181:16 mismatched input 'false' expecting Identifier
at org.dynjs.runtime.DynJS.parseSourceCode(DynJS.java:188)
at org.dynjs.runtime.DynJS.parseSourceCode(DynJS.java:176)
at org.dynjs.runtime.DynJS.compile(DynJS.java:151)
at org.dynjs.runtime.DynJS.execute(DynJS.java:89)
at org.dynjs.runtime.DynJS.execute(DynJS.java:80)
at org.dynjs.runtime.DynJS.execute(DynJS.java:76)
at org.dynjs.cli.Main.executeFile(Main.java:73)
at org.dynjs.cli.Main.run(Main.java:60)
at org.dynjs.cli.Main.main(Main.java:46)
===
=== ch07/7.6/7.6.1/7.6.1-2-10 failed in non-strict mode ===
--- errors ---
Exception in thread "main" org.dynjs.parser.SyntaxError: /var/folders/vt/nrnb_cw95ps51fgmm9rq2mpw0000gn/T/test262-nDMtUq.js line 2179:19 missing Identifier at 'in'
/var/folders/vt/nrnb_cw95ps51fgmm9rq2mpw0000gn/T/test262-nDMtUq.js line 2179:22 no viable alternative at input '='
/var/folders/vt/nrnb_cw95ps51fgmm9rq2mpw0000gn/T/test262-nDMtUq.js line 2180:19 mismatched input 'try' expecting Identifier
/var/folders/vt/nrnb_cw95ps51fgmm9rq2mpw0000gn/T/test262-nDMtUq.js line 2181:19 mismatched input 'class' expecting Identifier
at org.dynjs.runtime.DynJS.parseSourceCode(DynJS.java:188)
at org.dynjs.runtime.DynJS.parseSourceCode(DynJS.java:176)
at org.dynjs.runtime.DynJS.compile(DynJS.java:151)
at org.dynjs.runtime.DynJS.execute(DynJS.java:89)
at org.dynjs.runtime.DynJS.execute(DynJS.java:80)
at org.dynjs.runtime.DynJS.execute(DynJS.java:76)
at org.dynjs.cli.Main.executeFile(Main.java:73)
at org.dynjs.cli.Main.run(Main.java:60)
at org.dynjs.cli.Main.main(Main.java:46)
===
=== ch07/7.6/7.6.1/7.6.1-2-11 failed in non-strict mode ===
--- errors ---
Exception in thread "main" org.dynjs.parser.SyntaxError: /var/folders/vt/nrnb_cw95ps51fgmm9rq2mpw0000gn/T/test262-gtD7Ao.js line 2179:19 mismatched input 'enum' expecting Identifier
/var/folders/vt/nrnb_cw95ps51fgmm9rq2mpw0000gn/T/test262-gtD7Ao.js line 2180:19 mismatched input 'extends' expecting Identifier
/var/folders/vt/nrnb_cw95ps51fgmm9rq2mpw0000gn/T/test262-gtD7Ao.js line 2181:19 mismatched input 'super' expecting Identifier
at org.dynjs.runtime.DynJS.parseSourceCode(DynJS.java:188)
at org.dynjs.runtime.DynJS.parseSourceCode(DynJS.java:176)
at org.dynjs.runtime.DynJS.compile(DynJS.java:151)
at org.dynjs.runtime.DynJS.execute(DynJS.java:89)
at org.dynjs.runtime.DynJS.execute(DynJS.java:80)
at org.dynjs.runtime.DynJS.execute(DynJS.java:76)
at org.dynjs.cli.Main.executeFile(Main.java:73)
at org.dynjs.cli.Main.run(Main.java:60)
at org.dynjs.cli.Main.main(Main.java:46)
===
=== ch07/7.6/7.6.1/7.6.1-2-12 failed in non-strict mode ===
--- errors ---
Exception in thread "main" org.dynjs.parser.SyntaxError: /var/folders/vt/nrnb_cw95ps51fgmm9rq2mpw0000gn/T/test262-_h6IZI.js line 2179:19 mismatched input 'const' expecting Identifier
/var/folders/vt/nrnb_cw95ps51fgmm9rq2mpw0000gn/T/test262-_h6IZI.js line 2180:19 mismatched input 'export' expecting Identifier
/var/folders/vt/nrnb_cw95ps51fgmm9rq2mpw0000gn/T/test262-_h6IZI.js line 2181:19 mismatched input 'import' expecting Identifier
at org.dynjs.runtime.DynJS.parseSourceCode(DynJS.java:188)
at org.dynjs.runtime.DynJS.parseSourceCode(DynJS.java:176)
at org.dynjs.runtime.DynJS.compile(DynJS.java:151)
at org.dynjs.runtime.DynJS.execute(DynJS.java:89)
at org.dynjs.runtime.DynJS.execute(DynJS.java:80)
at org.dynjs.runtime.DynJS.execute(DynJS.java:76)
at org.dynjs.cli.Main.executeFile(Main.java:73)
at org.dynjs.cli.Main.run(Main.java:60)
at org.dynjs.cli.Main.main(Main.java:46)
===
ch07/7.6/7.6.1/7.6.1-2-13 passed in non-strict mode
ch07/7.6/7.6.1/7.6.1-2-14 passed in non-strict mode
ch07/7.6/7.6.1/7.6.1-2-15 passed in non-strict mode
ch07/7.6/7.6.1/7.6.1-2-16 passed in non-strict mode
=== ch07/7.6/7.6.1/7.6.1-2-2 failed in non-strict mode ===
--- errors ---
Exception in thread "main" org.dynjs.parser.SyntaxError: /var/folders/vt/nrnb_cw95ps51fgmm9rq2mpw0000gn/T/test262-bXJBb3.js line 2179:19 mismatched input 'break' expecting Identifier
/var/folders/vt/nrnb_cw95ps51fgmm9rq2mpw0000gn/T/test262-bXJBb3.js line 2180:19 mismatched input 'case' expecting Identifier
/var/folders/vt/nrnb_cw95ps51fgmm9rq2mpw0000gn/T/test262-bXJBb3.js line 2181:19 mismatched input 'do' expecting Identifier
at org.dynjs.runtime.DynJS.parseSourceCode(DynJS.java:188)
at org.dynjs.runtime.DynJS.parseSourceCode(DynJS.java:176)
at org.dynjs.runtime.DynJS.compile(DynJS.java:151)
at org.dynjs.runtime.DynJS.execute(DynJS.java:89)
at org.dynjs.runtime.DynJS.execute(DynJS.java:80)
at org.dynjs.runtime.DynJS.execute(DynJS.java:76)
at org.dynjs.cli.Main.executeFile(Main.java:73)
at org.dynjs.cli.Main.run(Main.java:60)
at org.dynjs.cli.Main.main(Main.java:46)
===
=== ch07/7.6/7.6.1/7.6.1-2-3 failed in non-strict mode ===
--- errors ---
Exception in thread "main" org.dynjs.parser.SyntaxError: /var/folders/vt/nrnb_cw95ps51fgmm9rq2mpw0000gn/T/test262-vxFSXG.js line 2179:19 missing Identifier at 'instanceof'
/var/folders/vt/nrnb_cw95ps51fgmm9rq2mpw0000gn/T/test262-vxFSXG.js line 2179:30 no viable alternative at input '='
/var/folders/vt/nrnb_cw95ps51fgmm9rq2mpw0000gn/T/test262-vxFSXG.js line 2180:19 mismatched input 'typeof' expecting Identifier
/var/folders/vt/nrnb_cw95ps51fgmm9rq2mpw0000gn/T/test262-vxFSXG.js line 2181:19 mismatched input 'else' expecting Identifier
at org.dynjs.runtime.DynJS.parseSourceCode(DynJS.java:188)
at org.dynjs.runtime.DynJS.parseSourceCode(DynJS.java:176)
at org.dynjs.runtime.DynJS.compile(DynJS.java:151)
at org.dynjs.runtime.DynJS.execute(DynJS.java:89)
at org.dynjs.runtime.DynJS.execute(DynJS.java:80)
at org.dynjs.runtime.DynJS.execute(DynJS.java:76)
at org.dynjs.cli.Main.executeFile(Main.java:73)
at org.dynjs.cli.Main.run(Main.java:60)
at org.dynjs.cli.Main.main(Main.java:46)
===
=== ch07/7.6/7.6.1/7.6.1-2-4 failed in non-strict mode ===
--- errors ---
Exception in thread "main" org.dynjs.parser.SyntaxError: /var/folders/vt/nrnb_cw95ps51fgmm9rq2mpw0000gn/T/test262-jsHduS.js line 2179:19 mismatched input 'new' expecting Identifier
/var/folders/vt/nrnb_cw95ps51fgmm9rq2mpw0000gn/T/test262-jsHduS.js line 2180:19 mismatched input 'var' expecting Identifier
/var/folders/vt/nrnb_cw95ps51fgmm9rq2mpw0000gn/T/test262-jsHduS.js line 2181:19 mismatched input 'catch' expecting Identifier
at org.dynjs.runtime.DynJS.parseSourceCode(DynJS.java:188)
at org.dynjs.runtime.DynJS.parseSourceCode(DynJS.java:176)
at org.dynjs.runtime.DynJS.compile(DynJS.java:151)
at org.dynjs.runtime.DynJS.execute(DynJS.java:89)
at org.dynjs.runtime.DynJS.execute(DynJS.java:80)
at org.dynjs.runtime.DynJS.execute(DynJS.java:76)
at org.dynjs.cli.Main.executeFile(Main.java:73)
at org.dynjs.cli.Main.run(Main.java:60)
at org.dynjs.cli.Main.main(Main.java:46)
===
=== ch07/7.6/7.6.1/7.6.1-2-5 failed in non-strict mode ===
--- errors ---
Exception in thread "main" org.dynjs.parser.SyntaxError: /var/folders/vt/nrnb_cw95ps51fgmm9rq2mpw0000gn/T/test262-y3nwvt.js line 2179:19 mismatched input 'finally' expecting Identifier
/var/folders/vt/nrnb_cw95ps51fgmm9rq2mpw0000gn/T/test262-y3nwvt.js line 2180:19 mismatched input 'return' expecting Identifier
/var/folders/vt/nrnb_cw95ps51fgmm9rq2mpw0000gn/T/test262-y3nwvt.js line 2181:19 mismatched input 'void' expecting Identifier
at org.dynjs.runtime.DynJS.parseSourceCode(DynJS.java:188)
at org.dynjs.runtime.DynJS.parseSourceCode(DynJS.java:176)
at org.dynjs.runtime.DynJS.compile(DynJS.java:151)
at org.dynjs.runtime.DynJS.execute(DynJS.java:89)
at org.dynjs.runtime.DynJS.execute(DynJS.java:80)
at org.dynjs.runtime.DynJS.execute(DynJS.java:76)
at org.dynjs.cli.Main.executeFile(Main.java:73)
at org.dynjs.cli.Main.run(Main.java:60)
at org.dynjs.cli.Main.main(Main.java:46)
===
=== ch07/7.6/7.6.1/7.6.1-2-6 failed in non-strict mode ===
--- errors ---
Exception in thread "main" org.dynjs.parser.SyntaxError: /var/folders/vt/nrnb_cw95ps51fgmm9rq2mpw0000gn/T/test262-eSXF7k.js line 2179:19 mismatched input 'continue' expecting Identifier
/var/folders/vt/nrnb_cw95ps51fgmm9rq2mpw0000gn/T/test262-eSXF7k.js line 2180:19 mismatched input 'for' expecting Identifier
/var/folders/vt/nrnb_cw95ps51fgmm9rq2mpw0000gn/T/test262-eSXF7k.js line 2181:19 mismatched input 'switch' expecting Identifier
at org.dynjs.runtime.DynJS.parseSourceCode(DynJS.java:188)
at org.dynjs.runtime.DynJS.parseSourceCode(DynJS.java:176)
at org.dynjs.runtime.DynJS.compile(DynJS.java:151)
at org.dynjs.runtime.DynJS.execute(DynJS.java:89)
at org.dynjs.runtime.DynJS.execute(DynJS.java:80)
at org.dynjs.runtime.DynJS.execute(DynJS.java:76)
at org.dynjs.cli.Main.executeFile(Main.java:73)
at org.dynjs.cli.Main.run(Main.java:60)
at org.dynjs.cli.Main.main(Main.java:46)
===
=== ch07/7.6/7.6.1/7.6.1-2-7 failed in non-strict mode ===
--- errors ---
Exception in thread "main" org.dynjs.parser.SyntaxError: /var/folders/vt/nrnb_cw95ps51fgmm9rq2mpw0000gn/T/test262-EsRM1O.js line 2179:19 mismatched input 'while' expecting Identifier
/var/folders/vt/nrnb_cw95ps51fgmm9rq2mpw0000gn/T/test262-EsRM1O.js line 2180:19 mismatched input 'debugger' expecting Identifier
/var/folders/vt/nrnb_cw95ps51fgmm9rq2mpw0000gn/T/test262-EsRM1O.js line 2181:19 mismatched input 'function' expecting Identifier
at org.dynjs.runtime.DynJS.parseSourceCode(DynJS.java:188)
at org.dynjs.runtime.DynJS.parseSourceCode(DynJS.java:176)
at org.dynjs.runtime.DynJS.compile(DynJS.java:151)
at org.dynjs.runtime.DynJS.execute(DynJS.java:89)
at org.dynjs.runtime.DynJS.execute(DynJS.java:80)
at org.dynjs.runtime.DynJS.execute(DynJS.java:76)
at org.dynjs.cli.Main.executeFile(Main.java:73)
at org.dynjs.cli.Main.run(Main.java:60)
at org.dynjs.cli.Main.main(Main.java:46)
===
=== ch07/7.6/7.6.1/7.6.1-2-8 failed in non-strict mode ===
--- errors ---
Exception in thread "main" org.dynjs.parser.SyntaxError: /var/folders/vt/nrnb_cw95ps51fgmm9rq2mpw0000gn/T/test262-f9osMZ.js line 2179:19 mismatched input 'this' expecting Identifier
/var/folders/vt/nrnb_cw95ps51fgmm9rq2mpw0000gn/T/test262-f9osMZ.js line 2180:19 mismatched input 'with' expecting Identifier
/var/folders/vt/nrnb_cw95ps51fgmm9rq2mpw0000gn/T/test262-f9osMZ.js line 2181:19 mismatched input 'default' expecting Identifier
at org.dynjs.runtime.DynJS.parseSourceCode(DynJS.java:188)
at org.dynjs.runtime.DynJS.parseSourceCode(DynJS.java:176)
at org.dynjs.runtime.DynJS.compile(DynJS.java:151)
at org.dynjs.runtime.DynJS.execute(DynJS.java:89)
at org.dynjs.runtime.DynJS.execute(DynJS.java:80)
at org.dynjs.runtime.DynJS.execute(DynJS.java:76)
at org.dynjs.cli.Main.executeFile(Main.java:73)
at org.dynjs.cli.Main.run(Main.java:60)
at org.dynjs.cli.Main.main(Main.java:46)
===
=== ch07/7.6/7.6.1/7.6.1-2-9 failed in non-strict mode ===
--- errors ---
Exception in thread "main" org.dynjs.parser.SyntaxError: /var/folders/vt/nrnb_cw95ps51fgmm9rq2mpw0000gn/T/test262-ZpOfSe.js line 2179:19 mismatched input 'if' expecting Identifier
/var/folders/vt/nrnb_cw95ps51fgmm9rq2mpw0000gn/T/test262-ZpOfSe.js line 2180:19 mismatched input 'throw' expecting Identifier
/var/folders/vt/nrnb_cw95ps51fgmm9rq2mpw0000gn/T/test262-ZpOfSe.js line 2181:19 mismatched input 'delete' expecting Identifier
at org.dynjs.runtime.DynJS.parseSourceCode(DynJS.java:188)
at org.dynjs.runtime.DynJS.parseSourceCode(DynJS.java:176)
at org.dynjs.runtime.DynJS.compile(DynJS.java:151)
at org.dynjs.runtime.DynJS.execute(DynJS.java:89)
at org.dynjs.runtime.DynJS.execute(DynJS.java:80)
at org.dynjs.runtime.DynJS.execute(DynJS.java:76)
at org.dynjs.cli.Main.executeFile(Main.java:73)
at org.dynjs.cli.Main.run(Main.java:60)
at org.dynjs.cli.Main.main(Main.java:46)
===
ch07/7.6/7.6.1/7.6.1-3-1 passed in non-strict mode
ch07/7.6/7.6.1/7.6.1-3-10 passed in non-strict mode
ch07/7.6/7.6.1/7.6.1-3-11 passed in non-strict mode
ch07/7.6/7.6.1/7.6.1-3-12 passed in non-strict mode
ch07/7.6/7.6.1/7.6.1-3-13 passed in non-strict mode
ch07/7.6/7.6.1/7.6.1-3-14 passed in non-strict mode
ch07/7.6/7.6.1/7.6.1-3-15 passed in non-strict mode
ch07/7.6/7.6.1/7.6.1-3-16 passed in non-strict mode
ch07/7.6/7.6.1/7.6.1-3-2 passed in non-strict mode
ch07/7.6/7.6.1/7.6.1-3-3 passed in non-strict mode
ch07/7.6/7.6.1/7.6.1-3-4 passed in non-strict mode
ch07/7.6/7.6.1/7.6.1-3-5 passed in non-strict mode
ch07/7.6/7.6.1/7.6.1-3-6 passed in non-strict mode
ch07/7.6/7.6.1/7.6.1-3-7 passed in non-strict mode
ch07/7.6/7.6.1/7.6.1-3-8 passed in non-strict mode
ch07/7.6/7.6.1/7.6.1-3-9 passed in non-strict mode
=== ch07/7.6/7.6.1/7.6.1-4-1 failed in non-strict mode ===
--- errors ---
Exception in thread "main" org.dynjs.parser.SyntaxError: /var/folders/vt/nrnb_cw95ps51fgmm9rq2mpw0000gn/T/test262-1lkjmv.js line 2180:12 no viable alternative at input 'set'
/var/folders/vt/nrnb_cw95ps51fgmm9rq2mpw0000gn/T/test262-1lkjmv.js line 2180:28 no viable alternative at input '{'
/var/folders/vt/nrnb_cw95ps51fgmm9rq2mpw0000gn/T/test262-1lkjmv.js line 2182:13 mismatched input ',' expecting RBRACE
/var/folders/vt/nrnb_cw95ps51fgmm9rq2mpw0000gn/T/test262-1lkjmv.js line 2183:23 no viable alternative at input '{'
at org.dynjs.runtime.DynJS.parseSourceCode(DynJS.java:188)
at org.dynjs.runtime.DynJS.parseSourceCode(DynJS.java:176)
at org.dynjs.runtime.DynJS.compile(DynJS.java:151)
at org.dynjs.runtime.DynJS.execute(DynJS.java:89)
at org.dynjs.runtime.DynJS.execute(DynJS.java:80)
at org.dynjs.runtime.DynJS.execute(DynJS.java:76)
at org.dynjs.cli.Main.executeFile(Main.java:73)
at org.dynjs.cli.Main.run(Main.java:60)
at org.dynjs.cli.Main.main(Main.java:46)
===
=== ch07/7.6/7.6.1/7.6.1-4-10 failed in non-strict mode ===
--- errors ---
Exception in thread "main" org.dynjs.parser.SyntaxError: /var/folders/vt/nrnb_cw95ps51fgmm9rq2mpw0000gn/T/test262-lxbo1L.js line 2180:12 no viable alternative at input 'set'
/var/folders/vt/nrnb_cw95ps51fgmm9rq2mpw0000gn/T/test262-lxbo1L.js line 2180:25 no viable alternative at input '{'
/var/folders/vt/nrnb_cw95ps51fgmm9rq2mpw0000gn/T/test262-lxbo1L.js line 2182:13 mismatched input ',' expecting RBRACE
/var/folders/vt/nrnb_cw95ps51fgmm9rq2mpw0000gn/T/test262-lxbo1L.js line 2183:19 no viable alternative at input ')'
/var/folders/vt/nrnb_cw95ps51fgmm9rq2mpw0000gn/T/test262-lxbo1L.js line 2183:20 no viable alternative at input '{'
at org.dynjs.runtime.DynJS.parseSourceCode(DynJS.java:188)
at org.dynjs.runtime.DynJS.parseSourceCode(DynJS.java:176)
at org.dynjs.runtime.DynJS.compile(DynJS.java:151)
at org.dynjs.runtime.DynJS.execute(DynJS.java:89)
at org.dynjs.runtime.DynJS.execute(DynJS.java:80)
at org.dynjs.runtime.DynJS.execute(DynJS.java:76)
at org.dynjs.cli.Main.executeFile(Main.java:73)
at org.dynjs.cli.Main.run(Main.java:60)
at org.dynjs.cli.Main.main(Main.java:46)
===
=== ch07/7.6/7.6.1/7.6.1-4-11 failed in non-strict mode ===
--- errors ---
Exception in thread "main" org.dynjs.parser.SyntaxError: /var/folders/vt/nrnb_cw95ps51fgmm9rq2mpw0000gn/T/test262-i8rSNm.js line 2180:12 no viable alternative at input 'set'
/var/folders/vt/nrnb_cw95ps51fgmm9rq2mpw0000gn/T/test262-i8rSNm.js line 2180:27 no viable alternative at input '{'
/var/folders/vt/nrnb_cw95ps51fgmm9rq2mpw0000gn/T/test262-i8rSNm.js line 2182:13 mismatched input ',' expecting RBRACE
/var/folders/vt/nrnb_cw95ps51fgmm9rq2mpw0000gn/T/test262-i8rSNm.js line 2183:21 no viable alternative at input ')'
/var/folders/vt/nrnb_cw95ps51fgmm9rq2mpw0000gn/T/test262-i8rSNm.js line 2183:22 no viable alternative at input '{'
at org.dynjs.runtime.DynJS.parseSourceCode(DynJS.java:188)
at org.dynjs.runtime.DynJS.parseSourceCode(DynJS.java:176)
at org.dynjs.runtime.DynJS.compile(DynJS.java:151)
at org.dynjs.runtime.DynJS.execute(DynJS.java:89)
at org.dynjs.runtime.DynJS.execute(DynJS.java:80)
at org.dynjs.runtime.DynJS.execute(DynJS.java:76)
at org.dynjs.cli.Main.executeFile(Main.java:73)
at org.dynjs.cli.Main.run(Main.java:60)
at org.dynjs.cli.Main.main(Main.java:46)
===
=== ch07/7.6/7.6.1/7.6.1-4-12 failed in non-strict mode ===
--- errors ---
Exception in thread "main" org.dynjs.parser.SyntaxError: /var/folders/vt/nrnb_cw95ps51fgmm9rq2mpw0000gn/T/test262-RCiNNl.js line 2180:12 no viable alternative at input 'set'
/var/folders/vt/nrnb_cw95ps51fgmm9rq2mpw0000gn/T/test262-RCiNNl.js line 2180:28 no viable alternative at input '{'
/var/folders/vt/nrnb_cw95ps51fgmm9rq2mpw0000gn/T/test262-RCiNNl.js line 2182:13 mismatched input ',' expecting RBRACE
/var/folders/vt/nrnb_cw95ps51fgmm9rq2mpw0000gn/T/test262-RCiNNl.js line 2183:22 no viable alternative at input ')'
/var/folders/vt/nrnb_cw95ps51fgmm9rq2mpw0000gn/T/test262-RCiNNl.js line 2183:23 no viable alternative at input '{'
at org.dynjs.runtime.DynJS.parseSourceCode(DynJS.java:188)
at org.dynjs.runtime.DynJS.parseSourceCode(DynJS.java:176)
at org.dynjs.runtime.DynJS.compile(DynJS.java:151)
at org.dynjs.runtime.DynJS.execute(DynJS.java:89)
at org.dynjs.runtime.DynJS.execute(DynJS.java:80)
at org.dynjs.runtime.DynJS.execute(DynJS.java:76)
at org.dynjs.cli.Main.executeFile(Main.java:73)
at org.dynjs.cli.Main.run(Main.java:60)
at org.dynjs.cli.Main.main(Main.java:46)
===
ch07/7.6/7.6.1/7.6.1-4-13 passed in non-strict mode
ch07/7.6/7.6.1/7.6.1-4-14 passed in non-strict mode
ch07/7.6/7.6.1/7.6.1-4-15 passed in non-strict mode
ch07/7.6/7.6.1/7.6.1-4-16 passed in non-strict mode
=== ch07/7.6/7.6.1/7.6.1-4-2 failed in non-strict mode ===
--- errors ---
Exception in thread "main" org.dynjs.parser.SyntaxError: /var/folders/vt/nrnb_cw95ps51fgmm9rq2mpw0000gn/T/test262-zpzjP6.js line 2180:12 no viable alternative at input 'set'
/var/folders/vt/nrnb_cw95ps51fgmm9rq2mpw0000gn/T/test262-zpzjP6.js line 2180:28 no viable alternative at input '{'
/var/folders/vt/nrnb_cw95ps51fgmm9rq2mpw0000gn/T/test262-zpzjP6.js line 2182:13 mismatched input ',' expecting RBRACE
/var/folders/vt/nrnb_cw95ps51fgmm9rq2mpw0000gn/T/test262-zpzjP6.js line 2183:21 no viable alternative at input '('
/var/folders/vt/nrnb_cw95ps51fgmm9rq2mpw0000gn/T/test262-zpzjP6.js line 2183:22 no viable alternative at input ')'
/var/folders/vt/nrnb_cw95ps51fgmm9rq2mpw0000gn/T/test262-zpzjP6.js line 2183:23 no viable alternative at input '{'
at org.dynjs.runtime.DynJS.parseSourceCode(DynJS.java:188)
at org.dynjs.runtime.DynJS.parseSourceCode(DynJS.java:176)
at org.dynjs.runtime.DynJS.compile(DynJS.java:151)
at org.dynjs.runtime.DynJS.execute(DynJS.java:89)
at org.dynjs.runtime.DynJS.execute(DynJS.java:80)
at org.dynjs.runtime.DynJS.execute(DynJS.java:76)
at org.dynjs.cli.Main.executeFile(Main.java:73)
at org.dynjs.cli.Main.run(Main.java:60)
at org.dynjs.cli.Main.main(Main.java:46)
===
=== ch07/7.6/7.6.1/7.6.1-4-3 failed in non-strict mode ===
--- errors ---
Exception in thread "main" org.dynjs.parser.SyntaxError: /var/folders/vt/nrnb_cw95ps51fgmm9rq2mpw0000gn/T/test262-GU6ugH.js line 2180:12 no viable alternative at input 'set'
/var/folders/vt/nrnb_cw95ps51fgmm9rq2mpw0000gn/T/test262-GU6ugH.js line 2180:33 no viable alternative at input '{'
/var/folders/vt/nrnb_cw95ps51fgmm9rq2mpw0000gn/T/test262-GU6ugH.js line 2182:13 mismatched input ',' expecting RBRACE
/var/folders/vt/nrnb_cw95ps51fgmm9rq2mpw0000gn/T/test262-GU6ugH.js line 2183:27 no viable alternative at input ')'
/var/folders/vt/nrnb_cw95ps51fgmm9rq2mpw0000gn/T/test262-GU6ugH.js line 2183:28 no viable alternative at input '{'
at org.dynjs.runtime.DynJS.parseSourceCode(DynJS.java:188)
at org.dynjs.runtime.DynJS.parseSourceCode(DynJS.java:176)
at org.dynjs.runtime.DynJS.compile(DynJS.java:151)
at org.dynjs.runtime.DynJS.execute(DynJS.java:89)
at org.dynjs.runtime.DynJS.execute(DynJS.java:80)
at org.dynjs.runtime.DynJS.execute(DynJS.java:76)
at org.dynjs.cli.Main.executeFile(Main.java:73)
at org.dynjs.cli.Main.run(Main.java:60)
at org.dynjs.cli.Main.main(Main.java:46)
===
=== ch07/7.6/7.6.1/7.6.1-4-4 failed in non-strict mode ===
--- errors ---
Exception in thread "main" org.dynjs.parser.SyntaxError: /var/folders/vt/nrnb_cw95ps51fgmm9rq2mpw0000gn/T/test262-4Lb1YQ.js line 2180:12 no viable alternative at input 'set'
/var/folders/vt/nrnb_cw95ps51fgmm9rq2mpw0000gn/T/test262-4Lb1YQ.js line 2180:26 no viable alternative at input '{'
/var/folders/vt/nrnb_cw95ps51fgmm9rq2mpw0000gn/T/test262-4Lb1YQ.js line 2182:13 mismatched input ',' expecting RBRACE
/var/folders/vt/nrnb_cw95ps51fgmm9rq2mpw0000gn/T/test262-4Lb1YQ.js line 2183:20 no viable alternative at input ')'
/var/folders/vt/nrnb_cw95ps51fgmm9rq2mpw0000gn/T/test262-4Lb1YQ.js line 2183:21 no viable alternative at input '{'
at org.dynjs.runtime.DynJS.parseSourceCode(DynJS.java:188)
at org.dynjs.runtime.DynJS.parseSourceCode(DynJS.java:176)
at org.dynjs.runtime.DynJS.compile(DynJS.java:151)
at org.dynjs.runtime.DynJS.execute(DynJS.java:89)
at org.dynjs.runtime.DynJS.execute(DynJS.java:80)
at org.dynjs.runtime.DynJS.execute(DynJS.java:76)
at org.dynjs.cli.Main.executeFile(Main.java:73)
at org.dynjs.cli.Main.run(Main.java:60)
at org.dynjs.cli.Main.main(Main.java:46)
===
=== ch07/7.6/7.6.1/7.6.1-4-5 failed in non-strict mode ===
--- errors ---
Exception in thread "main" org.dynjs.parser.SyntaxError: /var/folders/vt/nrnb_cw95ps51fgmm9rq2mpw0000gn/T/test262-5X5BP6.js line 2180:12 no viable alternative at input 'set'
/var/folders/vt/nrnb_cw95ps51fgmm9rq2mpw0000gn/T/test262-5X5BP6.js line 2180:30 no viable alternative at input '{'
/var/folders/vt/nrnb_cw95ps51fgmm9rq2mpw0000gn/T/test262-5X5BP6.js line 2182:13 mismatched input ',' expecting RBRACE
/var/folders/vt/nrnb_cw95ps51fgmm9rq2mpw0000gn/T/test262-5X5BP6.js line 2183:24 no viable alternative at input ')'
/var/folders/vt/nrnb_cw95ps51fgmm9rq2mpw0000gn/T/test262-5X5BP6.js line 2183:25 no viable alternative at input '{'
at org.dynjs.runtime.DynJS.parseSourceCode(DynJS.java:188)
at org.dynjs.runtime.DynJS.parseSourceCode(DynJS.java:176)
at org.dynjs.runtime.DynJS.compile(DynJS.java:151)
at org.dynjs.runtime.DynJS.execute(DynJS.java:89)
at org.dynjs.runtime.DynJS.execute(DynJS.java:80)
at org.dynjs.runtime.DynJS.execute(DynJS.java:76)
at org.dynjs.cli.Main.executeFile(Main.java:73)
at org.dynjs.cli.Main.run(Main.java:60)
at org.dynjs.cli.Main.main(Main.java:46)
===
=== ch07/7.6/7.6.1/7.6.1-4-6 failed in non-strict mode ===
--- errors ---
Exception in thread "main" org.dynjs.parser.SyntaxError: /var/folders/vt/nrnb_cw95ps51fgmm9rq2mpw0000gn/T/test262-w6jQUY.js line 2180:12 no viable alternative at input 'set'
/var/folders/vt/nrnb_cw95ps51fgmm9rq2mpw0000gn/T/test262-w6jQUY.js line 2180:31 no viable alternative at input '{'
/var/folders/vt/nrnb_cw95ps51fgmm9rq2mpw0000gn/T/test262-w6jQUY.js line 2182:13 mismatched input ',' expecting RBRACE
/var/folders/vt/nrnb_cw95ps51fgmm9rq2mpw0000gn/T/test262-w6jQUY.js line 2183:24 no viable alternative at input '('
/var/folders/vt/nrnb_cw95ps51fgmm9rq2mpw0000gn/T/test262-w6jQUY.js line 2183:25 no viable alternative at input ')'
/var/folders/vt/nrnb_cw95ps51fgmm9rq2mpw0000gn/T/test262-w6jQUY.js line 2183:26 no viable alternative at input '{'
at org.dynjs.runtime.DynJS.parseSourceCode(DynJS.java:188)
at org.dynjs.runtime.DynJS.parseSourceCode(DynJS.java:176)
at org.dynjs.runtime.DynJS.compile(DynJS.java:151)
at org.dynjs.runtime.DynJS.execute(DynJS.java:89)
at org.dynjs.runtime.DynJS.execute(DynJS.java:80)
at org.dynjs.runtime.DynJS.execute(DynJS.java:76)
at org.dynjs.cli.Main.executeFile(Main.java:73)
at org.dynjs.cli.Main.run(Main.java:60)
at org.dynjs.cli.Main.main(Main.java:46)
===
=== ch07/7.6/7.6.1/7.6.1-4-7 failed in non-strict mode ===
--- errors ---
Exception in thread "main" org.dynjs.parser.SyntaxError: /var/folders/vt/nrnb_cw95ps51fgmm9rq2mpw0000gn/T/test262-nlCxw_.js line 2180:12 no viable alternative at input 'set'
/var/folders/vt/nrnb_cw95ps51fgmm9rq2mpw0000gn/T/test262-nlCxw_.js line 2180:28 no viable alternative at input '{'
/var/folders/vt/nrnb_cw95ps51fgmm9rq2mpw0000gn/T/test262-nlCxw_.js line 2182:13 mismatched input ',' expecting RBRACE
/var/folders/vt/nrnb_cw95ps51fgmm9rq2mpw0000gn/T/test262-nlCxw_.js line 2183:22 no viable alternative at input ')'
at org.dynjs.runtime.DynJS.parseSourceCode(DynJS.java:188)
at org.dynjs.runtime.DynJS.parseSourceCode(DynJS.java:176)
at org.dynjs.runtime.DynJS.compile(DynJS.java:151)
at org.dynjs.runtime.DynJS.execute(DynJS.java:89)
at org.dynjs.runtime.DynJS.execute(DynJS.java:80)
at org.dynjs.runtime.DynJS.execute(DynJS.java:76)
at org.dynjs.cli.Main.executeFile(Main.java:73)
at org.dynjs.cli.Main.run(Main.java:60)
at org.dynjs.cli.Main.main(Main.java:46)
===
=== ch07/7.6/7.6.1/7.6.1-4-8 failed in non-strict mode ===
--- errors ---
Exception in thread "main" org.dynjs.parser.SyntaxError: /var/folders/vt/nrnb_cw95ps51fgmm9rq2mpw0000gn/T/test262-v1Lprh.js line 2180:12 no viable alternative at input 'set'
/var/folders/vt/nrnb_cw95ps51fgmm9rq2mpw0000gn/T/test262-v1Lprh.js line 2180:27 no viable alternative at input '{'
/var/folders/vt/nrnb_cw95ps51fgmm9rq2mpw0000gn/T/test262-v1Lprh.js line 2182:13 mismatched input ',' expecting RBRACE
/var/folders/vt/nrnb_cw95ps51fgmm9rq2mpw0000gn/T/test262-v1Lprh.js line 2183:22 no viable alternative at input '{'
at org.dynjs.runtime.DynJS.parseSourceCode(DynJS.java:188)
at org.dynjs.runtime.DynJS.parseSourceCode(DynJS.java:176)
at org.dynjs.runtime.DynJS.compile(DynJS.java:151)
at org.dynjs.runtime.DynJS.execute(DynJS.java:89)
at org.dynjs.runtime.DynJS.execute(DynJS.java:80)
at org.dynjs.runtime.DynJS.execute(DynJS.java:76)
at org.dynjs.cli.Main.executeFile(Main.java:73)
at org.dynjs.cli.Main.run(Main.java:60)
at org.dynjs.cli.Main.main(Main.java:46)
===
=== ch07/7.6/7.6.1/7.6.1-4-9 failed in non-strict mode ===
--- errors ---
Exception in thread "main" org.dynjs.parser.SyntaxError: /var/folders/vt/nrnb_cw95ps51fgmm9rq2mpw0000gn/T/test262-2AFZAk.js line 2180:12 no viable alternative at input 'set'
/var/folders/vt/nrnb_cw95ps51fgmm9rq2mpw0000gn/T/test262-2AFZAk.js line 2180:25 no viable alternative at input '{'
/var/folders/vt/nrnb_cw95ps51fgmm9rq2mpw0000gn/T/test262-2AFZAk.js line 2182:13 mismatched input ',' expecting RBRACE
/var/folders/vt/nrnb_cw95ps51fgmm9rq2mpw0000gn/T/test262-2AFZAk.js line 2183:19 no viable alternative at input ')'
at org.dynjs.runtime.DynJS.parseSourceCode(DynJS.java:188)
at org.dynjs.runtime.DynJS.parseSourceCode(DynJS.java:176)
at org.dynjs.runtime.DynJS.compile(DynJS.java:151)
at org.dynjs.runtime.DynJS.execute(DynJS.java:89)
at org.dynjs.runtime.DynJS.execute(DynJS.java:80)
at org.dynjs.runtime.DynJS.execute(DynJS.java:76)
at org.dynjs.cli.Main.executeFile(Main.java:73)
at org.dynjs.cli.Main.run(Main.java:60)
at org.dynjs.cli.Main.main(Main.java:46)
===
=== ch07/7.6/7.6.1/7.6.1-5-1 failed in non-strict mode ===
--- errors ---
Exception in thread "main" org.dynjs.parser.SyntaxError: /var/folders/vt/nrnb_cw95ps51fgmm9rq2mpw0000gn/T/test262-iMYVpl.js line 2179:12 mismatched input 'null' expecting RBRACE
/var/folders/vt/nrnb_cw95ps51fgmm9rq2mpw0000gn/T/test262-iMYVpl.js line 2179:16 no viable alternative at input ':'
/var/folders/vt/nrnb_cw95ps51fgmm9rq2mpw0000gn/T/test262-iMYVpl.js line 2180:16 no viable alternative at input ':'
/var/folders/vt/nrnb_cw95ps51fgmm9rq2mpw0000gn/T/test262-iMYVpl.js line 2181:17 no viable alternative at input ':'
at org.dynjs.runtime.DynJS.parseSourceCode(DynJS.java:188)
at org.dynjs.runtime.DynJS.parseSourceCode(DynJS.java:176)
at org.dynjs.runtime.DynJS.compile(DynJS.java:151)
at org.dynjs.runtime.DynJS.execute(DynJS.java:89)
at org.dynjs.runtime.DynJS.execute(DynJS.java:80)
at org.dynjs.runtime.DynJS.execute(DynJS.java:76)
at org.dynjs.cli.Main.executeFile(Main.java:73)
at org.dynjs.cli.Main.run(Main.java:60)
at org.dynjs.cli.Main.main(Main.java:46)
===
=== ch07/7.6/7.6.1/7.6.1-5-10 failed in non-strict mode ===
--- errors ---
Exception in thread "main" org.dynjs.parser.SyntaxError: /var/folders/vt/nrnb_cw95ps51fgmm9rq2mpw0000gn/T/test262-PGoM6e.js line 2179:12 missing RBRACE at 'in'
/var/folders/vt/nrnb_cw95ps51fgmm9rq2mpw0000gn/T/test262-PGoM6e.js line 2179:14 no viable alternative at input ':'
/var/folders/vt/nrnb_cw95ps51fgmm9rq2mpw0000gn/T/test262-PGoM6e.js line 2180:12 no viable alternative at input 'try'
/var/folders/vt/nrnb_cw95ps51fgmm9rq2mpw0000gn/T/test262-PGoM6e.js line 2180:15 mismatched input ':' expecting LBRACE
/var/folders/vt/nrnb_cw95ps51fgmm9rq2mpw0000gn/T/test262-PGoM6e.js line 2181:12 no viable alternative at input 'class'
at org.dynjs.runtime.DynJS.parseSourceCode(DynJS.java:188)
at org.dynjs.runtime.DynJS.parseSourceCode(DynJS.java:176)
at org.dynjs.runtime.DynJS.compile(DynJS.java:151)
at org.dynjs.runtime.DynJS.execute(DynJS.java:89)
at org.dynjs.runtime.DynJS.execute(DynJS.java:80)
at org.dynjs.runtime.DynJS.execute(DynJS.java:76)
at org.dynjs.cli.Main.executeFile(Main.java:73)
at org.dynjs.cli.Main.run(Main.java:60)
at org.dynjs.cli.Main.main(Main.java:46)
===
=== ch07/7.6/7.6.1/7.6.1-5-11 failed in non-strict mode ===
--- errors ---
Exception in thread "main" org.dynjs.parser.SyntaxError: /var/folders/vt/nrnb_cw95ps51fgmm9rq2mpw0000gn/T/test262-dNHKrH.js line 2179:12 mismatched input 'enum' expecting RBRACE
/var/folders/vt/nrnb_cw95ps51fgmm9rq2mpw0000gn/T/test262-dNHKrH.js line 2180:12 no viable alternative at input 'extends'
/var/folders/vt/nrnb_cw95ps51fgmm9rq2mpw0000gn/T/test262-dNHKrH.js line 2181:12 no viable alternative at input 'super'
at org.dynjs.runtime.DynJS.parseSourceCode(DynJS.java:188)
at org.dynjs.runtime.DynJS.parseSourceCode(DynJS.java:176)
at org.dynjs.runtime.DynJS.compile(DynJS.java:151)
at org.dynjs.runtime.DynJS.execute(DynJS.java:89)
at org.dynjs.runtime.DynJS.execute(DynJS.java:80)
at org.dynjs.runtime.DynJS.execute(DynJS.java:76)
at org.dynjs.cli.Main.executeFile(Main.java:73)
at org.dynjs.cli.Main.run(Main.java:60)
at org.dynjs.cli.Main.main(Main.java:46)
===
=== ch07/7.6/7.6.1/7.6.1-5-12 failed in non-strict mode ===
--- errors ---
Exception in thread "main" org.dynjs.parser.SyntaxError: /var/folders/vt/nrnb_cw95ps51fgmm9rq2mpw0000gn/T/test262-TE1cPR.js line 2179:12 mismatched input 'const' expecting RBRACE
/var/folders/vt/nrnb_cw95ps51fgmm9rq2mpw0000gn/T/test262-TE1cPR.js line 2180:12 no viable alternative at input 'export'
/var/folders/vt/nrnb_cw95ps51fgmm9rq2mpw0000gn/T/test262-TE1cPR.js line 2181:12 no viable alternative at input 'import'
at org.dynjs.runtime.DynJS.parseSourceCode(DynJS.java:188)
at org.dynjs.runtime.DynJS.parseSourceCode(DynJS.java:176)
at org.dynjs.runtime.DynJS.compile(DynJS.java:151)
at org.dynjs.runtime.DynJS.execute(DynJS.java:89)
at org.dynjs.runtime.DynJS.execute(DynJS.java:80)
at org.dynjs.runtime.DynJS.execute(DynJS.java:76)
at org.dynjs.cli.Main.executeFile(Main.java:73)
at org.dynjs.cli.Main.run(Main.java:60)
at org.dynjs.cli.Main.main(Main.java:46)
===
ch07/7.6/7.6.1/7.6.1-5-13 passed in non-strict mode
ch07/7.6/7.6.1/7.6.1-5-14 passed in non-strict mode
ch07/7.6/7.6.1/7.6.1-5-15 passed in non-strict mode
ch07/7.6/7.6.1/7.6.1-5-16 passed in non-strict mode
=== ch07/7.6/7.6.1/7.6.1-5-2 failed in non-strict mode ===
--- errors ---
Exception in thread "main" org.dynjs.parser.SyntaxError: /var/folders/vt/nrnb_cw95ps51fgmm9rq2mpw0000gn/T/test262-OaGQWD.js line 2179:12 mismatched input 'break' expecting RBRACE
/var/folders/vt/nrnb_cw95ps51fgmm9rq2mpw0000gn/T/test262-OaGQWD.js line 2179:17 no viable alternative at input ':'
/var/folders/vt/nrnb_cw95ps51fgmm9rq2mpw0000gn/T/test262-OaGQWD.js line 2180:12 no viable alternative at input 'case'
/var/folders/vt/nrnb_cw95ps51fgmm9rq2mpw0000gn/T/test262-OaGQWD.js line 2181:12 no viable alternative at input 'do'
/var/folders/vt/nrnb_cw95ps51fgmm9rq2mpw0000gn/T/test262-OaGQWD.js line 2181:14 no viable alternative at input ':'
at org.dynjs.runtime.DynJS.parseSourceCode(DynJS.java:188)
at org.dynjs.runtime.DynJS.parseSourceCode(DynJS.java:176)
at org.dynjs.runtime.DynJS.compile(DynJS.java:151)
at org.dynjs.runtime.DynJS.execute(DynJS.java:89)
at org.dynjs.runtime.DynJS.execute(DynJS.java:80)
at org.dynjs.runtime.DynJS.execute(DynJS.java:76)
at org.dynjs.cli.Main.executeFile(Main.java:73)
at org.dynjs.cli.Main.run(Main.java:60)
at org.dynjs.cli.Main.main(Main.java:46)
===
=== ch07/7.6/7.6.1/7.6.1-5-3 failed in non-strict mode ===
--- errors ---
Exception in thread "main" org.dynjs.parser.SyntaxError: /var/folders/vt/nrnb_cw95ps51fgmm9rq2mpw0000gn/T/test262-WIpmAk.js line 2179:12 missing RBRACE at 'instanceof'
/var/folders/vt/nrnb_cw95ps51fgmm9rq2mpw0000gn/T/test262-WIpmAk.js line 2179:22 no viable alternative at input ':'
/var/folders/vt/nrnb_cw95ps51fgmm9rq2mpw0000gn/T/test262-WIpmAk.js line 2180:18 no viable alternative at input ':'
/var/folders/vt/nrnb_cw95ps51fgmm9rq2mpw0000gn/T/test262-WIpmAk.js line 2181:12 no viable alternative at input 'else'
at org.dynjs.runtime.DynJS.parseSourceCode(DynJS.java:188)
at org.dynjs.runtime.DynJS.parseSourceCode(DynJS.java:176)
at org.dynjs.runtime.DynJS.compile(DynJS.java:151)
at org.dynjs.runtime.DynJS.execute(DynJS.java:89)
at org.dynjs.runtime.DynJS.execute(DynJS.java:80)
at org.dynjs.runtime.DynJS.execute(DynJS.java:76)
at org.dynjs.cli.Main.executeFile(Main.java:73)
at org.dynjs.cli.Main.run(Main.java:60)
at org.dynjs.cli.Main.main(Main.java:46)
===
=== ch07/7.6/7.6.1/7.6.1-5-4 failed in non-strict mode ===
--- errors ---
Exception in thread "main" org.dynjs.parser.SyntaxError: /var/folders/vt/nrnb_cw95ps51fgmm9rq2mpw0000gn/T/test262-DHkkS1.js line 2179:12 mismatched input 'new' expecting RBRACE
/var/folders/vt/nrnb_cw95ps51fgmm9rq2mpw0000gn/T/test262-DHkkS1.js line 2179:15 no viable alternative at input ':'
/var/folders/vt/nrnb_cw95ps51fgmm9rq2mpw0000gn/T/test262-DHkkS1.js line 2180:12 no viable alternative at input 'var'
/var/folders/vt/nrnb_cw95ps51fgmm9rq2mpw0000gn/T/test262-DHkkS1.js line 2180:15 mismatched input ':' expecting Identifier
/var/folders/vt/nrnb_cw95ps51fgmm9rq2mpw0000gn/T/test262-DHkkS1.js line 2181:12 no viable alternative at input 'catch'
at org.dynjs.runtime.DynJS.parseSourceCode(DynJS.java:188)
at org.dynjs.runtime.DynJS.parseSourceCode(DynJS.java:176)
at org.dynjs.runtime.DynJS.compile(DynJS.java:151)
at org.dynjs.runtime.DynJS.execute(DynJS.java:89)
at org.dynjs.runtime.DynJS.execute(DynJS.java:80)
at org.dynjs.runtime.DynJS.execute(DynJS.java:76)
at org.dynjs.cli.Main.executeFile(Main.java:73)
at org.dynjs.cli.Main.run(Main.java:60)
at org.dynjs.cli.Main.main(Main.java:46)
===
=== ch07/7.6/7.6.1/7.6.1-5-5 failed in non-strict mode ===
--- errors ---
Exception in thread "main" org.dynjs.parser.SyntaxError: /var/folders/vt/nrnb_cw95ps51fgmm9rq2mpw0000gn/T/test262-0GdzlF.js line 2179:12 mismatched input 'finally' expecting RBRACE
/var/folders/vt/nrnb_cw95ps51fgmm9rq2mpw0000gn/T/test262-0GdzlF.js line 2180:12 no viable alternative at input 'return'
/var/folders/vt/nrnb_cw95ps51fgmm9rq2mpw0000gn/T/test262-0GdzlF.js line 2180:18 no viable alternative at input ':'
/var/folders/vt/nrnb_cw95ps51fgmm9rq2mpw0000gn/T/test262-0GdzlF.js line 2181:16 no viable alternative at input ':'
at org.dynjs.runtime.DynJS.parseSourceCode(DynJS.java:188)
at org.dynjs.runtime.DynJS.parseSourceCode(DynJS.java:176)
at org.dynjs.runtime.DynJS.compile(DynJS.java:151)
at org.dynjs.runtime.DynJS.execute(DynJS.java:89)
at org.dynjs.runtime.DynJS.execute(DynJS.java:80)
at org.dynjs.runtime.DynJS.execute(DynJS.java:76)
at org.dynjs.cli.Main.executeFile(Main.java:73)
at org.dynjs.cli.Main.run(Main.java:60)
at org.dynjs.cli.Main.main(Main.java:46)
===
=== ch07/7.6/7.6.1/7.6.1-5-6 failed in non-strict mode ===
--- errors ---
Exception in thread "main" org.dynjs.parser.SyntaxError: /var/folders/vt/nrnb_cw95ps51fgmm9rq2mpw0000gn/T/test262-uc2R_1.js line 2179:12 mismatched input 'continue' expecting RBRACE
/var/folders/vt/nrnb_cw95ps51fgmm9rq2mpw0000gn/T/test262-uc2R_1.js line 2179:20 no viable alternative at input ':'
/var/folders/vt/nrnb_cw95ps51fgmm9rq2mpw0000gn/T/test262-uc2R_1.js line 2180:12 no viable alternative at input 'for'
/var/folders/vt/nrnb_cw95ps51fgmm9rq2mpw0000gn/T/test262-uc2R_1.js line 2180:15 mismatched input ':' expecting LPAREN
/var/folders/vt/nrnb_cw95ps51fgmm9rq2mpw0000gn/T/test262-uc2R_1.js line 2181:12 no viable alternative at input 'switch'
/var/folders/vt/nrnb_cw95ps51fgmm9rq2mpw0000gn/T/test262-uc2R_1.js line 2181:18 mismatched input ':' expecting LPAREN
at org.dynjs.runtime.DynJS.parseSourceCode(DynJS.java:188)
at org.dynjs.runtime.DynJS.parseSourceCode(DynJS.java:176)
at org.dynjs.runtime.DynJS.compile(DynJS.java:151)
at org.dynjs.runtime.DynJS.execute(DynJS.java:89)
at org.dynjs.runtime.DynJS.execute(DynJS.java:80)
at org.dynjs.runtime.DynJS.execute(DynJS.java:76)
at org.dynjs.cli.Main.executeFile(Main.java:73)
at org.dynjs.cli.Main.run(Main.java:60)
at org.dynjs.cli.Main.main(Main.java:46)
===
=== ch07/7.6/7.6.1/7.6.1-5-7 failed in non-strict mode ===
--- errors ---
Exception in thread "main" org.dynjs.parser.SyntaxError: /var/folders/vt/nrnb_cw95ps51fgmm9rq2mpw0000gn/T/test262-4I14QV.js line 2179:12 mismatched input 'while' expecting RBRACE
/var/folders/vt/nrnb_cw95ps51fgmm9rq2mpw0000gn/T/test262-4I14QV.js line 2179:17 mismatched input ':' expecting LPAREN
/var/folders/vt/nrnb_cw95ps51fgmm9rq2mpw0000gn/T/test262-4I14QV.js line 2180:12 no viable alternative at input 'debugger'
/var/folders/vt/nrnb_cw95ps51fgmm9rq2mpw0000gn/T/test262-4I14QV.js line 2181:20 mismatched input ':' expecting LPAREN
at org.dynjs.runtime.DynJS.parseSourceCode(DynJS.java:188)
at org.dynjs.runtime.DynJS.parseSourceCode(DynJS.java:176)
at org.dynjs.runtime.DynJS.compile(DynJS.java:151)
at org.dynjs.runtime.DynJS.execute(DynJS.java:89)
at org.dynjs.runtime.DynJS.execute(DynJS.java:80)
at org.dynjs.runtime.DynJS.execute(DynJS.java:76)
at org.dynjs.cli.Main.executeFile(Main.java:73)
at org.dynjs.cli.Main.run(Main.java:60)
at org.dynjs.cli.Main.main(Main.java:46)
===
=== ch07/7.6/7.6.1/7.6.1-5-8 failed in non-strict mode ===
--- errors ---
Exception in thread "main" org.dynjs.parser.SyntaxError: /var/folders/vt/nrnb_cw95ps51fgmm9rq2mpw0000gn/T/test262-Bj2ND_.js line 2179:12 mismatched input 'this' expecting RBRACE
/var/folders/vt/nrnb_cw95ps51fgmm9rq2mpw0000gn/T/test262-Bj2ND_.js line 2179:16 no viable alternative at input ':'
/var/folders/vt/nrnb_cw95ps51fgmm9rq2mpw0000gn/T/test262-Bj2ND_.js line 2180:12 no viable alternative at input 'with'
/var/folders/vt/nrnb_cw95ps51fgmm9rq2mpw0000gn/T/test262-Bj2ND_.js line 2180:16 mismatched input ':' expecting LPAREN
/var/folders/vt/nrnb_cw95ps51fgmm9rq2mpw0000gn/T/test262-Bj2ND_.js line 2181:12 no viable alternative at input 'default'
at org.dynjs.runtime.DynJS.parseSourceCode(DynJS.java:188)
at org.dynjs.runtime.DynJS.parseSourceCode(DynJS.java:176)
at org.dynjs.runtime.DynJS.compile(DynJS.java:151)
at org.dynjs.runtime.DynJS.execute(DynJS.java:89)
at org.dynjs.runtime.DynJS.execute(DynJS.java:80)
at org.dynjs.runtime.DynJS.execute(DynJS.java:76)
at org.dynjs.cli.Main.executeFile(Main.java:73)
at org.dynjs.cli.Main.run(Main.java:60)
at org.dynjs.cli.Main.main(Main.java:46)
===
=== ch07/7.6/7.6.1/7.6.1-5-9 failed in non-strict mode ===
--- errors ---
Exception in thread "main" org.dynjs.parser.SyntaxError: /var/folders/vt/nrnb_cw95ps51fgmm9rq2mpw0000gn/T/test262-Htnqlv.js line 2179:12 mismatched input 'if' expecting RBRACE
/var/folders/vt/nrnb_cw95ps51fgmm9rq2mpw0000gn/T/test262-Htnqlv.js line 2179:14 mismatched input ':' expecting LPAREN
/var/folders/vt/nrnb_cw95ps51fgmm9rq2mpw0000gn/T/test262-Htnqlv.js line 2180:12 no viable alternative at input 'throw'
/var/folders/vt/nrnb_cw95ps51fgmm9rq2mpw0000gn/T/test262-Htnqlv.js line 2180:17 no viable alternative at input ':'
/var/folders/vt/nrnb_cw95ps51fgmm9rq2mpw0000gn/T/test262-Htnqlv.js line 2181:18 no viable alternative at input ':'
at org.dynjs.runtime.DynJS.parseSourceCode(DynJS.java:188)
at org.dynjs.runtime.DynJS.parseSourceCode(DynJS.java:176)
at org.dynjs.runtime.DynJS.compile(DynJS.java:151)
at org.dynjs.runtime.DynJS.execute(DynJS.java:89)
at org.dynjs.runtime.DynJS.execute(DynJS.java:80)
at org.dynjs.runtime.DynJS.execute(DynJS.java:76)
at org.dynjs.cli.Main.executeFile(Main.java:73)
at org.dynjs.cli.Main.run(Main.java:60)
at org.dynjs.cli.Main.main(Main.java:46)
===
=== ch07/7.6/7.6.1/7.6.1-6-1 failed in non-strict mode ===
--- errors ---
Exception in thread "main" org.dynjs.parser.SyntaxError: /var/folders/vt/nrnb_cw95ps51fgmm9rq2mpw0000gn/T/test262-EHz5VB.js line 2179:19 mismatched input 'null' expecting Identifier
/var/folders/vt/nrnb_cw95ps51fgmm9rq2mpw0000gn/T/test262-EHz5VB.js line 2180:16 mismatched input 'true' expecting Identifier
/var/folders/vt/nrnb_cw95ps51fgmm9rq2mpw0000gn/T/test262-EHz5VB.js line 2181:16 mismatched input 'false' expecting Identifier
at org.dynjs.runtime.DynJS.parseSourceCode(DynJS.java:188)
at org.dynjs.runtime.DynJS.parseSourceCode(DynJS.java:176)
at org.dynjs.runtime.DynJS.compile(DynJS.java:151)
at org.dynjs.runtime.DynJS.execute(DynJS.java:89)
at org.dynjs.runtime.DynJS.execute(DynJS.java:80)
at org.dynjs.runtime.DynJS.execute(DynJS.java:76)
at org.dynjs.cli.Main.executeFile(Main.java:73)
at org.dynjs.cli.Main.run(Main.java:60)
at org.dynjs.cli.Main.main(Main.java:46)
===
=== ch07/7.6/7.6.1/7.6.1-6-10 failed in non-strict mode ===
--- errors ---
Exception in thread "main" org.dynjs.parser.SyntaxError: /var/folders/vt/nrnb_cw95ps51fgmm9rq2mpw0000gn/T/test262-gAFCa1.js line 2179:19 missing Identifier at 'in'
/var/folders/vt/nrnb_cw95ps51fgmm9rq2mpw0000gn/T/test262-gAFCa1.js line 2179:22 no viable alternative at input '='
/var/folders/vt/nrnb_cw95ps51fgmm9rq2mpw0000gn/T/test262-gAFCa1.js line 2180:19 mismatched input 'try' expecting Identifier
/var/folders/vt/nrnb_cw95ps51fgmm9rq2mpw0000gn/T/test262-gAFCa1.js line 2181:19 mismatched input 'class' expecting Identifier
at org.dynjs.runtime.DynJS.parseSourceCode(DynJS.java:188)
at org.dynjs.runtime.DynJS.parseSourceCode(DynJS.java:176)
at org.dynjs.runtime.DynJS.compile(DynJS.java:151)
at org.dynjs.runtime.DynJS.execute(DynJS.java:89)
at org.dynjs.runtime.DynJS.execute(DynJS.java:80)
at org.dynjs.runtime.DynJS.execute(DynJS.java:76)
at org.dynjs.cli.Main.executeFile(Main.java:73)
at org.dynjs.cli.Main.run(Main.java:60)
at org.dynjs.cli.Main.main(Main.java:46)
===
=== ch07/7.6/7.6.1/7.6.1-6-11 failed in non-strict mode ===
--- errors ---
Exception in thread "main" org.dynjs.parser.SyntaxError: /var/folders/vt/nrnb_cw95ps51fgmm9rq2mpw0000gn/T/test262-QA5xCf.js line 2179:19 mismatched input 'enum' expecting Identifier
/var/folders/vt/nrnb_cw95ps51fgmm9rq2mpw0000gn/T/test262-QA5xCf.js line 2180:19 mismatched input 'extends' expecting Identifier
/var/folders/vt/nrnb_cw95ps51fgmm9rq2mpw0000gn/T/test262-QA5xCf.js line 2181:19 mismatched input 'super' expecting Identifier
at org.dynjs.runtime.DynJS.parseSourceCode(DynJS.java:188)
at org.dynjs.runtime.DynJS.parseSourceCode(DynJS.java:176)
at org.dynjs.runtime.DynJS.compile(DynJS.java:151)
at org.dynjs.runtime.DynJS.execute(DynJS.java:89)
at org.dynjs.runtime.DynJS.execute(DynJS.java:80)
at org.dynjs.runtime.DynJS.execute(DynJS.java:76)
at org.dynjs.cli.Main.executeFile(Main.java:73)
at org.dynjs.cli.Main.run(Main.java:60)
at org.dynjs.cli.Main.main(Main.java:46)
===
=== ch07/7.6/7.6.1/7.6.1-6-12 failed in non-strict mode ===
--- errors ---
Exception in thread "main" org.dynjs.parser.SyntaxError: /var/folders/vt/nrnb_cw95ps51fgmm9rq2mpw0000gn/T/test262-Z2unz_.js line 2179:19 mismatched input 'const' expecting Identifier
/var/folders/vt/nrnb_cw95ps51fgmm9rq2mpw0000gn/T/test262-Z2unz_.js line 2180:19 mismatched input 'export' expecting Identifier
/var/folders/vt/nrnb_cw95ps51fgmm9rq2mpw0000gn/T/test262-Z2unz_.js line 2181:19 mismatched input 'import' expecting Identifier
at org.dynjs.runtime.DynJS.parseSourceCode(DynJS.java:188)
at org.dynjs.runtime.DynJS.parseSourceCode(DynJS.java:176)
at org.dynjs.runtime.DynJS.compile(DynJS.java:151)
at org.dynjs.runtime.DynJS.execute(DynJS.java:89)
at org.dynjs.runtime.DynJS.execute(DynJS.java:80)
at org.dynjs.runtime.DynJS.execute(DynJS.java:76)
at org.dynjs.cli.Main.executeFile(Main.java:73)
at org.dynjs.cli.Main.run(Main.java:60)
at org.dynjs.cli.Main.main(Main.java:46)
===
ch07/7.6/7.6.1/7.6.1-6-13 passed in non-strict mode
ch07/7.6/7.6.1/7.6.1-6-14 passed in non-strict mode
ch07/7.6/7.6.1/7.6.1-6-15 passed in non-strict mode
ch07/7.6/7.6.1/7.6.1-6-16 passed in non-strict mode
=== ch07/7.6/7.6.1/7.6.1-6-2 failed in non-strict mode ===
--- errors ---
Exception in thread "main" org.dynjs.parser.SyntaxError: /var/folders/vt/nrnb_cw95ps51fgmm9rq2mpw0000gn/T/test262-pw1a6t.js line 2179:19 mismatched input 'break' expecting Identifier
/var/folders/vt/nrnb_cw95ps51fgmm9rq2mpw0000gn/T/test262-pw1a6t.js line 2180:19 mismatched input 'case' expecting Identifier
/var/folders/vt/nrnb_cw95ps51fgmm9rq2mpw0000gn/T/test262-pw1a6t.js line 2181:19 mismatched input 'do' expecting Identifier
at org.dynjs.runtime.DynJS.parseSourceCode(DynJS.java:188)
at org.dynjs.runtime.DynJS.parseSourceCode(DynJS.java:176)
at org.dynjs.runtime.DynJS.compile(DynJS.java:151)
at org.dynjs.runtime.DynJS.execute(DynJS.java:89)
at org.dynjs.runtime.DynJS.execute(DynJS.java:80)
at org.dynjs.runtime.DynJS.execute(DynJS.java:76)
at org.dynjs.cli.Main.executeFile(Main.java:73)
at org.dynjs.cli.Main.run(Main.java:60)
at org.dynjs.cli.Main.main(Main.java:46)
===
=== ch07/7.6/7.6.1/7.6.1-6-3 failed in non-strict mode ===
--- errors ---
Exception in thread "main" org.dynjs.parser.SyntaxError: /var/folders/vt/nrnb_cw95ps51fgmm9rq2mpw0000gn/T/test262-ehAppI.js line 2179:19 missing Identifier at 'instanceof'
/var/folders/vt/nrnb_cw95ps51fgmm9rq2mpw0000gn/T/test262-ehAppI.js line 2179:30 no viable alternative at input '='
/var/folders/vt/nrnb_cw95ps51fgmm9rq2mpw0000gn/T/test262-ehAppI.js line 2180:19 mismatched input 'typeof' expecting Identifier
/var/folders/vt/nrnb_cw95ps51fgmm9rq2mpw0000gn/T/test262-ehAppI.js line 2181:19 mismatched input 'else' expecting Identifier
at org.dynjs.runtime.DynJS.parseSourceCode(DynJS.java:188)
at org.dynjs.runtime.DynJS.parseSourceCode(DynJS.java:176)
at org.dynjs.runtime.DynJS.compile(DynJS.java:151)
at org.dynjs.runtime.DynJS.execute(DynJS.java:89)
at org.dynjs.runtime.DynJS.execute(DynJS.java:80)
at org.dynjs.runtime.DynJS.execute(DynJS.java:76)
at org.dynjs.cli.Main.executeFile(Main.java:73)
at org.dynjs.cli.Main.run(Main.java:60)
at org.dynjs.cli.Main.main(Main.java:46)
===
=== ch07/7.6/7.6.1/7.6.1-6-4 failed in non-strict mode ===
--- errors ---
Exception in thread "main" org.dynjs.parser.SyntaxError: /var/folders/vt/nrnb_cw95ps51fgmm9rq2mpw0000gn/T/test262-ebL6hV.js line 2179:19 mismatched input 'new' expecting Identifier
/var/folders/vt/nrnb_cw95ps51fgmm9rq2mpw0000gn/T/test262-ebL6hV.js line 2180:19 mismatched input 'var' expecting Identifier
/var/folders/vt/nrnb_cw95ps51fgmm9rq2mpw0000gn/T/test262-ebL6hV.js line 2181:19 mismatched input 'catch' expecting Identifier
at org.dynjs.runtime.DynJS.parseSourceCode(DynJS.java:188)
at org.dynjs.runtime.DynJS.parseSourceCode(DynJS.java:176)
at org.dynjs.runtime.DynJS.compile(DynJS.java:151)
at org.dynjs.runtime.DynJS.execute(DynJS.java:89)
at org.dynjs.runtime.DynJS.execute(DynJS.java:80)
at org.dynjs.runtime.DynJS.execute(DynJS.java:76)
at org.dynjs.cli.Main.executeFile(Main.java:73)
at org.dynjs.cli.Main.run(Main.java:60)
at org.dynjs.cli.Main.main(Main.java:46)
===
=== ch07/7.6/7.6.1/7.6.1-6-5 failed in non-strict mode ===
--- errors ---
Exception in thread "main" org.dynjs.parser.SyntaxError: /var/folders/vt/nrnb_cw95ps51fgmm9rq2mpw0000gn/T/test262-bb6EXN.js line 2179:19 mismatched input 'finally' expecting Identifier
/var/folders/vt/nrnb_cw95ps51fgmm9rq2mpw0000gn/T/test262-bb6EXN.js line 2180:19 mismatched input 'return' expecting Identifier
/var/folders/vt/nrnb_cw95ps51fgmm9rq2mpw0000gn/T/test262-bb6EXN.js line 2181:19 mismatched input 'void' expecting Identifier
at org.dynjs.runtime.DynJS.parseSourceCode(DynJS.java:188)
at org.dynjs.runtime.DynJS.parseSourceCode(DynJS.java:176)
at org.dynjs.runtime.DynJS.compile(DynJS.java:151)
at org.dynjs.runtime.DynJS.execute(DynJS.java:89)
at org.dynjs.runtime.DynJS.execute(DynJS.java:80)
at org.dynjs.runtime.DynJS.execute(DynJS.java:76)
at org.dynjs.cli.Main.executeFile(Main.java:73)
at org.dynjs.cli.Main.run(Main.java:60)
at org.dynjs.cli.Main.main(Main.java:46)
===
=== ch07/7.6/7.6.1/7.6.1-6-6 failed in non-strict mode ===
--- errors ---
Exception in thread "main" org.dynjs.parser.SyntaxError: /var/folders/vt/nrnb_cw95ps51fgmm9rq2mpw0000gn/T/test262-hDjtLQ.js line 2179:19 mismatched input 'continue' expecting Identifier
/var/folders/vt/nrnb_cw95ps51fgmm9rq2mpw0000gn/T/test262-hDjtLQ.js line 2180:19 mismatched input 'for' expecting Identifier
/var/folders/vt/nrnb_cw95ps51fgmm9rq2mpw0000gn/T/test262-hDjtLQ.js line 2181:19 mismatched input 'switch' expecting Identifier
at org.dynjs.runtime.DynJS.parseSourceCode(DynJS.java:188)
at org.dynjs.runtime.DynJS.parseSourceCode(DynJS.java:176)
at org.dynjs.runtime.DynJS.compile(DynJS.java:151)
at org.dynjs.runtime.DynJS.execute(DynJS.java:89)
at org.dynjs.runtime.DynJS.execute(DynJS.java:80)
at org.dynjs.runtime.DynJS.execute(DynJS.java:76)
at org.dynjs.cli.Main.executeFile(Main.java:73)
at org.dynjs.cli.Main.run(Main.java:60)
at org.dynjs.cli.Main.main(Main.java:46)
===
=== ch07/7.6/7.6.1/7.6.1-6-7 failed in non-strict mode ===
--- errors ---
Exception in thread "main" org.dynjs.parser.SyntaxError: /var/folders/vt/nrnb_cw95ps51fgmm9rq2mpw0000gn/T/test262-OvgDar.js line 2179:19 mismatched input 'while' expecting Identifier
/var/folders/vt/nrnb_cw95ps51fgmm9rq2mpw0000gn/T/test262-OvgDar.js line 2180:19 mismatched input 'debugger' expecting Identifier
/var/folders/vt/nrnb_cw95ps51fgmm9rq2mpw0000gn/T/test262-OvgDar.js line 2181:19 mismatched input 'function' expecting Identifier
at org.dynjs.runtime.DynJS.parseSourceCode(DynJS.java:188)
at org.dynjs.runtime.DynJS.parseSourceCode(DynJS.java:176)
at org.dynjs.runtime.DynJS.compile(DynJS.java:151)
at org.dynjs.runtime.DynJS.execute(DynJS.java:89)
at org.dynjs.runtime.DynJS.execute(DynJS.java:80)
at org.dynjs.runtime.DynJS.execute(DynJS.java:76)
at org.dynjs.cli.Main.executeFile(Main.java:73)
at org.dynjs.cli.Main.run(Main.java:60)
at org.dynjs.cli.Main.main(Main.java:46)
===
=== ch07/7.6/7.6.1/7.6.1-6-8 failed in non-strict mode ===
--- errors ---
Exception in thread "main" org.dynjs.parser.SyntaxError: /var/folders/vt/nrnb_cw95ps51fgmm9rq2mpw0000gn/T/test262-qbfaJB.js line 2179:19 mismatched input 'this' expecting Identifier
/var/folders/vt/nrnb_cw95ps51fgmm9rq2mpw0000gn/T/test262-qbfaJB.js line 2180:19 mismatched input 'with' expecting Identifier
/var/folders/vt/nrnb_cw95ps51fgmm9rq2mpw0000gn/T/test262-qbfaJB.js line 2181:19 mismatched input 'default' expecting Identifier
at org.dynjs.runtime.DynJS.parseSourceCode(DynJS.java:188)
at org.dynjs.runtime.DynJS.parseSourceCode(DynJS.java:176)
at org.dynjs.runtime.DynJS.compile(DynJS.java:151)
at org.dynjs.runtime.DynJS.execute(DynJS.java:89)
at org.dynjs.runtime.DynJS.execute(DynJS.java:80)
at org.dynjs.runtime.DynJS.execute(DynJS.java:76)
at org.dynjs.cli.Main.executeFile(Main.java:73)
at org.dynjs.cli.Main.run(Main.java:60)
at org.dynjs.cli.Main.main(Main.java:46)
===
=== ch07/7.6/7.6.1/7.6.1-6-9 failed in non-strict mode ===
--- errors ---
Exception in thread "main" org.dynjs.parser.SyntaxError: /var/folders/vt/nrnb_cw95ps51fgmm9rq2mpw0000gn/T/test262-gCtcCs.js line 2179:19 mismatched input 'if' expecting Identifier
/var/folders/vt/nrnb_cw95ps51fgmm9rq2mpw0000gn/T/test262-gCtcCs.js line 2180:19 mismatched input 'throw' expecting Identifier
/var/folders/vt/nrnb_cw95ps51fgmm9rq2mpw0000gn/T/test262-gCtcCs.js line 2181:19 mismatched input 'delete' expecting Identifier
at org.dynjs.runtime.DynJS.parseSourceCode(DynJS.java:188)
at org.dynjs.runtime.DynJS.parseSourceCode(DynJS.java:176)
at org.dynjs.runtime.DynJS.compile(DynJS.java:151)
at org.dynjs.runtime.DynJS.execute(DynJS.java:89)
at org.dynjs.runtime.DynJS.execute(DynJS.java:80)
at org.dynjs.runtime.DynJS.execute(DynJS.java:76)
at org.dynjs.cli.Main.executeFile(Main.java:73)
at org.dynjs.cli.Main.run(Main.java:60)
at org.dynjs.cli.Main.main(Main.java:46)
===
ch07/7.6/7.6.1/7.6.1-7-1 passed in non-strict mode
ch07/7.6/7.6.1/7.6.1-7-10 passed in non-strict mode
ch07/7.6/7.6.1/7.6.1-7-11 passed in non-strict mode
ch07/7.6/7.6.1/7.6.1-7-12 passed in non-strict mode
ch07/7.6/7.6.1/7.6.1-7-13 passed in non-strict mode
ch07/7.6/7.6.1/7.6.1-7-14 passed in non-strict mode
ch07/7.6/7.6.1/7.6.1-7-15 passed in non-strict mode
ch07/7.6/7.6.1/7.6.1-7-16 passed in non-strict mode
ch07/7.6/7.6.1/7.6.1-7-2 passed in non-strict mode
ch07/7.6/7.6.1/7.6.1-7-3 passed in non-strict mode
ch07/7.6/7.6.1/7.6.1-7-4 passed in non-strict mode
ch07/7.6/7.6.1/7.6.1-7-5 passed in non-strict mode
ch07/7.6/7.6.1/7.6.1-7-6 passed in non-strict mode
ch07/7.6/7.6.1/7.6.1-7-7 passed in non-strict mode
ch07/7.6/7.6.1/7.6.1-7-8 passed in non-strict mode
ch07/7.6/7.6.1/7.6.1-7-9 passed in non-strict mode
=== ch07/7.6/7.6.1/7.6.1-8-1 failed in non-strict mode ===
--- errors ---
Exception in thread "main" org.dynjs.parser.SyntaxError: /var/folders/vt/nrnb_cw95ps51fgmm9rq2mpw0000gn/T/test262-e8rsxX.js line 2180:12 no viable alternative at input 'set'
/var/folders/vt/nrnb_cw95ps51fgmm9rq2mpw0000gn/T/test262-e8rsxX.js line 2180:28 no viable alternative at input '{'
/var/folders/vt/nrnb_cw95ps51fgmm9rq2mpw0000gn/T/test262-e8rsxX.js line 2182:13 mismatched input ',' expecting RBRACE
/var/folders/vt/nrnb_cw95ps51fgmm9rq2mpw0000gn/T/test262-e8rsxX.js line 2183:23 no viable alternative at input '{'
at org.dynjs.runtime.DynJS.parseSourceCode(DynJS.java:188)
at org.dynjs.runtime.DynJS.parseSourceCode(DynJS.java:176)
at org.dynjs.runtime.DynJS.compile(DynJS.java:151)
at org.dynjs.runtime.DynJS.execute(DynJS.java:89)
at org.dynjs.runtime.DynJS.execute(DynJS.java:80)
at org.dynjs.runtime.DynJS.execute(DynJS.java:76)
at org.dynjs.cli.Main.executeFile(Main.java:73)
at org.dynjs.cli.Main.run(Main.java:60)
at org.dynjs.cli.Main.main(Main.java:46)
===
=== ch07/7.6/7.6.1/7.6.1-8-10 failed in non-strict mode ===
--- errors ---
Exception in thread "main" org.dynjs.parser.SyntaxError: /var/folders/vt/nrnb_cw95ps51fgmm9rq2mpw0000gn/T/test262-zoz9hA.js line 2180:12 no viable alternative at input 'set'
/var/folders/vt/nrnb_cw95ps51fgmm9rq2mpw0000gn/T/test262-zoz9hA.js line 2180:25 no viable alternative at input '{'
/var/folders/vt/nrnb_cw95ps51fgmm9rq2mpw0000gn/T/test262-zoz9hA.js line 2182:13 mismatched input ',' expecting RBRACE
/var/folders/vt/nrnb_cw95ps51fgmm9rq2mpw0000gn/T/test262-zoz9hA.js line 2183:19 no viable alternative at input ')'
/var/folders/vt/nrnb_cw95ps51fgmm9rq2mpw0000gn/T/test262-zoz9hA.js line 2183:20 no viable alternative at input '{'
at org.dynjs.runtime.DynJS.parseSourceCode(DynJS.java:188)
at org.dynjs.runtime.DynJS.parseSourceCode(DynJS.java:176)
at org.dynjs.runtime.DynJS.compile(DynJS.java:151)
at org.dynjs.runtime.DynJS.execute(DynJS.java:89)
at org.dynjs.runtime.DynJS.execute(DynJS.java:80)
at org.dynjs.runtime.DynJS.execute(DynJS.java:76)
at org.dynjs.cli.Main.executeFile(Main.java:73)
at org.dynjs.cli.Main.run(Main.java:60)
at org.dynjs.cli.Main.main(Main.java:46)
===
=== ch07/7.6/7.6.1/7.6.1-8-11 failed in non-strict mode ===
--- errors ---
Exception in thread "main" org.dynjs.parser.SyntaxError: /var/folders/vt/nrnb_cw95ps51fgmm9rq2mpw0000gn/T/test262-aSLFZp.js line 2180:12 no viable alternative at input 'set'
/var/folders/vt/nrnb_cw95ps51fgmm9rq2mpw0000gn/T/test262-aSLFZp.js line 2180:27 no viable alternative at input '{'
/var/folders/vt/nrnb_cw95ps51fgmm9rq2mpw0000gn/T/test262-aSLFZp.js line 2182:13 mismatched input ',' expecting RBRACE
/var/folders/vt/nrnb_cw95ps51fgmm9rq2mpw0000gn/T/test262-aSLFZp.js line 2183:21 no viable alternative at input ')'
/var/folders/vt/nrnb_cw95ps51fgmm9rq2mpw0000gn/T/test262-aSLFZp.js line 2183:22 no viable alternative at input '{'
at org.dynjs.runtime.DynJS.parseSourceCode(DynJS.java:188)
at org.dynjs.runtime.DynJS.parseSourceCode(DynJS.java:176)
at org.dynjs.runtime.DynJS.compile(DynJS.java:151)
at org.dynjs.runtime.DynJS.execute(DynJS.java:89)
at org.dynjs.runtime.DynJS.execute(DynJS.java:80)
at org.dynjs.runtime.DynJS.execute(DynJS.java:76)
at org.dynjs.cli.Main.executeFile(Main.java:73)
at org.dynjs.cli.Main.run(Main.java:60)
at org.dynjs.cli.Main.main(Main.java:46)
===
=== ch07/7.6/7.6.1/7.6.1-8-12 failed in non-strict mode ===
--- errors ---
Exception in thread "main" org.dynjs.parser.SyntaxError: /var/folders/vt/nrnb_cw95ps51fgmm9rq2mpw0000gn/T/test262-_uB6DW.js line 2180:12 no viable alternative at input 'set'
/var/folders/vt/nrnb_cw95ps51fgmm9rq2mpw0000gn/T/test262-_uB6DW.js line 2180:28 no viable alternative at input '{'
/var/folders/vt/nrnb_cw95ps51fgmm9rq2mpw0000gn/T/test262-_uB6DW.js line 2182:13 mismatched input ',' expecting RBRACE
/var/folders/vt/nrnb_cw95ps51fgmm9rq2mpw0000gn/T/test262-_uB6DW.js line 2183:22 no viable alternative at input ')'
/var/folders/vt/nrnb_cw95ps51fgmm9rq2mpw0000gn/T/test262-_uB6DW.js line 2183:23 no viable alternative at input '{'
at org.dynjs.runtime.DynJS.parseSourceCode(DynJS.java:188)
at org.dynjs.runtime.DynJS.parseSourceCode(DynJS.java:176)
at org.dynjs.runtime.DynJS.compile(DynJS.java:151)
at org.dynjs.runtime.DynJS.execute(DynJS.java:89)
at org.dynjs.runtime.DynJS.execute(DynJS.java:80)
at org.dynjs.runtime.DynJS.execute(DynJS.java:76)
at org.dynjs.cli.Main.executeFile(Main.java:73)
at org.dynjs.cli.Main.run(Main.java:60)
at org.dynjs.cli.Main.main(Main.java:46)
===
ch07/7.6/7.6.1/7.6.1-8-13 passed in non-strict mode
ch07/7.6/7.6.1/7.6.1-8-14 passed in non-strict mode
ch07/7.6/7.6.1/7.6.1-8-15 passed in non-strict mode
ch07/7.6/7.6.1/7.6.1-8-16 passed in non-strict mode
=== ch07/7.6/7.6.1/7.6.1-8-2 failed in non-strict mode ===
--- errors ---
Exception in thread "main" org.dynjs.parser.SyntaxError: /var/folders/vt/nrnb_cw95ps51fgmm9rq2mpw0000gn/T/test262-iZybdZ.js line 2180:12 no viable alternative at input 'set'
/var/folders/vt/nrnb_cw95ps51fgmm9rq2mpw0000gn/T/test262-iZybdZ.js line 2180:28 no viable alternative at input '{'
/var/folders/vt/nrnb_cw95ps51fgmm9rq2mpw0000gn/T/test262-iZybdZ.js line 2182:13 mismatched input ',' expecting RBRACE
/var/folders/vt/nrnb_cw95ps51fgmm9rq2mpw0000gn/T/test262-iZybdZ.js line 2183:21 no viable alternative at input '('
/var/folders/vt/nrnb_cw95ps51fgmm9rq2mpw0000gn/T/test262-iZybdZ.js line 2183:22 no viable alternative at input ')'
/var/folders/vt/nrnb_cw95ps51fgmm9rq2mpw0000gn/T/test262-iZybdZ.js line 2183:23 no viable alternative at input '{'
at org.dynjs.runtime.DynJS.parseSourceCode(DynJS.java:188)
at org.dynjs.runtime.DynJS.parseSourceCode(DynJS.java:176)
at org.dynjs.runtime.DynJS.compile(DynJS.java:151)
at org.dynjs.runtime.DynJS.execute(DynJS.java:89)
at org.dynjs.runtime.DynJS.execute(DynJS.java:80)
at org.dynjs.runtime.DynJS.execute(DynJS.java:76)
at org.dynjs.cli.Main.executeFile(Main.java:73)
at org.dynjs.cli.Main.run(Main.java:60)
at org.dynjs.cli.Main.main(Main.java:46)
===
=== ch07/7.6/7.6.1/7.6.1-8-3 failed in non-strict mode ===
--- errors ---
Exception in thread "main" org.dynjs.parser.SyntaxError: /var/folders/vt/nrnb_cw95ps51fgmm9rq2mpw0000gn/T/test262-rF7a9A.js line 2180:12 no viable alternative at input 'set'
/var/folders/vt/nrnb_cw95ps51fgmm9rq2mpw0000gn/T/test262-rF7a9A.js line 2180:33 no viable alternative at input '{'
/var/folders/vt/nrnb_cw95ps51fgmm9rq2mpw0000gn/T/test262-rF7a9A.js line 2182:13 mismatched input ',' expecting RBRACE
/var/folders/vt/nrnb_cw95ps51fgmm9rq2mpw0000gn/T/test262-rF7a9A.js line 2183:27 no viable alternative at input ')'
/var/folders/vt/nrnb_cw95ps51fgmm9rq2mpw0000gn/T/test262-rF7a9A.js line 2183:28 no viable alternative at input '{'
at org.dynjs.runtime.DynJS.parseSourceCode(DynJS.java:188)
at org.dynjs.runtime.DynJS.parseSourceCode(DynJS.java:176)
at org.dynjs.runtime.DynJS.compile(DynJS.java:151)
at org.dynjs.runtime.DynJS.execute(DynJS.java:89)
at org.dynjs.runtime.DynJS.execute(DynJS.java:80)
at org.dynjs.runtime.DynJS.execute(DynJS.java:76)
at org.dynjs.cli.Main.executeFile(Main.java:73)
at org.dynjs.cli.Main.run(Main.java:60)
at org.dynjs.cli.Main.main(Main.java:46)
===
=== ch07/7.6/7.6.1/7.6.1-8-4 failed in non-strict mode ===
--- errors ---
Exception in thread "main" org.dynjs.parser.SyntaxError: /var/folders/vt/nrnb_cw95ps51fgmm9rq2mpw0000gn/T/test262-JLRcTr.js line 2180:12 no viable alternative at input 'set'
/var/folders/vt/nrnb_cw95ps51fgmm9rq2mpw0000gn/T/test262-JLRcTr.js line 2180:26 no viable alternative at input '{'
/var/folders/vt/nrnb_cw95ps51fgmm9rq2mpw0000gn/T/test262-JLRcTr.js line 2182:13 mismatched input ',' expecting RBRACE
/var/folders/vt/nrnb_cw95ps51fgmm9rq2mpw0000gn/T/test262-JLRcTr.js line 2183:20 no viable alternative at input ')'
/var/folders/vt/nrnb_cw95ps51fgmm9rq2mpw0000gn/T/test262-JLRcTr.js line 2183:21 no viable alternative at input '{'
at org.dynjs.runtime.DynJS.parseSourceCode(DynJS.java:188)
at org.dynjs.runtime.DynJS.parseSourceCode(DynJS.java:176)
at org.dynjs.runtime.DynJS.compile(DynJS.java:151)
at org.dynjs.runtime.DynJS.execute(DynJS.java:89)
at org.dynjs.runtime.DynJS.execute(DynJS.java:80)
at org.dynjs.runtime.DynJS.execute(DynJS.java:76)
at org.dynjs.cli.Main.executeFile(Main.java:73)
at org.dynjs.cli.Main.run(Main.java:60)
at org.dynjs.cli.Main.main(Main.java:46)
===
=== ch07/7.6/7.6.1/7.6.1-8-5 failed in non-strict mode ===
--- errors ---
Exception in thread "main" org.dynjs.parser.SyntaxError: /var/folders/vt/nrnb_cw95ps51fgmm9rq2mpw0000gn/T/test262-eIcD6b.js line 2180:12 no viable alternative at input 'set'
/var/folders/vt/nrnb_cw95ps51fgmm9rq2mpw0000gn/T/test262-eIcD6b.js line 2180:30 no viable alternative at input '{'
/var/folders/vt/nrnb_cw95ps51fgmm9rq2mpw0000gn/T/test262-eIcD6b.js line 2182:13 mismatched input ',' expecting RBRACE
/var/folders/vt/nrnb_cw95ps51fgmm9rq2mpw0000gn/T/test262-eIcD6b.js line 2183:24 no viable alternative at input ')'
/var/folders/vt/nrnb_cw95ps51fgmm9rq2mpw0000gn/T/test262-eIcD6b.js line 2183:25 no viable alternative at input '{'
at org.dynjs.runtime.DynJS.parseSourceCode(DynJS.java:188)
at org.dynjs.runtime.DynJS.parseSourceCode(DynJS.java:176)
at org.dynjs.runtime.DynJS.compile(DynJS.java:151)
at org.dynjs.runtime.DynJS.execute(DynJS.java:89)
at org.dynjs.runtime.DynJS.execute(DynJS.java:80)
at org.dynjs.runtime.DynJS.execute(DynJS.java:76)
at org.dynjs.cli.Main.executeFile(Main.java:73)
at org.dynjs.cli.Main.run(Main.java:60)
at org.dynjs.cli.Main.main(Main.java:46)
===
=== ch07/7.6/7.6.1/7.6.1-8-6 failed in non-strict mode ===
--- errors ---
Exception in thread "main" org.dynjs.parser.SyntaxError: /var/folders/vt/nrnb_cw95ps51fgmm9rq2mpw0000gn/T/test262-pAdaW_.js line 2180:12 no viable alternative at input 'set'
/var/folders/vt/nrnb_cw95ps51fgmm9rq2mpw0000gn/T/test262-pAdaW_.js line 2180:31 no viable alternative at input '{'
/var/folders/vt/nrnb_cw95ps51fgmm9rq2mpw0000gn/T/test262-pAdaW_.js line 2182:13 mismatched input ',' expecting RBRACE
/var/folders/vt/nrnb_cw95ps51fgmm9rq2mpw0000gn/T/test262-pAdaW_.js line 2183:24 no viable alternative at input '('
/var/folders/vt/nrnb_cw95ps51fgmm9rq2mpw0000gn/T/test262-pAdaW_.js line 2183:25 no viable alternative at input ')'
/var/folders/vt/nrnb_cw95ps51fgmm9rq2mpw0000gn/T/test262-pAdaW_.js line 2183:26 no viable alternative at input '{'
at org.dynjs.runtime.DynJS.parseSourceCode(DynJS.java:188)
at org.dynjs.runtime.DynJS.parseSourceCode(DynJS.java:176)
at org.dynjs.runtime.DynJS.compile(DynJS.java:151)
at org.dynjs.runtime.DynJS.execute(DynJS.java:89)
at org.dynjs.runtime.DynJS.execute(DynJS.java:80)
at org.dynjs.runtime.DynJS.execute(DynJS.java:76)
at org.dynjs.cli.Main.executeFile(Main.java:73)
at org.dynjs.cli.Main.run(Main.java:60)
at org.dynjs.cli.Main.main(Main.java:46)
===
=== ch07/7.6/7.6.1/7.6.1-8-7 failed in non-strict mode ===
--- errors ---
Exception in thread "main" org.dynjs.parser.SyntaxError: /var/folders/vt/nrnb_cw95ps51fgmm9rq2mpw0000gn/T/test262-RwOJfD.js line 2180:12 no viable alternative at input 'set'
/var/folders/vt/nrnb_cw95ps51fgmm9rq2mpw0000gn/T/test262-RwOJfD.js line 2180:28 no viable alternative at input '{'
/var/folders/vt/nrnb_cw95ps51fgmm9rq2mpw0000gn/T/test262-RwOJfD.js line 2182:13 mismatched input ',' expecting RBRACE
/var/folders/vt/nrnb_cw95ps51fgmm9rq2mpw0000gn/T/test262-RwOJfD.js line 2183:22 no viable alternative at input ')'
at org.dynjs.runtime.DynJS.parseSourceCode(DynJS.java:188)
at org.dynjs.runtime.DynJS.parseSourceCode(DynJS.java:176)
at org.dynjs.runtime.DynJS.compile(DynJS.java:151)
at org.dynjs.runtime.DynJS.execute(DynJS.java:89)
at org.dynjs.runtime.DynJS.execute(DynJS.java:80)
at org.dynjs.runtime.DynJS.execute(DynJS.java:76)
at org.dynjs.cli.Main.executeFile(Main.java:73)
at org.dynjs.cli.Main.run(Main.java:60)
at org.dynjs.cli.Main.main(Main.java:46)
===
=== ch07/7.6/7.6.1/7.6.1-8-8 failed in non-strict mode ===
--- errors ---
Exception in thread "main" org.dynjs.parser.SyntaxError: /var/folders/vt/nrnb_cw95ps51fgmm9rq2mpw0000gn/T/test262-qLmoho.js line 2180:12 no viable alternative at input 'set'
/var/folders/vt/nrnb_cw95ps51fgmm9rq2mpw0000gn/T/test262-qLmoho.js line 2180:27 no viable alternative at input '{'
/var/folders/vt/nrnb_cw95ps51fgmm9rq2mpw0000gn/T/test262-qLmoho.js line 2182:13 mismatched input ',' expecting RBRACE
/var/folders/vt/nrnb_cw95ps51fgmm9rq2mpw0000gn/T/test262-qLmoho.js line 2183:22 no viable alternative at input '{'
at org.dynjs.runtime.DynJS.parseSourceCode(DynJS.java:188)
at org.dynjs.runtime.DynJS.parseSourceCode(DynJS.java:176)
at org.dynjs.runtime.DynJS.compile(DynJS.java:151)
at org.dynjs.runtime.DynJS.execute(DynJS.java:89)
at org.dynjs.runtime.DynJS.execute(DynJS.java:80)
at org.dynjs.runtime.DynJS.execute(DynJS.java:76)
at org.dynjs.cli.Main.executeFile(Main.java:73)
at org.dynjs.cli.Main.run(Main.java:60)
at org.dynjs.cli.Main.main(Main.java:46)
===
=== ch07/7.6/7.6.1/7.6.1-8-9 failed in non-strict mode ===
--- errors ---
Exception in thread "main" org.dynjs.parser.SyntaxError: /var/folders/vt/nrnb_cw95ps51fgmm9rq2mpw0000gn/T/test262-I0Duue.js line 2180:12 no viable alternative at input 'set'
/var/folders/vt/nrnb_cw95ps51fgmm9rq2mpw0000gn/T/test262-I0Duue.js line 2180:25 no viable alternative at input '{'
/var/folders/vt/nrnb_cw95ps51fgmm9rq2mpw0000gn/T/test262-I0Duue.js line 2182:13 mismatched input ',' expecting RBRACE
/var/folders/vt/nrnb_cw95ps51fgmm9rq2mpw0000gn/T/test262-I0Duue.js line 2183:19 no viable alternative at input ')'
at org.dynjs.runtime.DynJS.parseSourceCode(DynJS.java:188)
at org.dynjs.runtime.DynJS.parseSourceCode(DynJS.java:176)
at org.dynjs.runtime.DynJS.compile(DynJS.java:151)
at org.dynjs.runtime.DynJS.execute(DynJS.java:89)
at org.dynjs.runtime.DynJS.execute(DynJS.java:80)
at org.dynjs.runtime.DynJS.execute(DynJS.java:76)
at org.dynjs.cli.Main.executeFile(Main.java:73)
at org.dynjs.cli.Main.run(Main.java:60)
at org.dynjs.cli.Main.main(Main.java:46)
===
ch07/7.6/7.6.1/7.6.1.2-1gs failed in strict mode as expected
ch07/7.6/7.6.1/S7.6.1_A1.1 failed in non-strict mode as expected
ch07/7.6/7.6.1/S7.6.1_A1.2 failed in non-strict mode as expected
ch07/7.6/7.6.1/S7.6.1_A1.3 failed in non-strict mode as expected
ch07/7.6/7.6.1/S7.6.1_A2 passed in non-strict mode
ch07/7.6/7.6.1/7.6.1.1/S7.6.1.1_A1.1 failed in non-strict mode as expected
ch07/7.6/7.6.1/7.6.1.1/S7.6.1.1_A1.10 failed in non-strict mode as expected
ch07/7.6/7.6.1/7.6.1.1/S7.6.1.1_A1.11 failed in non-strict mode as expected
ch07/7.6/7.6.1/7.6.1.1/S7.6.1.1_A1.12 failed in non-strict mode as expected
=== ch07/7.6/7.6.1/7.6.1.1/S7.6.1.1_A1.13 was expected to fail in non-strict mode, but didn't ===
=== ch07/7.6/7.6.1/7.6.1.1/S7.6.1.1_A1.14 was expected to fail in non-strict mode, but didn't ===
ch07/7.6/7.6.1/7.6.1.1/S7.6.1.1_A1.15 failed in non-strict mode as expected
ch07/7.6/7.6.1/7.6.1.1/S7.6.1.1_A1.16 failed in non-strict mode as expected
ch07/7.6/7.6.1/7.6.1.1/S7.6.1.1_A1.17 failed in non-strict mode as expected
ch07/7.6/7.6.1/7.6.1.1/S7.6.1.1_A1.18 failed in non-strict mode as expected
ch07/7.6/7.6.1/7.6.1.1/S7.6.1.1_A1.19 failed in non-strict mode as expected
=== ch07/7.6/7.6.1/7.6.1.1/S7.6.1.1_A1.2 was expected to fail in non-strict mode, but didn't ===
ch07/7.6/7.6.1/7.6.1.1/S7.6.1.1_A1.20 failed in non-strict mode as expected
ch07/7.6/7.6.1/7.6.1.1/S7.6.1.1_A1.21 failed in non-strict mode as expected
ch07/7.6/7.6.1/7.6.1.1/S7.6.1.1_A1.22 failed in non-strict mode as expected
ch07/7.6/7.6.1/7.6.1.1/S7.6.1.1_A1.23 failed in non-strict mode as expected
ch07/7.6/7.6.1/7.6.1.1/S7.6.1.1_A1.24 failed in non-strict mode as expected
ch07/7.6/7.6.1/7.6.1.1/S7.6.1.1_A1.25 failed in non-strict mode as expected
=== ch07/7.6/7.6.1/7.6.1.1/S7.6.1.1_A1.3 was expected to fail in non-strict mode, but didn't ===
ch07/7.6/7.6.1/7.6.1.1/S7.6.1.1_A1.4 failed in non-strict mode as expected
=== ch07/7.6/7.6.1/7.6.1.1/S7.6.1.1_A1.5 was expected to fail in non-strict mode, but didn't ===
ch07/7.6/7.6.1/7.6.1.1/S7.6.1.1_A1.6 failed in non-strict mode as expected
ch07/7.6/7.6.1/7.6.1.1/S7.6.1.1_A1.7 failed in non-strict mode as expected
=== ch07/7.6/7.6.1/7.6.1.1/S7.6.1.1_A1.8 was expected to fail in non-strict mode, but didn't ===
=== ch07/7.6/7.6.1/7.6.1.1/S7.6.1.1_A1.9 was expected to fail in non-strict mode, but didn't ===
=== ch07/7.6/7.6.1/7.6.1.2/7.6.1-17-s failed in strict mode ===
--- errors ---
Exception in thread "main" org.dynjs.exception.ThrowException: ReferenceError: step is not defined
at <global>.<anonymous>(/var/folders/vt/nrnb_cw95ps51fgmm9rq2mpw0000gn/T/test262-QUFcoy.js:419)
at <global>.<anonymous>(/var/folders/vt/nrnb_cw95ps51fgmm9rq2mpw0000gn/T/test262-QUFcoy.js:440)
at <global>.<eval>(/var/folders/vt/nrnb_cw95ps51fgmm9rq2mpw0000gn/T/test262-QUFcoy.js:411)
at org.dynjs.runtime.Reference.putValue(Reference.java:92)
at org.dynjs.gen.Function72.call(Unknown Source)
at org.dynjs.runtime.ExecutionContext.call(ExecutionContext.java:139)
at org.dynjs.gen.Function71.call(Unknown Source)
at org.dynjs.runtime.ExecutionContext.call(ExecutionContext.java:139)
at org.dynjs.gen.Program0.execute(Unknown Source)
at org.dynjs.runtime.ExecutionContext.execute(ExecutionContext.java:122)
at org.dynjs.runtime.DynJS.execute(DynJS.java:90)
at org.dynjs.runtime.DynJS.execute(DynJS.java:80)
at org.dynjs.runtime.DynJS.execute(DynJS.java:76)
at org.dynjs.cli.Main.executeFile(Main.java:73)
at org.dynjs.cli.Main.run(Main.java:60)
at org.dynjs.cli.Main.main(Main.java:46)
===
=== ch07/7.6/7.6.1/7.6.1.2/7.6.1-18-s failed in strict mode ===
--- errors ---
Exception in thread "main" org.dynjs.exception.ThrowException: ReferenceError: step is not defined
at <global>.<anonymous>(/var/folders/vt/nrnb_cw95ps51fgmm9rq2mpw0000gn/T/test262-JMf_yS.js:419)
at <global>.<anonymous>(/var/folders/vt/nrnb_cw95ps51fgmm9rq2mpw0000gn/T/test262-JMf_yS.js:440)
at <global>.<eval>(/var/folders/vt/nrnb_cw95ps51fgmm9rq2mpw0000gn/T/test262-JMf_yS.js:411)
at org.dynjs.runtime.Reference.putValue(Reference.java:92)
at org.dynjs.gen.Function72.call(Unknown Source)
at org.dynjs.runtime.ExecutionContext.call(ExecutionContext.java:139)
at org.dynjs.gen.Function71.call(Unknown Source)
at org.dynjs.runtime.ExecutionContext.call(ExecutionContext.java:139)
at org.dynjs.gen.Program0.execute(Unknown Source)
at org.dynjs.runtime.ExecutionContext.execute(ExecutionContext.java:122)
at org.dynjs.runtime.DynJS.execute(DynJS.java:90)
at org.dynjs.runtime.DynJS.execute(DynJS.java:80)
at org.dynjs.runtime.DynJS.execute(DynJS.java:76)
at org.dynjs.cli.Main.executeFile(Main.java:73)
at org.dynjs.cli.Main.run(Main.java:60)
at org.dynjs.cli.Main.main(Main.java:46)
===
=== ch07/7.6/7.6.1/7.6.1.2/7.6.1-19-s failed in strict mode ===
--- errors ---
Exception in thread "main" org.dynjs.exception.ThrowException: ReferenceError: step is not defined
at <global>.<anonymous>(/var/folders/vt/nrnb_cw95ps51fgmm9rq2mpw0000gn/T/test262-ER7ltu.js:419)
at <global>.<anonymous>(/var/folders/vt/nrnb_cw95ps51fgmm9rq2mpw0000gn/T/test262-ER7ltu.js:440)
at <global>.<eval>(/var/folders/vt/nrnb_cw95ps51fgmm9rq2mpw0000gn/T/test262-ER7ltu.js:411)
at org.dynjs.runtime.Reference.putValue(Reference.java:92)
at org.dynjs.gen.Function72.call(Unknown Source)
at org.dynjs.runtime.ExecutionContext.call(ExecutionContext.java:139)
at org.dynjs.gen.Function71.call(Unknown Source)
at org.dynjs.runtime.ExecutionContext.call(ExecutionContext.java:139)
at org.dynjs.gen.Program0.execute(Unknown Source)
at org.dynjs.runtime.ExecutionContext.execute(ExecutionContext.java:122)
at org.dynjs.runtime.DynJS.execute(DynJS.java:90)
at org.dynjs.runtime.DynJS.execute(DynJS.java:80)
at org.dynjs.runtime.DynJS.execute(DynJS.java:76)
at org.dynjs.cli.Main.executeFile(Main.java:73)
at org.dynjs.cli.Main.run(Main.java:60)
at org.dynjs.cli.Main.main(Main.java:46)
===
=== ch07/7.6/7.6.1/7.6.1.2/7.6.1-20-s failed in strict mode ===
--- errors ---
Exception in thread "main" org.dynjs.exception.ThrowException: ReferenceError: step is not defined
at <global>.<anonymous>(/var/folders/vt/nrnb_cw95ps51fgmm9rq2mpw0000gn/T/test262-ALO8qZ.js:419)
at <global>.<anonymous>(/var/folders/vt/nrnb_cw95ps51fgmm9rq2mpw0000gn/T/test262-ALO8qZ.js:440)
at <global>.<eval>(/var/folders/vt/nrnb_cw95ps51fgmm9rq2mpw0000gn/T/test262-ALO8qZ.js:411)
at org.dynjs.runtime.Reference.putValue(Reference.java:92)
at org.dynjs.gen.Function72.call(Unknown Source)
at org.dynjs.runtime.ExecutionContext.call(ExecutionContext.java:139)
at org.dynjs.gen.Function71.call(Unknown Source)
at org.dynjs.runtime.ExecutionContext.call(ExecutionContext.java:139)
at org.dynjs.gen.Program0.execute(Unknown Source)
at org.dynjs.runtime.ExecutionContext.execute(ExecutionContext.java:122)
at org.dynjs.runtime.DynJS.execute(DynJS.java:90)
at org.dynjs.runtime.DynJS.execute(DynJS.java:80)
at org.dynjs.runtime.DynJS.execute(DynJS.java:76)
at org.dynjs.cli.Main.executeFile(Main.java:73)
at org.dynjs.cli.Main.run(Main.java:60)
at org.dynjs.cli.Main.main(Main.java:46)
===
=== ch07/7.6/7.6.1/7.6.1.2/7.6.1-21-s failed in strict mode ===
--- errors ---
Exception in thread "main" org.dynjs.exception.ThrowException: ReferenceError: step is not defined
at <global>.<anonymous>(/var/folders/vt/nrnb_cw95ps51fgmm9rq2mpw0000gn/T/test262-x_OVUn.js:419)
at <global>.<anonymous>(/var/folders/vt/nrnb_cw95ps51fgmm9rq2mpw0000gn/T/test262-x_OVUn.js:440)
at <global>.<eval>(/var/folders/vt/nrnb_cw95ps51fgmm9rq2mpw0000gn/T/test262-x_OVUn.js:411)
at org.dynjs.runtime.Reference.putValue(Reference.java:92)
at org.dynjs.gen.Function72.call(Unknown Source)
at org.dynjs.runtime.ExecutionContext.call(ExecutionContext.java:139)
at org.dynjs.gen.Function71.call(Unknown Source)
at org.dynjs.runtime.ExecutionContext.call(ExecutionContext.java:139)
at org.dynjs.gen.Program0.execute(Unknown Source)
at org.dynjs.runtime.ExecutionContext.execute(ExecutionContext.java:122)
at org.dynjs.runtime.DynJS.execute(DynJS.java:90)
at org.dynjs.runtime.DynJS.execute(DynJS.java:80)
at org.dynjs.runtime.DynJS.execute(DynJS.java:76)
at org.dynjs.cli.Main.executeFile(Main.java:73)
at org.dynjs.cli.Main.run(Main.java:60)
at org.dynjs.cli.Main.main(Main.java:46)
===
=== ch07/7.6/7.6.1/7.6.1.2/7.6.1-22-s failed in strict mode ===
--- errors ---
Exception in thread "main" org.dynjs.exception.ThrowException: ReferenceError: step is not defined
at <global>.<anonymous>(/var/folders/vt/nrnb_cw95ps51fgmm9rq2mpw0000gn/T/test262-1Gf2Sh.js:419)
at <global>.<anonymous>(/var/folders/vt/nrnb_cw95ps51fgmm9rq2mpw0000gn/T/test262-1Gf2Sh.js:440)
at <global>.<eval>(/var/folders/vt/nrnb_cw95ps51fgmm9rq2mpw0000gn/T/test262-1Gf2Sh.js:411)
at org.dynjs.runtime.Reference.putValue(Reference.java:92)
at org.dynjs.gen.Function72.call(Unknown Source)
at org.dynjs.runtime.ExecutionContext.call(ExecutionContext.java:139)
at org.dynjs.gen.Function71.call(Unknown Source)
at org.dynjs.runtime.ExecutionContext.call(ExecutionContext.java:139)
at org.dynjs.gen.Program0.execute(Unknown Source)
at org.dynjs.runtime.ExecutionContext.execute(ExecutionContext.java:122)
at org.dynjs.runtime.DynJS.execute(DynJS.java:90)
at org.dynjs.runtime.DynJS.execute(DynJS.java:80)
at org.dynjs.runtime.DynJS.execute(DynJS.java:76)
at org.dynjs.cli.Main.executeFile(Main.java:73)
at org.dynjs.cli.Main.run(Main.java:60)
at org.dynjs.cli.Main.main(Main.java:46)
===
=== ch07/7.6/7.6.1/7.6.1.2/7.6.1-23-s failed in strict mode ===
--- errors ---
Exception in thread "main" org.dynjs.exception.ThrowException: ReferenceError: step is not defined
at <global>.<anonymous>(/var/folders/vt/nrnb_cw95ps51fgmm9rq2mpw0000gn/T/test262-Xdjmze.js:419)
at <global>.<anonymous>(/var/folders/vt/nrnb_cw95ps51fgmm9rq2mpw0000gn/T/test262-Xdjmze.js:440)
at <global>.<eval>(/var/folders/vt/nrnb_cw95ps51fgmm9rq2mpw0000gn/T/test262-Xdjmze.js:411)
at org.dynjs.runtime.Reference.putValue(Reference.java:92)
at org.dynjs.gen.Function72.call(Unknown Source)
at org.dynjs.runtime.ExecutionContext.call(ExecutionContext.java:139)
at org.dynjs.gen.Function71.call(Unknown Source)
at org.dynjs.runtime.ExecutionContext.call(ExecutionContext.java:139)
at org.dynjs.gen.Program0.execute(Unknown Source)
at org.dynjs.runtime.ExecutionContext.execute(ExecutionContext.java:122)
at org.dynjs.runtime.DynJS.execute(DynJS.java:90)
at org.dynjs.runtime.DynJS.execute(DynJS.java:80)
at org.dynjs.runtime.DynJS.execute(DynJS.java:76)
at org.dynjs.cli.Main.executeFile(Main.java:73)
at org.dynjs.cli.Main.run(Main.java:60)
at org.dynjs.cli.Main.main(Main.java:46)
===
=== ch07/7.6/7.6.1/7.6.1.2/7.6.1-24-s failed in strict mode ===
--- errors ---
Exception in thread "main" org.dynjs.exception.ThrowException: ReferenceError: step is not defined
at <global>.<anonymous>(/var/folders/vt/nrnb_cw95ps51fgmm9rq2mpw0000gn/T/test262-ZxaPej.js:419)
at <global>.<anonymous>(/var/folders/vt/nrnb_cw95ps51fgmm9rq2mpw0000gn/T/test262-ZxaPej.js:440)
at <global>.<eval>(/var/folders/vt/nrnb_cw95ps51fgmm9rq2mpw0000gn/T/test262-ZxaPej.js:411)
at org.dynjs.runtime.Reference.putValue(Reference.java:92)
at org.dynjs.gen.Function72.call(Unknown Source)
at org.dynjs.runtime.ExecutionContext.call(ExecutionContext.java:139)
at org.dynjs.gen.Function71.call(Unknown Source)
at org.dynjs.runtime.ExecutionContext.call(ExecutionContext.java:139)
at org.dynjs.gen.Program0.execute(Unknown Source)
at org.dynjs.runtime.ExecutionContext.execute(ExecutionContext.java:122)
at org.dynjs.runtime.DynJS.execute(DynJS.java:90)
at org.dynjs.runtime.DynJS.execute(DynJS.java:80)
at org.dynjs.runtime.DynJS.execute(DynJS.java:76)
at org.dynjs.cli.Main.executeFile(Main.java:73)
at org.dynjs.cli.Main.run(Main.java:60)
at org.dynjs.cli.Main.main(Main.java:46)
===
=== ch07/7.6/7.6.1/7.6.1.2/7.6.1-25-s failed in strict mode ===
--- errors ---
Exception in thread "main" org.dynjs.exception.ThrowException: ReferenceError: step is not defined
at <global>.<anonymous>(/var/folders/vt/nrnb_cw95ps51fgmm9rq2mpw0000gn/T/test262-78KbuP.js:419)
at <global>.<anonymous>(/var/folders/vt/nrnb_cw95ps51fgmm9rq2mpw0000gn/T/test262-78KbuP.js:440)
at <global>.<eval>(/var/folders/vt/nrnb_cw95ps51fgmm9rq2mpw0000gn/T/test262-78KbuP.js:411)
at org.dynjs.runtime.Reference.putValue(Reference.java:92)
at org.dynjs.gen.Function72.call(Unknown Source)
at org.dynjs.runtime.ExecutionContext.call(ExecutionContext.java:139)
at org.dynjs.gen.Function71.call(Unknown Source)
at org.dynjs.runtime.ExecutionContext.call(ExecutionContext.java:139)
at org.dynjs.gen.Program0.execute(Unknown Source)
at org.dynjs.runtime.ExecutionContext.execute(ExecutionContext.java:122)
at org.dynjs.runtime.DynJS.execute(DynJS.java:90)
at org.dynjs.runtime.DynJS.execute(DynJS.java:80)
at org.dynjs.runtime.DynJS.execute(DynJS.java:76)
at org.dynjs.cli.Main.executeFile(Main.java:73)
at org.dynjs.cli.Main.run(Main.java:60)
at org.dynjs.cli.Main.main(Main.java:46)
===
=== ch07/7.6/7.6.1/7.6.1.2/7.6.1.2-1-s failed in strict mode ===
--- errors ---
Exception in thread "main" org.dynjs.exception.ThrowException: ReferenceError: step is not defined
at <global>.<anonymous>(/var/folders/vt/nrnb_cw95ps51fgmm9rq2mpw0000gn/T/test262-BCAhXW.js:419)
at <global>.<anonymous>(/var/folders/vt/nrnb_cw95ps51fgmm9rq2mpw0000gn/T/test262-BCAhXW.js:440)
at <global>.<eval>(/var/folders/vt/nrnb_cw95ps51fgmm9rq2mpw0000gn/T/test262-BCAhXW.js:411)
at org.dynjs.runtime.Reference.putValue(Reference.java:92)
at org.dynjs.gen.Function72.call(Unknown Source)
at org.dynjs.runtime.ExecutionContext.call(ExecutionContext.java:139)
at org.dynjs.gen.Function71.call(Unknown Source)
at org.dynjs.runtime.ExecutionContext.call(ExecutionContext.java:139)
at org.dynjs.gen.Program0.execute(Unknown Source)
at org.dynjs.runtime.ExecutionContext.execute(ExecutionContext.java:122)
at org.dynjs.runtime.DynJS.execute(DynJS.java:90)
at org.dynjs.runtime.DynJS.execute(DynJS.java:80)
at org.dynjs.runtime.DynJS.execute(DynJS.java:76)
at org.dynjs.cli.Main.executeFile(Main.java:73)
at org.dynjs.cli.Main.run(Main.java:60)
at org.dynjs.cli.Main.main(Main.java:46)
===
=== ch07/7.6/7.6.1/7.6.1.2/7.6.1.2-10-s failed in strict mode ===
--- errors ---
Exception in thread "main" org.dynjs.exception.ThrowException: ReferenceError: step is not defined
at <global>.<anonymous>(/var/folders/vt/nrnb_cw95ps51fgmm9rq2mpw0000gn/T/test262-tz6VL8.js:419)
at <global>.<anonymous>(/var/folders/vt/nrnb_cw95ps51fgmm9rq2mpw0000gn/T/test262-tz6VL8.js:440)
at <global>.<eval>(/var/folders/vt/nrnb_cw95ps51fgmm9rq2mpw0000gn/T/test262-tz6VL8.js:411)
at org.dynjs.runtime.Reference.putValue(Reference.java:92)
at org.dynjs.gen.Function72.call(Unknown Source)
at org.dynjs.runtime.ExecutionContext.call(ExecutionContext.java:139)
at org.dynjs.gen.Function71.call(Unknown Source)
at org.dynjs.runtime.ExecutionContext.call(ExecutionContext.java:139)
at org.dynjs.gen.Program0.execute(Unknown Source)
at org.dynjs.runtime.ExecutionContext.execute(ExecutionContext.java:122)
at org.dynjs.runtime.DynJS.execute(DynJS.java:90)
at org.dynjs.runtime.DynJS.execute(DynJS.java:80)
at org.dynjs.runtime.DynJS.execute(DynJS.java:76)
at org.dynjs.cli.Main.executeFile(Main.java:73)
at org.dynjs.cli.Main.run(Main.java:60)
at org.dynjs.cli.Main.main(Main.java:46)
===
=== ch07/7.6/7.6.1/7.6.1.2/7.6.1.2-11-s failed in strict mode ===
--- errors ---
Exception in thread "main" org.dynjs.exception.ThrowException: ReferenceError: step is not defined
at <global>.<anonymous>(/var/folders/vt/nrnb_cw95ps51fgmm9rq2mpw0000gn/T/test262-6C62MN.js:419)
at <global>.<anonymous>(/var/folders/vt/nrnb_cw95ps51fgmm9rq2mpw0000gn/T/test262-6C62MN.js:440)
at <global>.<eval>(/var/folders/vt/nrnb_cw95ps51fgmm9rq2mpw0000gn/T/test262-6C62MN.js:411)
at org.dynjs.runtime.Reference.putValue(Reference.java:92)
at org.dynjs.gen.Function72.call(Unknown Source)
at org.dynjs.runtime.ExecutionContext.call(ExecutionContext.java:139)
at org.dynjs.gen.Function71.call(Unknown Source)
at org.dynjs.runtime.ExecutionContext.call(ExecutionContext.java:139)
at org.dynjs.gen.Program0.execute(Unknown Source)
at org.dynjs.runtime.ExecutionContext.execute(ExecutionContext.java:122)
at org.dynjs.runtime.DynJS.execute(DynJS.java:90)
at org.dynjs.runtime.DynJS.execute(DynJS.java:80)
at org.dynjs.runtime.DynJS.execute(DynJS.java:76)
at org.dynjs.cli.Main.executeFile(Main.java:73)
at org.dynjs.cli.Main.run(Main.java:60)
at org.dynjs.cli.Main.main(Main.java:46)
===
=== ch07/7.6/7.6.1/7.6.1.2/7.6.1.2-12-s failed in strict mode ===
--- errors ---
Exception in thread "main" org.dynjs.exception.ThrowException: ReferenceError: step is not defined
at <global>.<anonymous>(/var/folders/vt/nrnb_cw95ps51fgmm9rq2mpw0000gn/T/test262-BdK18R.js:419)
at <global>.<anonymous>(/var/folders/vt/nrnb_cw95ps51fgmm9rq2mpw0000gn/T/test262-BdK18R.js:440)
at <global>.<eval>(/var/folders/vt/nrnb_cw95ps51fgmm9rq2mpw0000gn/T/test262-BdK18R.js:411)
at org.dynjs.runtime.Reference.putValue(Reference.java:92)
at org.dynjs.gen.Function72.call(Unknown Source)
at org.dynjs.runtime.ExecutionContext.call(ExecutionContext.java:139)
at org.dynjs.gen.Function71.call(Unknown Source)
at org.dynjs.runtime.ExecutionContext.call(ExecutionContext.java:139)
at org.dynjs.gen.Program0.execute(Unknown Source)
at org.dynjs.runtime.ExecutionContext.execute(ExecutionContext.java:122)
at org.dynjs.runtime.DynJS.execute(DynJS.java:90)
at org.dynjs.runtime.DynJS.execute(DynJS.java:80)
at org.dynjs.runtime.DynJS.execute(DynJS.java:76)
at org.dynjs.cli.Main.executeFile(Main.java:73)
at org.dynjs.cli.Main.run(Main.java:60)
at org.dynjs.cli.Main.main(Main.java:46)
===
=== ch07/7.6/7.6.1/7.6.1.2/7.6.1.2-13-s failed in strict mode ===
--- errors ---
Exception in thread "main" org.dynjs.exception.ThrowException: ReferenceError: step is not defined
at <global>.<anonymous>(/var/folders/vt/nrnb_cw95ps51fgmm9rq2mpw0000gn/T/test262-kaePG4.js:419)
at <global>.<anonymous>(/var/folders/vt/nrnb_cw95ps51fgmm9rq2mpw0000gn/T/test262-kaePG4.js:440)
at <global>.<eval>(/var/folders/vt/nrnb_cw95ps51fgmm9rq2mpw0000gn/T/test262-kaePG4.js:411)
at org.dynjs.runtime.Reference.putValue(Reference.java:92)
at org.dynjs.gen.Function72.call(Unknown Source)
at org.dynjs.runtime.ExecutionContext.call(ExecutionContext.java:139)
at org.dynjs.gen.Function71.call(Unknown Source)
at org.dynjs.runtime.ExecutionContext.call(ExecutionContext.java:139)
at org.dynjs.gen.Program0.execute(Unknown Source)
at org.dynjs.runtime.ExecutionContext.execute(ExecutionContext.java:122)
at org.dynjs.runtime.DynJS.execute(DynJS.java:90)
at org.dynjs.runtime.DynJS.execute(DynJS.java:80)
at org.dynjs.runtime.DynJS.execute(DynJS.java:76)
at org.dynjs.cli.Main.executeFile(Main.java:73)
at org.dynjs.cli.Main.run(Main.java:60)
at org.dynjs.cli.Main.main(Main.java:46)
===
=== ch07/7.6/7.6.1/7.6.1.2/7.6.1.2-14-s failed in strict mode ===
--- errors ---
Exception in thread "main" org.dynjs.exception.ThrowException: ReferenceError: step is not defined
at <global>.<anonymous>(/var/folders/vt/nrnb_cw95ps51fgmm9rq2mpw0000gn/T/test262-fSbUiG.js:419)
at <global>.<anonymous>(/var/folders/vt/nrnb_cw95ps51fgmm9rq2mpw0000gn/T/test262-fSbUiG.js:440)
at <global>.<eval>(/var/folders/vt/nrnb_cw95ps51fgmm9rq2mpw0000gn/T/test262-fSbUiG.js:411)
at org.dynjs.runtime.Reference.putValue(Reference.java:92)
at org.dynjs.gen.Function72.call(Unknown Source)
at org.dynjs.runtime.ExecutionContext.call(ExecutionContext.java:139)
at org.dynjs.gen.Function71.call(Unknown Source)
at org.dynjs.runtime.ExecutionContext.call(ExecutionContext.java:139)
at org.dynjs.gen.Program0.execute(Unknown Source)
at org.dynjs.runtime.ExecutionContext.execute(ExecutionContext.java:122)
at org.dynjs.runtime.DynJS.execute(DynJS.java:90)
at org.dynjs.runtime.DynJS.execute(DynJS.java:80)
at org.dynjs.runtime.DynJS.execute(DynJS.java:76)
at org.dynjs.cli.Main.executeFile(Main.java:73)
at org.dynjs.cli.Main.run(Main.java:60)
at org.dynjs.cli.Main.main(Main.java:46)
===
=== ch07/7.6/7.6.1/7.6.1.2/7.6.1.2-16-s failed in strict mode ===
--- errors ---
Exception in thread "main" org.dynjs.exception.ThrowException: ReferenceError: step is not defined
at <global>.<anonymous>(/var/folders/vt/nrnb_cw95ps51fgmm9rq2mpw0000gn/T/test262-HFjrg2.js:419)
at <global>.<anonymous>(/var/folders/vt/nrnb_cw95ps51fgmm9rq2mpw0000gn/T/test262-HFjrg2.js:440)
at <global>.<eval>(/var/folders/vt/nrnb_cw95ps51fgmm9rq2mpw0000gn/T/test262-HFjrg2.js:411)
at org.dynjs.runtime.Reference.putValue(Reference.java:92)
at org.dynjs.gen.Function72.call(Unknown Source)
at org.dynjs.runtime.ExecutionContext.call(ExecutionContext.java:139)
at org.dynjs.gen.Function71.call(Unknown Source)
at org.dynjs.runtime.ExecutionContext.call(ExecutionContext.java:139)
at org.dynjs.gen.Program0.execute(Unknown Source)
at org.dynjs.runtime.ExecutionContext.execute(ExecutionContext.java:122)
at org.dynjs.runtime.DynJS.execute(DynJS.java:90)
at org.dynjs.runtime.DynJS.execute(DynJS.java:80)
at org.dynjs.runtime.DynJS.execute(DynJS.java:76)
at org.dynjs.cli.Main.executeFile(Main.java:73)
at org.dynjs.cli.Main.run(Main.java:60)
at org.dynjs.cli.Main.main(Main.java:46)
===
=== ch07/7.6/7.6.1/7.6.1.2/7.6.1.2-2-s failed in strict mode ===
--- errors ---
Exception in thread "main" org.dynjs.exception.ThrowException: ReferenceError: step is not defined
at <global>.<anonymous>(/var/folders/vt/nrnb_cw95ps51fgmm9rq2mpw0000gn/T/test262-_TswYd.js:419)
at <global>.<anonymous>(/var/folders/vt/nrnb_cw95ps51fgmm9rq2mpw0000gn/T/test262-_TswYd.js:440)
at <global>.<eval>(/var/folders/vt/nrnb_cw95ps51fgmm9rq2mpw0000gn/T/test262-_TswYd.js:411)
at org.dynjs.runtime.Reference.putValue(Reference.java:92)
at org.dynjs.gen.Function72.call(Unknown Source)
at org.dynjs.runtime.ExecutionContext.call(ExecutionContext.java:139)
at org.dynjs.gen.Function71.call(Unknown Source)
at org.dynjs.runtime.ExecutionContext.call(ExecutionContext.java:139)
at org.dynjs.gen.Program0.execute(Unknown Source)
at org.dynjs.runtime.ExecutionContext.execute(ExecutionContext.java:122)
at org.dynjs.runtime.DynJS.execute(DynJS.java:90)
at org.dynjs.runtime.DynJS.execute(DynJS.java:80)
at org.dynjs.runtime.DynJS.execute(DynJS.java:76)
at org.dynjs.cli.Main.executeFile(Main.java:73)
at org.dynjs.cli.Main.run(Main.java:60)
at org.dynjs.cli.Main.main(Main.java:46)
===
=== ch07/7.6/7.6.1/7.6.1.2/7.6.1.2-3-s failed in strict mode ===
--- errors ---
Exception in thread "main" org.dynjs.exception.ThrowException: ReferenceError: step is not defined
at <global>.<anonymous>(/var/folders/vt/nrnb_cw95ps51fgmm9rq2mpw0000gn/T/test262-GA7rPz.js:419)
at <global>.<anonymous>(/var/folders/vt/nrnb_cw95ps51fgmm9rq2mpw0000gn/T/test262-GA7rPz.js:440)
at <global>.<eval>(/var/folders/vt/nrnb_cw95ps51fgmm9rq2mpw0000gn/T/test262-GA7rPz.js:411)
at org.dynjs.runtime.Reference.putValue(Reference.java:92)
at org.dynjs.gen.Function72.call(Unknown Source)
at org.dynjs.runtime.ExecutionContext.call(ExecutionContext.java:139)
at org.dynjs.gen.Function71.call(Unknown Source)
at org.dynjs.runtime.ExecutionContext.call(ExecutionContext.java:139)
at org.dynjs.gen.Program0.execute(Unknown Source)
at org.dynjs.runtime.ExecutionContext.execute(ExecutionContext.java:122)
at org.dynjs.runtime.DynJS.execute(DynJS.java:90)
at org.dynjs.runtime.DynJS.execute(DynJS.java:80)
at org.dynjs.runtime.DynJS.execute(DynJS.java:76)
at org.dynjs.cli.Main.executeFile(Main.java:73)
at org.dynjs.cli.Main.run(Main.java:60)
at org.dynjs.cli.Main.main(Main.java:46)
===
=== ch07/7.6/7.6.1/7.6.1.2/7.6.1.2-4-s failed in strict mode ===
--- errors ---
Exception in thread "main" org.dynjs.exception.ThrowException: ReferenceError: step is not defined
at <global>.<anonymous>(/var/folders/vt/nrnb_cw95ps51fgmm9rq2mpw0000gn/T/test262-bmDjVL.js:419)
at <global>.<anonymous>(/var/folders/vt/nrnb_cw95ps51fgmm9rq2mpw0000gn/T/test262-bmDjVL.js:440)
at <global>.<eval>(/var/folders/vt/nrnb_cw95ps51fgmm9rq2mpw0000gn/T/test262-bmDjVL.js:411)
at org.dynjs.runtime.Reference.putValue(Reference.java:92)
at org.dynjs.gen.Function72.call(Unknown Source)
at org.dynjs.runtime.ExecutionContext.call(ExecutionContext.java:139)
at org.dynjs.gen.Function71.call(Unknown Source)
at org.dynjs.runtime.ExecutionContext.call(ExecutionContext.java:139)
at org.dynjs.gen.Program0.execute(Unknown Source)
at org.dynjs.runtime.ExecutionContext.execute(ExecutionContext.java:122)
at org.dynjs.runtime.DynJS.execute(DynJS.java:90)
at org.dynjs.runtime.DynJS.execute(DynJS.java:80)
at org.dynjs.runtime.DynJS.execute(DynJS.java:76)
at org.dynjs.cli.Main.executeFile(Main.java:73)
at org.dynjs.cli.Main.run(Main.java:60)
at org.dynjs.cli.Main.main(Main.java:46)
===
=== ch07/7.6/7.6.1/7.6.1.2/7.6.1.2-5-s failed in strict mode ===
--- errors ---
Exception in thread "main" org.dynjs.exception.ThrowException: ReferenceError: step is not defined
at <global>.<anonymous>(/var/folders/vt/nrnb_cw95ps51fgmm9rq2mpw0000gn/T/test262-639JhN.js:419)
at <global>.<anonymous>(/var/folders/vt/nrnb_cw95ps51fgmm9rq2mpw0000gn/T/test262-639JhN.js:440)
at <global>.<eval>(/var/folders/vt/nrnb_cw95ps51fgmm9rq2mpw0000gn/T/test262-639JhN.js:411)
at org.dynjs.runtime.Reference.putValue(Reference.java:92)
at org.dynjs.gen.Function72.call(Unknown Source)
at org.dynjs.runtime.ExecutionContext.call(ExecutionContext.java:139)
at org.dynjs.gen.Function71.call(Unknown Source)
at org.dynjs.runtime.ExecutionContext.call(ExecutionContext.java:139)
at org.dynjs.gen.Program0.execute(Unknown Source)
at org.dynjs.runtime.ExecutionContext.execute(ExecutionContext.java:122)
at org.dynjs.runtime.DynJS.execute(DynJS.java:90)
at org.dynjs.runtime.DynJS.execute(DynJS.java:80)
at org.dynjs.runtime.DynJS.execute(DynJS.java:76)
at org.dynjs.cli.Main.executeFile(Main.java:73)
at org.dynjs.cli.Main.run(Main.java:60)
at org.dynjs.cli.Main.main(Main.java:46)
===
=== ch07/7.6/7.6.1/7.6.1.2/7.6.1.2-6-s failed in strict mode ===
--- errors ---
Exception in thread "main" org.dynjs.exception.ThrowException: ReferenceError: step is not defined
at <global>.<anonymous>(/var/folders/vt/nrnb_cw95ps51fgmm9rq2mpw0000gn/T/test262-SNrPka.js:419)
at <global>.<anonymous>(/var/folders/vt/nrnb_cw95ps51fgmm9rq2mpw0000gn/T/test262-SNrPka.js:440)
at <global>.<eval>(/var/folders/vt/nrnb_cw95ps51fgmm9rq2mpw0000gn/T/test262-SNrPka.js:411)
at org.dynjs.runtime.Reference.putValue(Reference.java:92)
at org.dynjs.gen.Function72.call(Unknown Source)
at org.dynjs.runtime.ExecutionContext.call(ExecutionContext.java:139)
at org.dynjs.gen.Function71.call(Unknown Source)
at org.dynjs.runtime.ExecutionContext.call(ExecutionContext.java:139)
at org.dynjs.gen.Program0.execute(Unknown Source)
at org.dynjs.runtime.ExecutionContext.execute(ExecutionContext.java:122)
at org.dynjs.runtime.DynJS.execute(DynJS.java:90)
at org.dynjs.runtime.DynJS.execute(DynJS.java:80)
at org.dynjs.runtime.DynJS.execute(DynJS.java:76)
at org.dynjs.cli.Main.executeFile(Main.java:73)
at org.dynjs.cli.Main.run(Main.java:60)
at org.dynjs.cli.Main.main(Main.java:46)
===
=== ch07/7.6/7.6.1/7.6.1.2/7.6.1.2-7-s failed in strict mode ===
--- errors ---
Exception in thread "main" org.dynjs.exception.ThrowException: ReferenceError: step is not defined
at <global>.<anonymous>(/var/folders/vt/nrnb_cw95ps51fgmm9rq2mpw0000gn/T/test262-FsCvwv.js:419)
at <global>.<anonymous>(/var/folders/vt/nrnb_cw95ps51fgmm9rq2mpw0000gn/T/test262-FsCvwv.js:440)
at <global>.<eval>(/var/folders/vt/nrnb_cw95ps51fgmm9rq2mpw0000gn/T/test262-FsCvwv.js:411)
at org.dynjs.runtime.Reference.putValue(Reference.java:92)
at org.dynjs.gen.Function72.call(Unknown Source)
at org.dynjs.runtime.ExecutionContext.call(ExecutionContext.java:139)
at org.dynjs.gen.Function71.call(Unknown Source)
at org.dynjs.runtime.ExecutionContext.call(ExecutionContext.java:139)
at org.dynjs.gen.Program0.execute(Unknown Source)
at org.dynjs.runtime.ExecutionContext.execute(ExecutionContext.java:122)
at org.dynjs.runtime.DynJS.execute(DynJS.java:90)
at org.dynjs.runtime.DynJS.execute(DynJS.java:80)
at org.dynjs.runtime.DynJS.execute(DynJS.java:76)
at org.dynjs.cli.Main.executeFile(Main.java:73)
at org.dynjs.cli.Main.run(Main.java:60)
at org.dynjs.cli.Main.main(Main.java:46)
===
=== ch07/7.6/7.6.1/7.6.1.2/7.6.1.2-8-s failed in strict mode ===
--- errors ---
Exception in thread "main" org.dynjs.exception.ThrowException: ReferenceError: step is not defined
at <global>.<anonymous>(/var/folders/vt/nrnb_cw95ps51fgmm9rq2mpw0000gn/T/test262-_Bt_7K.js:419)
at <global>.<anonymous>(/var/folders/vt/nrnb_cw95ps51fgmm9rq2mpw0000gn/T/test262-_Bt_7K.js:440)
at <global>.<eval>(/var/folders/vt/nrnb_cw95ps51fgmm9rq2mpw0000gn/T/test262-_Bt_7K.js:411)
at org.dynjs.runtime.Reference.putValue(Reference.java:92)
at org.dynjs.gen.Function72.call(Unknown Source)
at org.dynjs.runtime.ExecutionContext.call(ExecutionContext.java:139)
at org.dynjs.gen.Function71.call(Unknown Source)
at org.dynjs.runtime.ExecutionContext.call(ExecutionContext.java:139)
at org.dynjs.gen.Program0.execute(Unknown Source)
at org.dynjs.runtime.ExecutionContext.execute(ExecutionContext.java:122)
at org.dynjs.runtime.DynJS.execute(DynJS.java:90)
at org.dynjs.runtime.DynJS.execute(DynJS.java:80)
at org.dynjs.runtime.DynJS.execute(DynJS.java:76)
at org.dynjs.cli.Main.executeFile(Main.java:73)
at org.dynjs.cli.Main.run(Main.java:60)
at org.dynjs.cli.Main.main(Main.java:46)
===
=== ch07/7.6/7.6.1/7.6.1.2/7.6.1.2-9-s failed in strict mode ===
--- errors ---
Exception in thread "main" org.dynjs.exception.ThrowException: ReferenceError: step is not defined
at <global>.<anonymous>(/var/folders/vt/nrnb_cw95ps51fgmm9rq2mpw0000gn/T/test262-4bpfVJ.js:419)
at <global>.<anonymous>(/var/folders/vt/nrnb_cw95ps51fgmm9rq2mpw0000gn/T/test262-4bpfVJ.js:440)
at <global>.<eval>(/var/folders/vt/nrnb_cw95ps51fgmm9rq2mpw0000gn/T/test262-4bpfVJ.js:411)
at org.dynjs.runtime.Reference.putValue(Reference.java:92)
at org.dynjs.gen.Function72.call(Unknown Source)
at org.dynjs.runtime.ExecutionContext.call(ExecutionContext.java:139)
at org.dynjs.gen.Function71.call(Unknown Source)
at org.dynjs.runtime.ExecutionContext.call(ExecutionContext.java:139)
at org.dynjs.gen.Program0.execute(Unknown Source)
at org.dynjs.runtime.ExecutionContext.execute(ExecutionContext.java:122)
at org.dynjs.runtime.DynJS.execute(DynJS.java:90)
at org.dynjs.runtime.DynJS.execute(DynJS.java:80)
at org.dynjs.runtime.DynJS.execute(DynJS.java:76)
at org.dynjs.cli.Main.executeFile(Main.java:73)
at org.dynjs.cli.Main.run(Main.java:60)
at org.dynjs.cli.Main.main(Main.java:46)
===
=== ch07/7.6/7.6.1/7.6.1.2/S7.6.1.2_A1.1 failed in non-strict mode ===
--- errors ---
Exception in thread "main" org.dynjs.parser.SyntaxError: /var/folders/vt/nrnb_cw95ps51fgmm9rq2mpw0000gn/T/test262-pgqAk3.js line 2177:4 mismatched input 'abstract' expecting Identifier
at org.dynjs.runtime.DynJS.parseSourceCode(DynJS.java:188)
at org.dynjs.runtime.DynJS.parseSourceCode(DynJS.java:176)
at org.dynjs.runtime.DynJS.compile(DynJS.java:151)
at org.dynjs.runtime.DynJS.execute(DynJS.java:89)
at org.dynjs.runtime.DynJS.execute(DynJS.java:80)
at org.dynjs.runtime.DynJS.execute(DynJS.java:76)
at org.dynjs.cli.Main.executeFile(Main.java:73)
at org.dynjs.cli.Main.run(Main.java:60)
at org.dynjs.cli.Main.main(Main.java:46)
===
ch07/7.6/7.6.1/7.6.1.2/S7.6.1.2_A1.10 failed in non-strict mode as expected
ch07/7.6/7.6.1/7.6.1.2/S7.6.1.2_A1.11 failed in non-strict mode as expected
=== ch07/7.6/7.6.1/7.6.1.2/S7.6.1.2_A1.12 failed in non-strict mode ===
--- errors ---
Exception in thread "main" org.dynjs.parser.SyntaxError: /var/folders/vt/nrnb_cw95ps51fgmm9rq2mpw0000gn/T/test262-35ies2.js line 2177:4 mismatched input 'final' expecting Identifier
at org.dynjs.runtime.DynJS.parseSourceCode(DynJS.java:188)
at org.dynjs.runtime.DynJS.parseSourceCode(DynJS.java:176)
at org.dynjs.runtime.DynJS.compile(DynJS.java:151)
at org.dynjs.runtime.DynJS.execute(DynJS.java:89)
at org.dynjs.runtime.DynJS.execute(DynJS.java:80)
at org.dynjs.runtime.DynJS.execute(DynJS.java:76)
at org.dynjs.cli.Main.executeFile(Main.java:73)
at org.dynjs.cli.Main.run(Main.java:60)
at org.dynjs.cli.Main.main(Main.java:46)
===
=== ch07/7.6/7.6.1/7.6.1.2/S7.6.1.2_A1.13 failed in non-strict mode ===
--- errors ---
Exception in thread "main" org.dynjs.parser.SyntaxError: /var/folders/vt/nrnb_cw95ps51fgmm9rq2mpw0000gn/T/test262-LyRAjQ.js line 2177:4 mismatched input 'float' expecting Identifier
at org.dynjs.runtime.DynJS.parseSourceCode(DynJS.java:188)
at org.dynjs.runtime.DynJS.parseSourceCode(DynJS.java:176)
at org.dynjs.runtime.DynJS.compile(DynJS.java:151)
at org.dynjs.runtime.DynJS.execute(DynJS.java:89)
at org.dynjs.runtime.DynJS.execute(DynJS.java:80)
at org.dynjs.runtime.DynJS.execute(DynJS.java:76)
at org.dynjs.cli.Main.executeFile(Main.java:73)
at org.dynjs.cli.Main.run(Main.java:60)
at org.dynjs.cli.Main.main(Main.java:46)
===
=== ch07/7.6/7.6.1/7.6.1.2/S7.6.1.2_A1.14 failed in non-strict mode ===
--- errors ---
Exception in thread "main" org.dynjs.parser.SyntaxError: /var/folders/vt/nrnb_cw95ps51fgmm9rq2mpw0000gn/T/test262-rgKNE7.js line 2177:4 mismatched input 'goto' expecting Identifier
at org.dynjs.runtime.DynJS.parseSourceCode(DynJS.java:188)
at org.dynjs.runtime.DynJS.parseSourceCode(DynJS.java:176)
at org.dynjs.runtime.DynJS.compile(DynJS.java:151)
at org.dynjs.runtime.DynJS.execute(DynJS.java:89)
at org.dynjs.runtime.DynJS.execute(DynJS.java:80)
at org.dynjs.runtime.DynJS.execute(DynJS.java:76)
at org.dynjs.cli.Main.executeFile(Main.java:73)
at org.dynjs.cli.Main.run(Main.java:60)
at org.dynjs.cli.Main.main(Main.java:46)
===
ch07/7.6/7.6.1/7.6.1.2/S7.6.1.2_A1.15 failed in strict mode as expected
ch07/7.6/7.6.1/7.6.1.2/S7.6.1.2_A1.15ns passed in non-strict mode
ch07/7.6/7.6.1/7.6.1.2/S7.6.1.2_A1.16 failed in non-strict mode as expected
=== ch07/7.6/7.6.1/7.6.1.2/S7.6.1.2_A1.17 failed in non-strict mode ===
--- errors ---
Exception in thread "main" org.dynjs.parser.SyntaxError: /var/folders/vt/nrnb_cw95ps51fgmm9rq2mpw0000gn/T/test262-QipfhV.js line 2177:4 mismatched input 'int' expecting Identifier
at org.dynjs.runtime.DynJS.parseSourceCode(DynJS.java:188)
at org.dynjs.runtime.DynJS.parseSourceCode(DynJS.java:176)
at org.dynjs.runtime.DynJS.compile(DynJS.java:151)
at org.dynjs.runtime.DynJS.execute(DynJS.java:89)
at org.dynjs.runtime.DynJS.execute(DynJS.java:80)
at org.dynjs.runtime.DynJS.execute(DynJS.java:76)
at org.dynjs.cli.Main.executeFile(Main.java:73)
at org.dynjs.cli.Main.run(Main.java:60)
at org.dynjs.cli.Main.main(Main.java:46)
===
ch07/7.6/7.6.1/7.6.1.2/S7.6.1.2_A1.18 failed in strict mode as expected
ch07/7.6/7.6.1/7.6.1.2/S7.6.1.2_A1.18ns passed in non-strict mode
=== ch07/7.6/7.6.1/7.6.1.2/S7.6.1.2_A1.19 failed in non-strict mode ===
--- errors ---
Exception in thread "main" org.dynjs.parser.SyntaxError: /var/folders/vt/nrnb_cw95ps51fgmm9rq2mpw0000gn/T/test262-o2ygIz.js line 2177:4 mismatched input 'long' expecting Identifier
at org.dynjs.runtime.DynJS.parseSourceCode(DynJS.java:188)
at org.dynjs.runtime.DynJS.parseSourceCode(DynJS.java:176)
at org.dynjs.runtime.DynJS.compile(DynJS.java:151)
at org.dynjs.runtime.DynJS.execute(DynJS.java:89)
at org.dynjs.runtime.DynJS.execute(DynJS.java:80)
at org.dynjs.runtime.DynJS.execute(DynJS.java:76)
at org.dynjs.cli.Main.executeFile(Main.java:73)
at org.dynjs.cli.Main.run(Main.java:60)
at org.dynjs.cli.Main.main(Main.java:46)
===
=== ch07/7.6/7.6.1/7.6.1.2/S7.6.1.2_A1.2 failed in non-strict mode ===
--- errors ---
Exception in thread "main" org.dynjs.parser.SyntaxError: /var/folders/vt/nrnb_cw95ps51fgmm9rq2mpw0000gn/T/test262-jpdIYx.js line 2177:4 mismatched input 'boolean' expecting Identifier
at org.dynjs.runtime.DynJS.parseSourceCode(DynJS.java:188)
at org.dynjs.runtime.DynJS.parseSourceCode(DynJS.java:176)
at org.dynjs.runtime.DynJS.compile(DynJS.java:151)
at org.dynjs.runtime.DynJS.execute(DynJS.java:89)
at org.dynjs.runtime.DynJS.execute(DynJS.java:80)
at org.dynjs.runtime.DynJS.execute(DynJS.java:76)
at org.dynjs.cli.Main.executeFile(Main.java:73)
at org.dynjs.cli.Main.run(Main.java:60)
at org.dynjs.cli.Main.main(Main.java:46)
===
=== ch07/7.6/7.6.1/7.6.1.2/S7.6.1.2_A1.20 failed in non-strict mode ===
--- errors ---
Exception in thread "main" org.dynjs.parser.SyntaxError: /var/folders/vt/nrnb_cw95ps51fgmm9rq2mpw0000gn/T/test262-rSG6FS.js line 2177:4 mismatched input 'native' expecting Identifier
at org.dynjs.runtime.DynJS.parseSourceCode(DynJS.java:188)
at org.dynjs.runtime.DynJS.parseSourceCode(DynJS.java:176)
at org.dynjs.runtime.DynJS.compile(DynJS.java:151)
at org.dynjs.runtime.DynJS.execute(DynJS.java:89)
at org.dynjs.runtime.DynJS.execute(DynJS.java:80)
at org.dynjs.runtime.DynJS.execute(DynJS.java:76)
at org.dynjs.cli.Main.executeFile(Main.java:73)
at org.dynjs.cli.Main.run(Main.java:60)
at org.dynjs.cli.Main.main(Main.java:46)
===
ch07/7.6/7.6.1/7.6.1.2/S7.6.1.2_A1.21 failed in strict mode as expected
ch07/7.6/7.6.1/7.6.1.2/S7.6.1.2_A1.21ns passed in non-strict mode
ch07/7.6/7.6.1/7.6.1.2/S7.6.1.2_A1.22 failed in strict mode as expected
ch07/7.6/7.6.1/7.6.1.2/S7.6.1.2_A1.22ns passed in non-strict mode
ch07/7.6/7.6.1/7.6.1.2/S7.6.1.2_A1.23 failed in strict mode as expected
ch07/7.6/7.6.1/7.6.1.2/S7.6.1.2_A1.23ns passed in non-strict mode
ch07/7.6/7.6.1/7.6.1.2/S7.6.1.2_A1.24 failed in strict mode as expected
ch07/7.6/7.6.1/7.6.1.2/S7.6.1.2_A1.24ns passed in non-strict mode
=== ch07/7.6/7.6.1/7.6.1.2/S7.6.1.2_A1.25 failed in non-strict mode ===
--- errors ---
Exception in thread "main" org.dynjs.parser.SyntaxError: /var/folders/vt/nrnb_cw95ps51fgmm9rq2mpw0000gn/T/test262-dv3IMs.js line 2177:4 mismatched input 'short' expecting Identifier
at org.dynjs.runtime.DynJS.parseSourceCode(DynJS.java:188)
at org.dynjs.runtime.DynJS.parseSourceCode(DynJS.java:176)
at org.dynjs.runtime.DynJS.compile(DynJS.java:151)
at org.dynjs.runtime.DynJS.execute(DynJS.java:89)
at org.dynjs.runtime.DynJS.execute(DynJS.java:80)
at org.dynjs.runtime.DynJS.execute(DynJS.java:76)
at org.dynjs.cli.Main.executeFile(Main.java:73)
at org.dynjs.cli.Main.run(Main.java:60)
at org.dynjs.cli.Main.main(Main.java:46)
===
ch07/7.6/7.6.1/7.6.1.2/S7.6.1.2_A1.26 failed in strict mode as expected
ch07/7.6/7.6.1/7.6.1.2/S7.6.1.2_A1.26ns passed in non-strict mode
ch07/7.6/7.6.1/7.6.1.2/S7.6.1.2_A1.27 failed in non-strict mode as expected
=== ch07/7.6/7.6.1/7.6.1.2/S7.6.1.2_A1.28 failed in non-strict mode ===
--- errors ---
Exception in thread "main" org.dynjs.parser.SyntaxError: /var/folders/vt/nrnb_cw95ps51fgmm9rq2mpw0000gn/T/test262-4UJS2k.js line 2177:4 mismatched input 'synchronized' expecting Identifier
at org.dynjs.runtime.DynJS.parseSourceCode(DynJS.java:188)
at org.dynjs.runtime.DynJS.parseSourceCode(DynJS.java:176)
at org.dynjs.runtime.DynJS.compile(DynJS.java:151)
at org.dynjs.runtime.DynJS.execute(DynJS.java:89)
at org.dynjs.runtime.DynJS.execute(DynJS.java:80)
at org.dynjs.runtime.DynJS.execute(DynJS.java:76)
at org.dynjs.cli.Main.executeFile(Main.java:73)
at org.dynjs.cli.Main.run(Main.java:60)
at org.dynjs.cli.Main.main(Main.java:46)
===
=== ch07/7.6/7.6.1/7.6.1.2/S7.6.1.2_A1.29 failed in non-strict mode ===
--- errors ---
Exception in thread "main" org.dynjs.parser.SyntaxError: /var/folders/vt/nrnb_cw95ps51fgmm9rq2mpw0000gn/T/test262-D_DVJ9.js line 2177:4 mismatched input 'throws' expecting Identifier
at org.dynjs.runtime.DynJS.parseSourceCode(DynJS.java:188)
at org.dynjs.runtime.DynJS.parseSourceCode(DynJS.java:176)
at org.dynjs.runtime.DynJS.compile(DynJS.java:151)
at org.dynjs.runtime.DynJS.execute(DynJS.java:89)
at org.dynjs.runtime.DynJS.execute(DynJS.java:80)
at org.dynjs.runtime.DynJS.execute(DynJS.java:76)
at org.dynjs.cli.Main.executeFile(Main.java:73)
at org.dynjs.cli.Main.run(Main.java:60)
at org.dynjs.cli.Main.main(Main.java:46)
===
=== ch07/7.6/7.6.1/7.6.1.2/S7.6.1.2_A1.3 failed in non-strict mode ===
--- errors ---
Exception in thread "main" org.dynjs.parser.SyntaxError: /var/folders/vt/nrnb_cw95ps51fgmm9rq2mpw0000gn/T/test262-evUX7l.js line 2177:4 mismatched input 'byte' expecting Identifier
at org.dynjs.runtime.DynJS.parseSourceCode(DynJS.java:188)
at org.dynjs.runtime.DynJS.parseSourceCode(DynJS.java:176)
at org.dynjs.runtime.DynJS.compile(DynJS.java:151)
at org.dynjs.runtime.DynJS.execute(DynJS.java:89)
at org.dynjs.runtime.DynJS.execute(DynJS.java:80)
at org.dynjs.runtime.DynJS.execute(DynJS.java:76)
at org.dynjs.cli.Main.executeFile(Main.java:73)
at org.dynjs.cli.Main.run(Main.java:60)
at org.dynjs.cli.Main.main(Main.java:46)
===
=== ch07/7.6/7.6.1/7.6.1.2/S7.6.1.2_A1.30 failed in non-strict mode ===
--- errors ---
Exception in thread "main" org.dynjs.parser.SyntaxError: /var/folders/vt/nrnb_cw95ps51fgmm9rq2mpw0000gn/T/test262-Z5jAOB.js line 2177:4 mismatched input 'transient' expecting Identifier
at org.dynjs.runtime.DynJS.parseSourceCode(DynJS.java:188)
at org.dynjs.runtime.DynJS.parseSourceCode(DynJS.java:176)
at org.dynjs.runtime.DynJS.compile(DynJS.java:151)
at org.dynjs.runtime.DynJS.execute(DynJS.java:89)
at org.dynjs.runtime.DynJS.execute(DynJS.java:80)
at org.dynjs.runtime.DynJS.execute(DynJS.java:76)
at org.dynjs.cli.Main.executeFile(Main.java:73)
at org.dynjs.cli.Main.run(Main.java:60)
at org.dynjs.cli.Main.main(Main.java:46)
===
=== ch07/7.6/7.6.1/7.6.1.2/S7.6.1.2_A1.31 failed in non-strict mode ===
--- errors ---
Exception in thread "main" org.dynjs.parser.SyntaxError: /var/folders/vt/nrnb_cw95ps51fgmm9rq2mpw0000gn/T/test262-pRy90V.js line 2177:4 mismatched input 'volatile' expecting Identifier
at org.dynjs.runtime.DynJS.parseSourceCode(DynJS.java:188)
at org.dynjs.runtime.DynJS.parseSourceCode(DynJS.java:176)
at org.dynjs.runtime.DynJS.compile(DynJS.java:151)
at org.dynjs.runtime.DynJS.execute(DynJS.java:89)
at org.dynjs.runtime.DynJS.execute(DynJS.java:80)
at org.dynjs.runtime.DynJS.execute(DynJS.java:76)
at org.dynjs.cli.Main.executeFile(Main.java:73)
at org.dynjs.cli.Main.run(Main.java:60)
at org.dynjs.cli.Main.main(Main.java:46)
===
=== ch07/7.6/7.6.1/7.6.1.2/S7.6.1.2_A1.4 failed in non-strict mode ===
--- errors ---
Exception in thread "main" org.dynjs.parser.SyntaxError: /var/folders/vt/nrnb_cw95ps51fgmm9rq2mpw0000gn/T/test262-dneakw.js line 2177:4 mismatched input 'char' expecting Identifier
at org.dynjs.runtime.DynJS.parseSourceCode(DynJS.java:188)
at org.dynjs.runtime.DynJS.parseSourceCode(DynJS.java:176)
at org.dynjs.runtime.DynJS.compile(DynJS.java:151)
at org.dynjs.runtime.DynJS.execute(DynJS.java:89)
at org.dynjs.runtime.DynJS.execute(DynJS.java:80)
at org.dynjs.runtime.DynJS.execute(DynJS.java:76)
at org.dynjs.cli.Main.executeFile(Main.java:73)
at org.dynjs.cli.Main.run(Main.java:60)
at org.dynjs.cli.Main.main(Main.java:46)
===
ch07/7.6/7.6.1/7.6.1.2/S7.6.1.2_A1.5 failed in non-strict mode as expected
ch07/7.6/7.6.1/7.6.1.2/S7.6.1.2_A1.6 failed in non-strict mode as expected
ch07/7.6/7.6.1/7.6.1.2/S7.6.1.2_A1.7 failed in non-strict mode as expected
=== ch07/7.6/7.6.1/7.6.1.2/S7.6.1.2_A1.8 failed in non-strict mode ===
--- errors ---
Exception in thread "main" org.dynjs.parser.SyntaxError: /var/folders/vt/nrnb_cw95ps51fgmm9rq2mpw0000gn/T/test262-9sb8_u.js line 2177:4 mismatched input 'double' expecting Identifier
at org.dynjs.runtime.DynJS.parseSourceCode(DynJS.java:188)
at org.dynjs.runtime.DynJS.parseSourceCode(DynJS.java:176)
at org.dynjs.runtime.DynJS.compile(DynJS.java:151)
at org.dynjs.runtime.DynJS.execute(DynJS.java:89)
at org.dynjs.runtime.DynJS.execute(DynJS.java:80)
at org.dynjs.runtime.DynJS.execute(DynJS.java:76)
at org.dynjs.cli.Main.executeFile(Main.java:73)
at org.dynjs.cli.Main.run(Main.java:60)
at org.dynjs.cli.Main.main(Main.java:46)
===
ch07/7.6/7.6.1/7.6.1.2/S7.6.1.2_A1.9 failed in non-strict mode as expected
ch07/7.7/S7.7_A1 passed in non-strict mode
ch07/7.7/S7.7_A2_T1 failed in non-strict mode as expected
ch07/7.7/S7.7_A2_T10 failed in non-strict mode as expected
ch07/7.7/S7.7_A2_T2 failed in non-strict mode as expected
ch07/7.7/S7.7_A2_T3 failed in non-strict mode as expected
ch07/7.7/S7.7_A2_T4 failed in non-strict mode as expected
ch07/7.7/S7.7_A2_T5 failed in non-strict mode as expected
ch07/7.7/S7.7_A2_T6 failed in non-strict mode as expected
ch07/7.7/S7.7_A2_T7 failed in non-strict mode as expected
ch07/7.7/S7.7_A2_T8 failed in non-strict mode as expected
ch07/7.7/S7.7_A2_T9 failed in non-strict mode as expected
ch07/7.8/7.8.1/S7.8.1_A1_T1 passed in non-strict mode
=== ch07/7.8/7.8.1/S7.8.1_A1_T2 failed in non-strict mode ===
--- errors ---
Exception in thread "main" org.dynjs.exception.ThrowException: SyntaxError: invalid flag 'u'
at <global>.<native function: BuiltinRegExp>(org/dynjs/runtime/builtins/types/BuiltinRegExp.java:0)
at <global>.<native function: BuiltinRegExp>(org/dynjs/runtime/builtins/types/BuiltinRegExp.java:0)
at <global>.<eval>(/var/folders/vt/nrnb_cw95ps51fgmm9rq2mpw0000gn/T/test262-Zx2UG6.js:2178)
at org.dynjs.runtime.builtins.types.regexp.DynRegExp.checkSyntaxOfFlags(DynRegExp.java:129)
at org.dynjs.runtime.builtins.types.regexp.DynRegExp.setPatternAndFlags(DynRegExp.java:30)
at org.dynjs.runtime.builtins.types.BuiltinRegExp.call(BuiltinRegExp.java:52)
at org.dynjs.runtime.AbstractNativeFunction.call(AbstractNativeFunction.java:62)
at org.dynjs.runtime.ExecutionContext.call(ExecutionContext.java:139)
at org.dynjs.runtime.ExecutionContext.construct(ExecutionContext.java:177)
at org.dynjs.runtime.builtins.types.BuiltinRegExp.newRegExp(BuiltinRegExp.java:65)
at org.dynjs.runtime.builtins.types.BuiltinRegExp.call(BuiltinRegExp.java:44)
at org.dynjs.runtime.AbstractNativeFunction.call(AbstractNativeFunction.java:62)
at org.dynjs.runtime.ExecutionContext.call(ExecutionContext.java:139)
at org.dynjs.gen.Program0.execute(Unknown Source)
at org.dynjs.runtime.ExecutionContext.execute(ExecutionContext.java:122)
at org.dynjs.runtime.DynJS.execute(DynJS.java:90)
at org.dynjs.runtime.DynJS.execute(DynJS.java:80)
at org.dynjs.runtime.DynJS.execute(DynJS.java:76)
at org.dynjs.cli.Main.executeFile(Main.java:73)
at org.dynjs.cli.Main.run(Main.java:60)
at org.dynjs.cli.Main.main(Main.java:46)
===
ch07/7.8/7.8.2/S7.8.2_A1_T1 passed in non-strict mode
ch07/7.8/7.8.2/S7.8.2_A1_T2 passed in non-strict mode
=== ch07/7.8/7.8.3/7.8.3-1-s failed in strict mode ===
--- errors ---
Exception in thread "main" org.dynjs.exception.ThrowException: ReferenceError: step is not defined
at <global>.<anonymous>(/var/folders/vt/nrnb_cw95ps51fgmm9rq2mpw0000gn/T/test262-NJEWlD.js:419)
at <global>.<anonymous>(/var/folders/vt/nrnb_cw95ps51fgmm9rq2mpw0000gn/T/test262-NJEWlD.js:440)
at <global>.<eval>(/var/folders/vt/nrnb_cw95ps51fgmm9rq2mpw0000gn/T/test262-NJEWlD.js:411)
at org.dynjs.runtime.Reference.putValue(Reference.java:92)
at org.dynjs.gen.Function72.call(Unknown Source)
at org.dynjs.runtime.ExecutionContext.call(ExecutionContext.java:139)
at org.dynjs.gen.Function71.call(Unknown Source)
at org.dynjs.runtime.ExecutionContext.call(ExecutionContext.java:139)
at org.dynjs.gen.Program0.execute(Unknown Source)
at org.dynjs.runtime.ExecutionContext.execute(ExecutionContext.java:122)
at org.dynjs.runtime.DynJS.execute(DynJS.java:90)
at org.dynjs.runtime.DynJS.execute(DynJS.java:80)
at org.dynjs.runtime.DynJS.execute(DynJS.java:76)
at org.dynjs.cli.Main.executeFile(Main.java:73)
at org.dynjs.cli.Main.run(Main.java:60)
at org.dynjs.cli.Main.main(Main.java:46)
===
ch07/7.8/7.8.3/7.8.3-1gs failed in strict mode as expected
=== ch07/7.8/7.8.3/7.8.3-2-s failed in strict mode ===
--- errors ---
Exception in thread "main" org.dynjs.exception.ThrowException: ReferenceError: step is not defined
at <global>.<anonymous>(/var/folders/vt/nrnb_cw95ps51fgmm9rq2mpw0000gn/T/test262-68Igpf.js:419)
at <global>.<anonymous>(/var/folders/vt/nrnb_cw95ps51fgmm9rq2mpw0000gn/T/test262-68Igpf.js:440)
at <global>.<eval>(/var/folders/vt/nrnb_cw95ps51fgmm9rq2mpw0000gn/T/test262-68Igpf.js:411)
at org.dynjs.runtime.Reference.putValue(Reference.java:92)
at org.dynjs.gen.Function72.call(Unknown Source)
at org.dynjs.runtime.ExecutionContext.call(ExecutionContext.java:139)
at org.dynjs.gen.Function71.call(Unknown Source)
at org.dynjs.runtime.ExecutionContext.call(ExecutionContext.java:139)
at org.dynjs.gen.Program0.execute(Unknown Source)
at org.dynjs.runtime.ExecutionContext.execute(ExecutionContext.java:122)
at org.dynjs.runtime.DynJS.execute(DynJS.java:90)
at org.dynjs.runtime.DynJS.execute(DynJS.java:80)
at org.dynjs.runtime.DynJS.execute(DynJS.java:76)
at org.dynjs.cli.Main.executeFile(Main.java:73)
at org.dynjs.cli.Main.run(Main.java:60)
at org.dynjs.cli.Main.main(Main.java:46)
===
ch07/7.8/7.8.3/7.8.3-2gs failed in strict mode as expected
=== ch07/7.8/7.8.3/7.8.3-3-s failed in strict mode ===
--- errors ---
Exception in thread "main" org.dynjs.exception.ThrowException: ReferenceError: step is not defined
at <global>.<anonymous>(/var/folders/vt/nrnb_cw95ps51fgmm9rq2mpw0000gn/T/test262-srvTvM.js:419)
at <global>.<anonymous>(/var/folders/vt/nrnb_cw95ps51fgmm9rq2mpw0000gn/T/test262-srvTvM.js:440)
at <global>.<eval>(/var/folders/vt/nrnb_cw95ps51fgmm9rq2mpw0000gn/T/test262-srvTvM.js:411)
at org.dynjs.runtime.Reference.putValue(Reference.java:92)
at org.dynjs.gen.Function72.call(Unknown Source)
at org.dynjs.runtime.ExecutionContext.call(ExecutionContext.java:139)
at org.dynjs.gen.Function71.call(Unknown Source)
at org.dynjs.runtime.ExecutionContext.call(ExecutionContext.java:139)
at org.dynjs.gen.Program0.execute(Unknown Source)
at org.dynjs.runtime.ExecutionContext.execute(ExecutionContext.java:122)
at org.dynjs.runtime.DynJS.execute(DynJS.java:90)
at org.dynjs.runtime.DynJS.execute(DynJS.java:80)
at org.dynjs.runtime.DynJS.execute(DynJS.java:76)
at org.dynjs.cli.Main.executeFile(Main.java:73)
at org.dynjs.cli.Main.run(Main.java:60)
at org.dynjs.cli.Main.main(Main.java:46)
===
ch07/7.8/7.8.3/7.8.3-3gs failed in strict mode as expected
=== ch07/7.8/7.8.3/7.8.3-4-s failed in strict mode ===
--- errors ---
Exception in thread "main" org.dynjs.exception.ThrowException: ReferenceError: step is not defined
at <global>.<anonymous>(/var/folders/vt/nrnb_cw95ps51fgmm9rq2mpw0000gn/T/test262-a1RQQX.js:419)
at <global>.<anonymous>(/var/folders/vt/nrnb_cw95ps51fgmm9rq2mpw0000gn/T/test262-a1RQQX.js:440)
at <global>.<eval>(/var/folders/vt/nrnb_cw95ps51fgmm9rq2mpw0000gn/T/test262-a1RQQX.js:411)
at org.dynjs.runtime.Reference.putValue(Reference.java:92)
at org.dynjs.gen.Function72.call(Unknown Source)
at org.dynjs.runtime.ExecutionContext.call(ExecutionContext.java:139)
at org.dynjs.gen.Function71.call(Unknown Source)
at org.dynjs.runtime.ExecutionContext.call(ExecutionContext.java:139)
at org.dynjs.gen.Program0.execute(Unknown Source)
at org.dynjs.runtime.ExecutionContext.execute(ExecutionContext.java:122)
at org.dynjs.runtime.DynJS.execute(DynJS.java:90)
at org.dynjs.runtime.DynJS.execute(DynJS.java:80)
at org.dynjs.runtime.DynJS.execute(DynJS.java:76)
at org.dynjs.cli.Main.executeFile(Main.java:73)
at org.dynjs.cli.Main.run(Main.java:60)
at org.dynjs.cli.Main.main(Main.java:46)
===
=== ch07/7.8/7.8.3/7.8.3-5-s failed in strict mode ===
--- errors ---
Exception in thread "main" org.dynjs.exception.ThrowException: ReferenceError: step is not defined
at <global>.<anonymous>(/var/folders/vt/nrnb_cw95ps51fgmm9rq2mpw0000gn/T/test262-gkmgT4.js:419)
at <global>.<anonymous>(/var/folders/vt/nrnb_cw95ps51fgmm9rq2mpw0000gn/T/test262-gkmgT4.js:440)
at <global>.<eval>(/var/folders/vt/nrnb_cw95ps51fgmm9rq2mpw0000gn/T/test262-gkmgT4.js:411)
at org.dynjs.runtime.Reference.putValue(Reference.java:92)
at org.dynjs.gen.Function72.call(Unknown Source)
at org.dynjs.runtime.ExecutionContext.call(ExecutionContext.java:139)
at org.dynjs.gen.Function71.call(Unknown Source)
at org.dynjs.runtime.ExecutionContext.call(ExecutionContext.java:139)
at org.dynjs.gen.Program0.execute(Unknown Source)
at org.dynjs.runtime.ExecutionContext.execute(ExecutionContext.java:122)
at org.dynjs.runtime.DynJS.execute(DynJS.java:90)
at org.dynjs.runtime.DynJS.execute(DynJS.java:80)
at org.dynjs.runtime.DynJS.execute(DynJS.java:76)
at org.dynjs.cli.Main.executeFile(Main.java:73)
at org.dynjs.cli.Main.run(Main.java:60)
at org.dynjs.cli.Main.main(Main.java:46)
===
=== ch07/7.8/7.8.3/7.8.3-6-s failed in strict mode ===
--- errors ---
Exception in thread "main" org.dynjs.exception.ThrowException: ReferenceError: step is not defined
at <global>.<anonymous>(/var/folders/vt/nrnb_cw95ps51fgmm9rq2mpw0000gn/T/test262-uCapgZ.js:419)
at <global>.<anonymous>(/var/folders/vt/nrnb_cw95ps51fgmm9rq2mpw0000gn/T/test262-uCapgZ.js:440)
at <global>.<eval>(/var/folders/vt/nrnb_cw95ps51fgmm9rq2mpw0000gn/T/test262-uCapgZ.js:411)
at org.dynjs.runtime.Reference.putValue(Reference.java:92)
at org.dynjs.gen.Function72.call(Unknown Source)
at org.dynjs.runtime.ExecutionContext.call(ExecutionContext.java:139)
at org.dynjs.gen.Function71.call(Unknown Source)
at org.dynjs.runtime.ExecutionContext.call(ExecutionContext.java:139)
at org.dynjs.gen.Program0.execute(Unknown Source)
at org.dynjs.runtime.ExecutionContext.execute(ExecutionContext.java:122)
at org.dynjs.runtime.DynJS.execute(DynJS.java:90)
at org.dynjs.runtime.DynJS.execute(DynJS.java:80)
at org.dynjs.runtime.DynJS.execute(DynJS.java:76)
at org.dynjs.cli.Main.executeFile(Main.java:73)
at org.dynjs.cli.Main.run(Main.java:60)
at org.dynjs.cli.Main.main(Main.java:46)
===
=== ch07/7.8/7.8.3/7.8.3-7-s failed in strict mode ===
--- errors ---
Exception in thread "main" org.dynjs.exception.ThrowException: ReferenceError: step is not defined
at <global>.<anonymous>(/var/folders/vt/nrnb_cw95ps51fgmm9rq2mpw0000gn/T/test262-3b8Z7H.js:419)
at <global>.<anonymous>(/var/folders/vt/nrnb_cw95ps51fgmm9rq2mpw0000gn/T/test262-3b8Z7H.js:440)
at <global>.<eval>(/var/folders/vt/nrnb_cw95ps51fgmm9rq2mpw0000gn/T/test262-3b8Z7H.js:411)
at org.dynjs.runtime.Reference.putValue(Reference.java:92)
at org.dynjs.gen.Function72.call(Unknown Source)
at org.dynjs.runtime.ExecutionContext.call(ExecutionContext.java:139)
at org.dynjs.gen.Function71.call(Unknown Source)
at org.dynjs.runtime.ExecutionContext.call(ExecutionContext.java:139)
at org.dynjs.gen.Program0.execute(Unknown Source)
at org.dynjs.runtime.ExecutionContext.execute(ExecutionContext.java:122)
at org.dynjs.runtime.DynJS.execute(DynJS.java:90)
at org.dynjs.runtime.DynJS.execute(DynJS.java:80)
at org.dynjs.runtime.DynJS.execute(DynJS.java:76)
at org.dynjs.cli.Main.executeFile(Main.java:73)
at org.dynjs.cli.Main.run(Main.java:60)
at org.dynjs.cli.Main.main(Main.java:46)
===
ch07/7.8/7.8.3/S7.8.3_A1.1_T1 passed in non-strict mode
ch07/7.8/7.8.3/S7.8.3_A1.1_T2 passed in non-strict mode
ch07/7.8/7.8.3/S7.8.3_A1.2_T1 passed in non-strict mode
ch07/7.8/7.8.3/S7.8.3_A1.2_T2 passed in non-strict mode
ch07/7.8/7.8.3/S7.8.3_A1.2_T3 passed in non-strict mode
ch07/7.8/7.8.3/S7.8.3_A1.2_T4 passed in non-strict mode
ch07/7.8/7.8.3/S7.8.3_A1.2_T5 passed in non-strict mode
ch07/7.8/7.8.3/S7.8.3_A1.2_T6 passed in non-strict mode
ch07/7.8/7.8.3/S7.8.3_A1.2_T7 passed in non-strict mode
ch07/7.8/7.8.3/S7.8.3_A1.2_T8 passed in non-strict mode
=== ch07/7.8/7.8.3/S7.8.3_A2.1_T1 failed in non-strict mode ===
--- errors ---
Exception in thread "main" org.dynjs.exception.ThrowException: java.lang.NumberFormatException: For input string: ".0"
at <global>.<eval>(/var/folders/vt/nrnb_cw95ps51fgmm9rq2mpw0000gn/T/test262-PNx4yx.js:2178)
at org.dynjs.runtime.ExecutionContext.execute(ExecutionContext.java:126)
at org.dynjs.runtime.DynJS.execute(DynJS.java:90)
at org.dynjs.runtime.DynJS.execute(DynJS.java:80)
at org.dynjs.runtime.DynJS.execute(DynJS.java:76)
at org.dynjs.cli.Main.executeFile(Main.java:73)
at org.dynjs.cli.Main.run(Main.java:60)
at org.dynjs.cli.Main.main(Main.java:46)
Caused by: java.lang.NumberFormatException: For input string: ".0"
at java.lang.NumberFormatException.forInputString(NumberFormatException.java:65)
at java.lang.Long.parseLong(Long.java:430)
at java.lang.Long.valueOf(Long.java:513)
at org.dynjs.gen.Program0.execute(Unknown Source)
at org.dynjs.runtime.ExecutionContext.execute(ExecutionContext.java:122)
... 6 more
===
=== ch07/7.8/7.8.3/S7.8.3_A2.1_T2 failed in non-strict mode ===
--- errors ---
Exception in thread "main" org.dynjs.exception.ThrowException: java.lang.NumberFormatException: For input string: ".00"
at <global>.<eval>(/var/folders/vt/nrnb_cw95ps51fgmm9rq2mpw0000gn/T/test262-pjHnJf.js:2178)
at org.dynjs.runtime.ExecutionContext.execute(ExecutionContext.java:126)
at org.dynjs.runtime.DynJS.execute(DynJS.java:90)
at org.dynjs.runtime.DynJS.execute(DynJS.java:80)
at org.dynjs.runtime.DynJS.execute(DynJS.java:76)
at org.dynjs.cli.Main.executeFile(Main.java:73)
at org.dynjs.cli.Main.run(Main.java:60)
at org.dynjs.cli.Main.main(Main.java:46)
Caused by: java.lang.NumberFormatException: For input string: ".00"
at java.lang.NumberFormatException.forInputString(NumberFormatException.java:65)
at java.lang.Long.parseLong(Long.java:430)
at java.lang.Long.valueOf(Long.java:513)
at org.dynjs.gen.Program0.execute(Unknown Source)
at org.dynjs.runtime.ExecutionContext.execute(ExecutionContext.java:122)
... 6 more
===
=== ch07/7.8/7.8.3/S7.8.3_A2.1_T3 failed in non-strict mode ===
--- errors ---
Exception in thread "main" org.dynjs.exception.ThrowException: java.lang.NumberFormatException: For input string: ".00"
at <global>.<eval>(/var/folders/vt/nrnb_cw95ps51fgmm9rq2mpw0000gn/T/test262-6R6zeT.js:2178)
at org.dynjs.runtime.ExecutionContext.execute(ExecutionContext.java:126)
at org.dynjs.runtime.DynJS.execute(DynJS.java:90)
at org.dynjs.runtime.DynJS.execute(DynJS.java:80)
at org.dynjs.runtime.DynJS.execute(DynJS.java:76)
at org.dynjs.cli.Main.executeFile(Main.java:73)
at org.dynjs.cli.Main.run(Main.java:60)
at org.dynjs.cli.Main.main(Main.java:46)
Caused by: java.lang.NumberFormatException: For input string: ".00"
at java.lang.NumberFormatException.forInputString(NumberFormatException.java:65)
at java.lang.Long.parseLong(Long.java:430)
at java.lang.Long.valueOf(Long.java:513)
at org.dynjs.gen.Program0.execute(Unknown Source)
at org.dynjs.runtime.ExecutionContext.execute(ExecutionContext.java:122)
... 6 more
===
=== ch07/7.8/7.8.3/S7.8.3_A2.2_T1 failed in non-strict mode ===
--- errors ---
Exception in thread "main" org.dynjs.exception.ThrowException: java.lang.NumberFormatException: multiple points
at <global>.<eval>(/var/folders/vt/nrnb_cw95ps51fgmm9rq2mpw0000gn/T/test262-JyQgPd.js:2178)
at org.dynjs.runtime.ExecutionContext.execute(ExecutionContext.java:126)
at org.dynjs.runtime.DynJS.execute(DynJS.java:90)
at org.dynjs.runtime.DynJS.execute(DynJS.java:80)
at org.dynjs.runtime.DynJS.execute(DynJS.java:76)
at org.dynjs.cli.Main.executeFile(Main.java:73)
at org.dynjs.cli.Main.run(Main.java:60)
at org.dynjs.cli.Main.main(Main.java:46)
Caused by: java.lang.NumberFormatException: multiple points
at sun.misc.FloatingDecimal.readJavaFormatString(FloatingDecimal.java:1101)
at java.lang.Double.valueOf(Double.java:504)
at org.dynjs.gen.Program0.execute(Unknown Source)
at org.dynjs.runtime.ExecutionContext.execute(ExecutionContext.java:122)
... 6 more
===
=== ch07/7.8/7.8.3/S7.8.3_A2.2_T2 failed in non-strict mode ===
--- errors ---
Exception in thread "main" org.dynjs.exception.ThrowException: java.lang.NumberFormatException: multiple points
at <global>.<eval>(/var/folders/vt/nrnb_cw95ps51fgmm9rq2mpw0000gn/T/test262-P43Eoa.js:2178)
at org.dynjs.runtime.ExecutionContext.execute(ExecutionContext.java:126)
at org.dynjs.runtime.DynJS.execute(DynJS.java:90)
at org.dynjs.runtime.DynJS.execute(DynJS.java:80)
at org.dynjs.runtime.DynJS.execute(DynJS.java:76)
at org.dynjs.cli.Main.executeFile(Main.java:73)
at org.dynjs.cli.Main.run(Main.java:60)
at org.dynjs.cli.Main.main(Main.java:46)
Caused by: java.lang.NumberFormatException: multiple points
at sun.misc.FloatingDecimal.readJavaFormatString(FloatingDecimal.java:1101)
at java.lang.Double.valueOf(Double.java:504)
at org.dynjs.gen.Program0.execute(Unknown Source)
at org.dynjs.runtime.ExecutionContext.execute(ExecutionContext.java:122)
... 6 more
===
=== ch07/7.8/7.8.3/S7.8.3_A2.2_T3 failed in non-strict mode ===
--- errors ---
Exception in thread "main" org.dynjs.exception.ThrowException: java.lang.NumberFormatException: multiple points
at <global>.<eval>(/var/folders/vt/nrnb_cw95ps51fgmm9rq2mpw0000gn/T/test262-kaMJeX.js:2178)
at org.dynjs.runtime.ExecutionContext.execute(ExecutionContext.java:126)
at org.dynjs.runtime.DynJS.execute(DynJS.java:90)
at org.dynjs.runtime.DynJS.execute(DynJS.java:80)
at org.dynjs.runtime.DynJS.execute(DynJS.java:76)
at org.dynjs.cli.Main.executeFile(Main.java:73)
at org.dynjs.cli.Main.run(Main.java:60)
at org.dynjs.cli.Main.main(Main.java:46)
Caused by: java.lang.NumberFormatException: multiple points
at sun.misc.FloatingDecimal.readJavaFormatString(FloatingDecimal.java:1101)
at java.lang.Double.valueOf(Double.java:504)
at org.dynjs.gen.Program0.execute(Unknown Source)
at org.dynjs.runtime.ExecutionContext.execute(ExecutionContext.java:122)
... 6 more
===
=== ch07/7.8/7.8.3/S7.8.3_A2.2_T4 failed in non-strict mode ===
--- errors ---
Exception in thread "main" org.dynjs.exception.ThrowException: java.lang.NumberFormatException: multiple points
at <global>.<eval>(/var/folders/vt/nrnb_cw95ps51fgmm9rq2mpw0000gn/T/test262-aRRfsQ.js:2178)
at org.dynjs.runtime.ExecutionContext.execute(ExecutionContext.java:126)
at org.dynjs.runtime.DynJS.execute(DynJS.java:90)
at org.dynjs.runtime.DynJS.execute(DynJS.java:80)
at org.dynjs.runtime.DynJS.execute(DynJS.java:76)
at org.dynjs.cli.Main.executeFile(Main.java:73)
at org.dynjs.cli.Main.run(Main.java:60)
at org.dynjs.cli.Main.main(Main.java:46)
Caused by: java.lang.NumberFormatException: multiple points
at sun.misc.FloatingDecimal.readJavaFormatString(FloatingDecimal.java:1101)
at java.lang.Double.valueOf(Double.java:504)
at org.dynjs.gen.Program0.execute(Unknown Source)
at org.dynjs.runtime.ExecutionContext.execute(ExecutionContext.java:122)
... 6 more
===
=== ch07/7.8/7.8.3/S7.8.3_A2.2_T5 failed in non-strict mode ===
--- errors ---
Exception in thread "main" org.dynjs.exception.ThrowException: java.lang.NumberFormatException: multiple points
at <global>.<eval>(/var/folders/vt/nrnb_cw95ps51fgmm9rq2mpw0000gn/T/test262-Mkfh00.js:2178)
at org.dynjs.runtime.ExecutionContext.execute(ExecutionContext.java:126)
at org.dynjs.runtime.DynJS.execute(DynJS.java:90)
at org.dynjs.runtime.DynJS.execute(DynJS.java:80)
at org.dynjs.runtime.DynJS.execute(DynJS.java:76)
at org.dynjs.cli.Main.executeFile(Main.java:73)
at org.dynjs.cli.Main.run(Main.java:60)
at org.dynjs.cli.Main.main(Main.java:46)
Caused by: java.lang.NumberFormatException: multiple points
at sun.misc.FloatingDecimal.readJavaFormatString(FloatingDecimal.java:1101)
at java.lang.Double.valueOf(Double.java:504)
at org.dynjs.gen.Program0.execute(Unknown Source)
at org.dynjs.runtime.ExecutionContext.execute(ExecutionContext.java:122)
... 6 more
===
=== ch07/7.8/7.8.3/S7.8.3_A2.2_T6 failed in non-strict mode ===
--- errors ---
Exception in thread "main" org.dynjs.exception.ThrowException: java.lang.NumberFormatException: multiple points
at <global>.<eval>(/var/folders/vt/nrnb_cw95ps51fgmm9rq2mpw0000gn/T/test262-4ebFld.js:2178)
at org.dynjs.runtime.ExecutionContext.execute(ExecutionContext.java:126)
at org.dynjs.runtime.DynJS.execute(DynJS.java:90)
at org.dynjs.runtime.DynJS.execute(DynJS.java:80)
at org.dynjs.runtime.DynJS.execute(DynJS.java:76)
at org.dynjs.cli.Main.executeFile(Main.java:73)
at org.dynjs.cli.Main.run(Main.java:60)
at org.dynjs.cli.Main.main(Main.java:46)
Caused by: java.lang.NumberFormatException: multiple points
at sun.misc.FloatingDecimal.readJavaFormatString(FloatingDecimal.java:1101)
at java.lang.Double.valueOf(Double.java:504)
at org.dynjs.gen.Program0.execute(Unknown Source)
at org.dynjs.runtime.ExecutionContext.execute(ExecutionContext.java:122)
... 6 more
===
=== ch07/7.8/7.8.3/S7.8.3_A2.2_T7 failed in non-strict mode ===
--- errors ---
Exception in thread "main" org.dynjs.exception.ThrowException: java.lang.NumberFormatException: multiple points
at <global>.<eval>(/var/folders/vt/nrnb_cw95ps51fgmm9rq2mpw0000gn/T/test262-fiz9SF.js:2178)
at org.dynjs.runtime.ExecutionContext.execute(ExecutionContext.java:126)
at org.dynjs.runtime.DynJS.execute(DynJS.java:90)
at org.dynjs.runtime.DynJS.execute(DynJS.java:80)
at org.dynjs.runtime.DynJS.execute(DynJS.java:76)
at org.dynjs.cli.Main.executeFile(Main.java:73)
at org.dynjs.cli.Main.run(Main.java:60)
at org.dynjs.cli.Main.main(Main.java:46)
Caused by: java.lang.NumberFormatException: multiple points
at sun.misc.FloatingDecimal.readJavaFormatString(FloatingDecimal.java:1101)
at java.lang.Double.valueOf(Double.java:504)
at org.dynjs.gen.Program0.execute(Unknown Source)
at org.dynjs.runtime.ExecutionContext.execute(ExecutionContext.java:122)
... 6 more
===
=== ch07/7.8/7.8.3/S7.8.3_A2.2_T8 failed in non-strict mode ===
--- errors ---
Exception in thread "main" org.dynjs.exception.ThrowException: java.lang.NumberFormatException: multiple points
at <global>.<eval>(/var/folders/vt/nrnb_cw95ps51fgmm9rq2mpw0000gn/T/test262-_yjLMC.js:2178)
at org.dynjs.runtime.ExecutionContext.execute(ExecutionContext.java:126)
at org.dynjs.runtime.DynJS.execute(DynJS.java:90)
at org.dynjs.runtime.DynJS.execute(DynJS.java:80)
at org.dynjs.runtime.DynJS.execute(DynJS.java:76)
at org.dynjs.cli.Main.executeFile(Main.java:73)
at org.dynjs.cli.Main.run(Main.java:60)
at org.dynjs.cli.Main.main(Main.java:46)
Caused by: java.lang.NumberFormatException: multiple points
at sun.misc.FloatingDecimal.readJavaFormatString(FloatingDecimal.java:1101)
at java.lang.Double.valueOf(Double.java:504)
at org.dynjs.gen.Program0.execute(Unknown Source)
at org.dynjs.runtime.ExecutionContext.execute(ExecutionContext.java:122)
... 6 more
===
ch07/7.8/7.8.3/S7.8.3_A3.1_T1 passed in non-strict mode
ch07/7.8/7.8.3/S7.8.3_A3.1_T2 passed in non-strict mode
ch07/7.8/7.8.3/S7.8.3_A3.2_T1 passed in non-strict mode
ch07/7.8/7.8.3/S7.8.3_A3.2_T2 passed in non-strict mode
ch07/7.8/7.8.3/S7.8.3_A3.2_T3 passed in non-strict mode
ch07/7.8/7.8.3/S7.8.3_A3.3_T1 passed in non-strict mode
ch07/7.8/7.8.3/S7.8.3_A3.3_T2 passed in non-strict mode
ch07/7.8/7.8.3/S7.8.3_A3.3_T3 passed in non-strict mode
ch07/7.8/7.8.3/S7.8.3_A3.3_T4 passed in non-strict mode
ch07/7.8/7.8.3/S7.8.3_A3.3_T5 passed in non-strict mode
ch07/7.8/7.8.3/S7.8.3_A3.3_T6 passed in non-strict mode
ch07/7.8/7.8.3/S7.8.3_A3.3_T7 passed in non-strict mode
ch07/7.8/7.8.3/S7.8.3_A3.3_T8 passed in non-strict mode
ch07/7.8/7.8.3/S7.8.3_A3.4_T1 passed in non-strict mode
ch07/7.8/7.8.3/S7.8.3_A3.4_T2 passed in non-strict mode
ch07/7.8/7.8.3/S7.8.3_A3.4_T3 passed in non-strict mode
ch07/7.8/7.8.3/S7.8.3_A3.4_T4 passed in non-strict mode
ch07/7.8/7.8.3/S7.8.3_A3.4_T5 passed in non-strict mode
ch07/7.8/7.8.3/S7.8.3_A3.4_T6 passed in non-strict mode
ch07/7.8/7.8.3/S7.8.3_A3.4_T7 passed in non-strict mode
ch07/7.8/7.8.3/S7.8.3_A3.4_T8 passed in non-strict mode
ch07/7.8/7.8.3/S7.8.3_A4.1_T1 failed in non-strict mode as expected
ch07/7.8/7.8.3/S7.8.3_A4.1_T2 failed in non-strict mode as expected
ch07/7.8/7.8.3/S7.8.3_A4.1_T3 failed in non-strict mode as expected
ch07/7.8/7.8.3/S7.8.3_A4.1_T4 failed in non-strict mode as expected
ch07/7.8/7.8.3/S7.8.3_A4.1_T5 failed in non-strict mode as expected
ch07/7.8/7.8.3/S7.8.3_A4.1_T6 failed in non-strict mode as expected
ch07/7.8/7.8.3/S7.8.3_A4.1_T7 failed in non-strict mode as expected
ch07/7.8/7.8.3/S7.8.3_A4.1_T8 failed in non-strict mode as expected
ch07/7.8/7.8.3/S7.8.3_A4.2_T1 passed in non-strict mode
ch07/7.8/7.8.3/S7.8.3_A4.2_T2 passed in non-strict mode
ch07/7.8/7.8.3/S7.8.3_A4.2_T3 passed in non-strict mode
ch07/7.8/7.8.3/S7.8.3_A4.2_T4 passed in non-strict mode
ch07/7.8/7.8.3/S7.8.3_A4.2_T5 passed in non-strict mode
ch07/7.8/7.8.3/S7.8.3_A4.2_T6 passed in non-strict mode
ch07/7.8/7.8.3/S7.8.3_A4.2_T7 passed in non-strict mode
ch07/7.8/7.8.3/S7.8.3_A4.2_T8 passed in non-strict mode
=== ch07/7.8/7.8.3/S7.8.3_A5.1_T1 failed in non-strict mode ===
--- errors ---
Exception in thread "main" org.dynjs.exception.ThrowException: java.lang.NumberFormatException: For input string: "0x.0E"
at <global>.<eval>(/var/folders/vt/nrnb_cw95ps51fgmm9rq2mpw0000gn/T/test262-Vo4RIX.js:2248)
at org.dynjs.runtime.ExecutionContext.execute(ExecutionContext.java:126)
at org.dynjs.runtime.DynJS.execute(DynJS.java:90)
at org.dynjs.runtime.DynJS.execute(DynJS.java:80)
at org.dynjs.runtime.DynJS.execute(DynJS.java:76)
at org.dynjs.cli.Main.executeFile(Main.java:73)
at org.dynjs.cli.Main.run(Main.java:60)
at org.dynjs.cli.Main.main(Main.java:46)
Caused by: java.lang.NumberFormatException: For input string: "0x.0E"
at sun.misc.FloatingDecimal.parseHexString(FloatingDecimal.java:1891)
at sun.misc.FloatingDecimal.readJavaFormatString(FloatingDecimal.java:1063)
at java.lang.Double.valueOf(Double.java:504)
at org.dynjs.gen.Program0.execute(Unknown Source)
at org.dynjs.runtime.ExecutionContext.execute(ExecutionContext.java:122)
... 6 more
===
=== ch07/7.8/7.8.3/S7.8.3_A5.1_T2 failed in non-strict mode ===
--- errors ---
Exception in thread "main" org.dynjs.exception.ThrowException: java.lang.NumberFormatException: For input string: "0X.0E"
at <global>.<eval>(/var/folders/vt/nrnb_cw95ps51fgmm9rq2mpw0000gn/T/test262-668Ghy.js:2248)
at org.dynjs.runtime.ExecutionContext.execute(ExecutionContext.java:126)
at org.dynjs.runtime.DynJS.execute(DynJS.java:90)
at org.dynjs.runtime.DynJS.execute(DynJS.java:80)
at org.dynjs.runtime.DynJS.execute(DynJS.java:76)
at org.dynjs.cli.Main.executeFile(Main.java:73)
at org.dynjs.cli.Main.run(Main.java:60)
at org.dynjs.cli.Main.main(Main.java:46)
Caused by: java.lang.NumberFormatException: For input string: "0X.0E"
at sun.misc.FloatingDecimal.parseHexString(FloatingDecimal.java:1891)
at sun.misc.FloatingDecimal.readJavaFormatString(FloatingDecimal.java:1063)
at java.lang.Double.valueOf(Double.java:504)
at org.dynjs.gen.Program0.execute(Unknown Source)
at org.dynjs.runtime.ExecutionContext.execute(ExecutionContext.java:122)
... 6 more
===
ch07/7.8/7.8.3/S7.8.3_A5.1_T3 passed in non-strict mode
ch07/7.8/7.8.3/S7.8.3_A5.1_T4 passed in non-strict mode
ch07/7.8/7.8.3/S7.8.3_A5.1_T5 passed in non-strict mode
ch07/7.8/7.8.3/S7.8.3_A5.1_T6 passed in non-strict mode
=== ch07/7.8/7.8.3/S7.8.3_A5.1_T7 failed in non-strict mode ===
--- errors ---
Exception in thread "main" org.dynjs.exception.ThrowException: java.lang.NumberFormatException: For input string: "0x.0e"
at <global>.<eval>(/var/folders/vt/nrnb_cw95ps51fgmm9rq2mpw0000gn/T/test262-pWnNv5.js:2198)
at org.dynjs.runtime.ExecutionContext.execute(ExecutionContext.java:126)
at org.dynjs.runtime.DynJS.execute(DynJS.java:90)
at org.dynjs.runtime.DynJS.execute(DynJS.java:80)
at org.dynjs.runtime.DynJS.execute(DynJS.java:76)
at org.dynjs.cli.Main.executeFile(Main.java:73)
at org.dynjs.cli.Main.run(Main.java:60)
at org.dynjs.cli.Main.main(Main.java:46)
Caused by: java.lang.NumberFormatException: For input string: "0x.0e"
at sun.misc.FloatingDecimal.parseHexString(FloatingDecimal.java:1891)
at sun.misc.FloatingDecimal.readJavaFormatString(FloatingDecimal.java:1063)
at java.lang.Double.valueOf(Double.java:504)
at org.dynjs.gen.Program0.execute(Unknown Source)
at org.dynjs.runtime.ExecutionContext.execute(ExecutionContext.java:122)
... 6 more
===
=== ch07/7.8/7.8.3/S7.8.3_A5.1_T8 failed in non-strict mode ===
--- errors ---
Exception in thread "main" org.dynjs.exception.ThrowException: java.lang.NumberFormatException: For input string: "0X.0e"
at <global>.<eval>(/var/folders/vt/nrnb_cw95ps51fgmm9rq2mpw0000gn/T/test262-acgoop.js:2198)
at org.dynjs.runtime.ExecutionContext.execute(ExecutionContext.java:126)
at org.dynjs.runtime.DynJS.execute(DynJS.java:90)
at org.dynjs.runtime.DynJS.execute(DynJS.java:80)
at org.dynjs.runtime.DynJS.execute(DynJS.java:76)
at org.dynjs.cli.Main.executeFile(Main.java:73)
at org.dynjs.cli.Main.run(Main.java:60)
at org.dynjs.cli.Main.main(Main.java:46)
Caused by: java.lang.NumberFormatException: For input string: "0X.0e"
at sun.misc.FloatingDecimal.parseHexString(FloatingDecimal.java:1891)
at sun.misc.FloatingDecimal.readJavaFormatString(FloatingDecimal.java:1063)
at java.lang.Double.valueOf(Double.java:504)
at org.dynjs.gen.Program0.execute(Unknown Source)
at org.dynjs.runtime.ExecutionContext.execute(ExecutionContext.java:122)
... 6 more
===
=== ch07/7.8/7.8.3/S7.8.3_A6.1_T1 was expected to fail in non-strict mode, but didn't ===
=== ch07/7.8/7.8.3/S7.8.3_A6.1_T2 was expected to fail in non-strict mode, but didn't ===
ch07/7.8/7.8.3/S7.8.3_A6.2_T1 failed in non-strict mode as expected
ch07/7.8/7.8.3/S7.8.3_A6.2_T2 failed in non-strict mode as expected
=== ch07/7.8/7.8.4/7.8.4-1-s failed in strict mode ===
--- errors ---
Exception in thread "main" org.dynjs.exception.ThrowException: ReferenceError: step is not defined
at <global>.<anonymous>(/var/folders/vt/nrnb_cw95ps51fgmm9rq2mpw0000gn/T/test262-p2FwQf.js:419)
at <global>.<anonymous>(/var/folders/vt/nrnb_cw95ps51fgmm9rq2mpw0000gn/T/test262-p2FwQf.js:440)
at <global>.<eval>(/var/folders/vt/nrnb_cw95ps51fgmm9rq2mpw0000gn/T/test262-p2FwQf.js:411)
at org.dynjs.runtime.Reference.putValue(Reference.java:92)
at org.dynjs.gen.Function72.call(Unknown Source)
at org.dynjs.runtime.ExecutionContext.call(ExecutionContext.java:139)
at org.dynjs.gen.Function71.call(Unknown Source)
at org.dynjs.runtime.ExecutionContext.call(ExecutionContext.java:139)
at org.dynjs.gen.Program0.execute(Unknown Source)
at org.dynjs.runtime.ExecutionContext.execute(ExecutionContext.java:122)
at org.dynjs.runtime.DynJS.execute(DynJS.java:90)
at org.dynjs.runtime.DynJS.execute(DynJS.java:80)
at org.dynjs.runtime.DynJS.execute(DynJS.java:76)
at org.dynjs.cli.Main.executeFile(Main.java:73)
at org.dynjs.cli.Main.run(Main.java:60)
at org.dynjs.cli.Main.main(Main.java:46)
===
=== ch07/7.8/7.8.4/7.8.4-10-s failed in strict mode ===
--- errors ---
Exception in thread "main" org.dynjs.exception.ThrowException: ReferenceError: step is not defined
at <global>.<anonymous>(/var/folders/vt/nrnb_cw95ps51fgmm9rq2mpw0000gn/T/test262-HqMooJ.js:419)
at <global>.<anonymous>(/var/folders/vt/nrnb_cw95ps51fgmm9rq2mpw0000gn/T/test262-HqMooJ.js:440)
at <global>.<eval>(/var/folders/vt/nrnb_cw95ps51fgmm9rq2mpw0000gn/T/test262-HqMooJ.js:411)
at org.dynjs.runtime.Reference.putValue(Reference.java:92)
at org.dynjs.gen.Function72.call(Unknown Source)
at org.dynjs.runtime.ExecutionContext.call(ExecutionContext.java:139)
at org.dynjs.gen.Function71.call(Unknown Source)
at org.dynjs.runtime.ExecutionContext.call(ExecutionContext.java:139)
at org.dynjs.gen.Program0.execute(Unknown Source)
at org.dynjs.runtime.ExecutionContext.execute(ExecutionContext.java:122)
at org.dynjs.runtime.DynJS.execute(DynJS.java:90)
at org.dynjs.runtime.DynJS.execute(DynJS.java:80)
at org.dynjs.runtime.DynJS.execute(DynJS.java:76)
at org.dynjs.cli.Main.executeFile(Main.java:73)
at org.dynjs.cli.Main.run(Main.java:60)
at org.dynjs.cli.Main.main(Main.java:46)
===
=== ch07/7.8/7.8.4/7.8.4-11-s failed in strict mode ===
--- errors ---
Exception in thread "main" org.dynjs.exception.ThrowException: ReferenceError: step is not defined
at <global>.<anonymous>(/var/folders/vt/nrnb_cw95ps51fgmm9rq2mpw0000gn/T/test262-B1VwM8.js:419)
at <global>.<anonymous>(/var/folders/vt/nrnb_cw95ps51fgmm9rq2mpw0000gn/T/test262-B1VwM8.js:440)
at <global>.<eval>(/var/folders/vt/nrnb_cw95ps51fgmm9rq2mpw0000gn/T/test262-B1VwM8.js:411)
at org.dynjs.runtime.Reference.putValue(Reference.java:92)
at org.dynjs.gen.Function72.call(Unknown Source)
at org.dynjs.runtime.ExecutionContext.call(ExecutionContext.java:139)
at org.dynjs.gen.Function71.call(Unknown Source)
at org.dynjs.runtime.ExecutionContext.call(ExecutionContext.java:139)
at org.dynjs.gen.Program0.execute(Unknown Source)
at org.dynjs.runtime.ExecutionContext.execute(ExecutionContext.java:122)
at org.dynjs.runtime.DynJS.execute(DynJS.java:90)
at org.dynjs.runtime.DynJS.execute(DynJS.java:80)
at org.dynjs.runtime.DynJS.execute(DynJS.java:76)
at org.dynjs.cli.Main.executeFile(Main.java:73)
at org.dynjs.cli.Main.run(Main.java:60)
at org.dynjs.cli.Main.main(Main.java:46)
===
=== ch07/7.8/7.8.4/7.8.4-12-s failed in strict mode ===
--- errors ---
Exception in thread "main" org.dynjs.exception.ThrowException: ReferenceError: step is not defined
at <global>.<anonymous>(/var/folders/vt/nrnb_cw95ps51fgmm9rq2mpw0000gn/T/test262-VSP1zD.js:419)
at <global>.<anonymous>(/var/folders/vt/nrnb_cw95ps51fgmm9rq2mpw0000gn/T/test262-VSP1zD.js:440)
at <global>.<eval>(/var/folders/vt/nrnb_cw95ps51fgmm9rq2mpw0000gn/T/test262-VSP1zD.js:411)
at org.dynjs.runtime.Reference.putValue(Reference.java:92)
at org.dynjs.gen.Function72.call(Unknown Source)
at org.dynjs.runtime.ExecutionContext.call(ExecutionContext.java:139)
at org.dynjs.gen.Function71.call(Unknown Source)
at org.dynjs.runtime.ExecutionContext.call(ExecutionContext.java:139)
at org.dynjs.gen.Program0.execute(Unknown Source)
at org.dynjs.runtime.ExecutionContext.execute(ExecutionContext.java:122)
at org.dynjs.runtime.DynJS.execute(DynJS.java:90)
at org.dynjs.runtime.DynJS.execute(DynJS.java:80)
at org.dynjs.runtime.DynJS.execute(DynJS.java:76)
at org.dynjs.cli.Main.executeFile(Main.java:73)
at org.dynjs.cli.Main.run(Main.java:60)
at org.dynjs.cli.Main.main(Main.java:46)
===
=== ch07/7.8/7.8.4/7.8.4-13-s failed in strict mode ===
--- errors ---
Exception in thread "main" org.dynjs.exception.ThrowException: ReferenceError: step is not defined
at <global>.<anonymous>(/var/folders/vt/nrnb_cw95ps51fgmm9rq2mpw0000gn/T/test262-123360.js:419)
at <global>.<anonymous>(/var/folders/vt/nrnb_cw95ps51fgmm9rq2mpw0000gn/T/test262-123360.js:440)
at <global>.<eval>(/var/folders/vt/nrnb_cw95ps51fgmm9rq2mpw0000gn/T/test262-123360.js:411)
at org.dynjs.runtime.Reference.putValue(Reference.java:92)
at org.dynjs.gen.Function72.call(Unknown Source)
at org.dynjs.runtime.ExecutionContext.call(ExecutionContext.java:139)
at org.dynjs.gen.Function71.call(Unknown Source)
at org.dynjs.runtime.ExecutionContext.call(ExecutionContext.java:139)
at org.dynjs.gen.Program0.execute(Unknown Source)
at org.dynjs.runtime.ExecutionContext.execute(ExecutionContext.java:122)
at org.dynjs.runtime.DynJS.execute(DynJS.java:90)
at org.dynjs.runtime.DynJS.execute(DynJS.java:80)
at org.dynjs.runtime.DynJS.execute(DynJS.java:76)
at org.dynjs.cli.Main.executeFile(Main.java:73)
at org.dynjs.cli.Main.run(Main.java:60)
at org.dynjs.cli.Main.main(Main.java:46)
===
=== ch07/7.8/7.8.4/7.8.4-14-s failed in strict mode ===
--- errors ---
Exception in thread "main" org.dynjs.exception.ThrowException: ReferenceError: step is not defined
at <global>.<anonymous>(/var/folders/vt/nrnb_cw95ps51fgmm9rq2mpw0000gn/T/test262-Y1pDXW.js:419)
at <global>.<anonymous>(/var/folders/vt/nrnb_cw95ps51fgmm9rq2mpw0000gn/T/test262-Y1pDXW.js:440)
at <global>.<eval>(/var/folders/vt/nrnb_cw95ps51fgmm9rq2mpw0000gn/T/test262-Y1pDXW.js:411)
at org.dynjs.runtime.Reference.putValue(Reference.java:92)
at org.dynjs.gen.Function72.call(Unknown Source)
at org.dynjs.runtime.ExecutionContext.call(ExecutionContext.java:139)
at org.dynjs.gen.Function71.call(Unknown Source)
at org.dynjs.runtime.ExecutionContext.call(ExecutionContext.java:139)
at org.dynjs.gen.Program0.execute(Unknown Source)
at org.dynjs.runtime.ExecutionContext.execute(ExecutionContext.java:122)
at org.dynjs.runtime.DynJS.execute(DynJS.java:90)
at org.dynjs.runtime.DynJS.execute(DynJS.java:80)
at org.dynjs.runtime.DynJS.execute(DynJS.java:76)
at org.dynjs.cli.Main.executeFile(Main.java:73)
at org.dynjs.cli.Main.run(Main.java:60)
at org.dynjs.cli.Main.main(Main.java:46)
===
=== ch07/7.8/7.8.4/7.8.4-15-s failed in strict mode ===
--- errors ---
Exception in thread "main" org.dynjs.exception.ThrowException: ReferenceError: step is not defined
at <global>.<anonymous>(/var/folders/vt/nrnb_cw95ps51fgmm9rq2mpw0000gn/T/test262-Wmws5u.js:419)
at <global>.<anonymous>(/var/folders/vt/nrnb_cw95ps51fgmm9rq2mpw0000gn/T/test262-Wmws5u.js:440)
at <global>.<eval>(/var/folders/vt/nrnb_cw95ps51fgmm9rq2mpw0000gn/T/test262-Wmws5u.js:411)
at org.dynjs.runtime.Reference.putValue(Reference.java:92)
at org.dynjs.gen.Function72.call(Unknown Source)
at org.dynjs.runtime.ExecutionContext.call(ExecutionContext.java:139)
at org.dynjs.gen.Function71.call(Unknown Source)
at org.dynjs.runtime.ExecutionContext.call(ExecutionContext.java:139)
at org.dynjs.gen.Program0.execute(Unknown Source)
at org.dynjs.runtime.ExecutionContext.execute(ExecutionContext.java:122)
at org.dynjs.runtime.DynJS.execute(DynJS.java:90)
at org.dynjs.runtime.DynJS.execute(DynJS.java:80)
at org.dynjs.runtime.DynJS.execute(DynJS.java:76)
at org.dynjs.cli.Main.executeFile(Main.java:73)
at org.dynjs.cli.Main.run(Main.java:60)
at org.dynjs.cli.Main.main(Main.java:46)
===
=== ch07/7.8/7.8.4/7.8.4-16-s failed in strict mode ===
--- errors ---
Exception in thread "main" org.dynjs.exception.ThrowException: ReferenceError: step is not defined
at <global>.<anonymous>(/var/folders/vt/nrnb_cw95ps51fgmm9rq2mpw0000gn/T/test262-7a5Wbo.js:419)
at <global>.<anonymous>(/var/folders/vt/nrnb_cw95ps51fgmm9rq2mpw0000gn/T/test262-7a5Wbo.js:440)
at <global>.<eval>(/var/folders/vt/nrnb_cw95ps51fgmm9rq2mpw0000gn/T/test262-7a5Wbo.js:411)
at org.dynjs.runtime.Reference.putValue(Reference.java:92)
at org.dynjs.gen.Function72.call(Unknown Source)
at org.dynjs.runtime.ExecutionContext.call(ExecutionContext.java:139)
at org.dynjs.gen.Function71.call(Unknown Source)
at org.dynjs.runtime.ExecutionContext.call(ExecutionContext.java:139)
at org.dynjs.gen.Program0.execute(Unknown Source)
at org.dynjs.runtime.ExecutionContext.execute(ExecutionContext.java:122)
at org.dynjs.runtime.DynJS.execute(DynJS.java:90)
at org.dynjs.runtime.DynJS.execute(DynJS.java:80)
at org.dynjs.runtime.DynJS.execute(DynJS.java:76)
at org.dynjs.cli.Main.executeFile(Main.java:73)
at org.dynjs.cli.Main.run(Main.java:60)
at org.dynjs.cli.Main.main(Main.java:46)
===
=== ch07/7.8/7.8.4/7.8.4-17-s failed in strict mode ===
--- errors ---
Exception in thread "main" org.dynjs.exception.ThrowException: ReferenceError: step is not defined
at <global>.<anonymous>(/var/folders/vt/nrnb_cw95ps51fgmm9rq2mpw0000gn/T/test262-Jtf9Tj.js:419)
at <global>.<anonymous>(/var/folders/vt/nrnb_cw95ps51fgmm9rq2mpw0000gn/T/test262-Jtf9Tj.js:440)
at <global>.<eval>(/var/folders/vt/nrnb_cw95ps51fgmm9rq2mpw0000gn/T/test262-Jtf9Tj.js:411)
at org.dynjs.runtime.Reference.putValue(Reference.java:92)
at org.dynjs.gen.Function72.call(Unknown Source)
at org.dynjs.runtime.ExecutionContext.call(ExecutionContext.java:139)
at org.dynjs.gen.Function71.call(Unknown Source)
at org.dynjs.runtime.ExecutionContext.call(ExecutionContext.java:139)
at org.dynjs.gen.Program0.execute(Unknown Source)
at org.dynjs.runtime.ExecutionContext.execute(ExecutionContext.java:122)
at org.dynjs.runtime.DynJS.execute(DynJS.java:90)
at org.dynjs.runtime.DynJS.execute(DynJS.java:80)
at org.dynjs.runtime.DynJS.execute(DynJS.java:76)
at org.dynjs.cli.Main.executeFile(Main.java:73)
at org.dynjs.cli.Main.run(Main.java:60)
at org.dynjs.cli.Main.main(Main.java:46)
===
=== ch07/7.8/7.8.4/7.8.4-18-s failed in strict mode ===
--- errors ---
Exception in thread "main" org.dynjs.exception.ThrowException: ReferenceError: step is not defined
at <global>.<anonymous>(/var/folders/vt/nrnb_cw95ps51fgmm9rq2mpw0000gn/T/test262-XGFRzd.js:419)
at <global>.<anonymous>(/var/folders/vt/nrnb_cw95ps51fgmm9rq2mpw0000gn/T/test262-XGFRzd.js:440)
at <global>.<eval>(/var/folders/vt/nrnb_cw95ps51fgmm9rq2mpw0000gn/T/test262-XGFRzd.js:411)
at org.dynjs.runtime.Reference.putValue(Reference.java:92)
at org.dynjs.gen.Function72.call(Unknown Source)
at org.dynjs.runtime.ExecutionContext.call(ExecutionContext.java:139)
at org.dynjs.gen.Function71.call(Unknown Source)
at org.dynjs.runtime.ExecutionContext.call(ExecutionContext.java:139)
at org.dynjs.gen.Program0.execute(Unknown Source)
at org.dynjs.runtime.ExecutionContext.execute(ExecutionContext.java:122)
at org.dynjs.runtime.DynJS.execute(DynJS.java:90)
at org.dynjs.runtime.DynJS.execute(DynJS.java:80)
at org.dynjs.runtime.DynJS.execute(DynJS.java:76)
at org.dynjs.cli.Main.executeFile(Main.java:73)
at org.dynjs.cli.Main.run(Main.java:60)
at org.dynjs.cli.Main.main(Main.java:46)
===
=== ch07/7.8/7.8.4/7.8.4-19-s failed in strict mode ===
--- errors ---
Exception in thread "main" org.dynjs.exception.ThrowException: ReferenceError: step is not defined
at <global>.<anonymous>(/var/folders/vt/nrnb_cw95ps51fgmm9rq2mpw0000gn/T/test262-oAntxv.js:419)
at <global>.<anonymous>(/var/folders/vt/nrnb_cw95ps51fgmm9rq2mpw0000gn/T/test262-oAntxv.js:440)
at <global>.<eval>(/var/folders/vt/nrnb_cw95ps51fgmm9rq2mpw0000gn/T/test262-oAntxv.js:411)
at org.dynjs.runtime.Reference.putValue(Reference.java:92)
at org.dynjs.gen.Function72.call(Unknown Source)
at org.dynjs.runtime.ExecutionContext.call(ExecutionContext.java:139)
at org.dynjs.gen.Function71.call(Unknown Source)
at org.dynjs.runtime.ExecutionContext.call(ExecutionContext.java:139)
at org.dynjs.gen.Program0.execute(Unknown Source)
at org.dynjs.runtime.ExecutionContext.execute(ExecutionContext.java:122)
at org.dynjs.runtime.DynJS.execute(DynJS.java:90)
at org.dynjs.runtime.DynJS.execute(DynJS.java:80)
at org.dynjs.runtime.DynJS.execute(DynJS.java:76)
at org.dynjs.cli.Main.executeFile(Main.java:73)
at org.dynjs.cli.Main.run(Main.java:60)
at org.dynjs.cli.Main.main(Main.java:46)
===
ch07/7.8/7.8.4/7.8.4-1gs failed in strict mode as expected
=== ch07/7.8/7.8.4/7.8.4-2-s failed in strict mode ===
--- errors ---
Exception in thread "main" org.dynjs.exception.ThrowException: ReferenceError: step is not defined
at <global>.<anonymous>(/var/folders/vt/nrnb_cw95ps51fgmm9rq2mpw0000gn/T/test262-l0Mrfr.js:419)
at <global>.<anonymous>(/var/folders/vt/nrnb_cw95ps51fgmm9rq2mpw0000gn/T/test262-l0Mrfr.js:440)
at <global>.<eval>(/var/folders/vt/nrnb_cw95ps51fgmm9rq2mpw0000gn/T/test262-l0Mrfr.js:411)
at org.dynjs.runtime.Reference.putValue(Reference.java:92)
at org.dynjs.gen.Function72.call(Unknown Source)
at org.dynjs.runtime.ExecutionContext.call(ExecutionContext.java:139)
at org.dynjs.gen.Function71.call(Unknown Source)
at org.dynjs.runtime.ExecutionContext.call(ExecutionContext.java:139)
at org.dynjs.gen.Program0.execute(Unknown Source)
at org.dynjs.runtime.ExecutionContext.execute(ExecutionContext.java:122)
at org.dynjs.runtime.DynJS.execute(DynJS.java:90)
at org.dynjs.runtime.DynJS.execute(DynJS.java:80)
at org.dynjs.runtime.DynJS.execute(DynJS.java:76)
at org.dynjs.cli.Main.executeFile(Main.java:73)
at org.dynjs.cli.Main.run(Main.java:60)
at org.dynjs.cli.Main.main(Main.java:46)
===
=== ch07/7.8/7.8.4/7.8.4-20-s failed in strict mode ===
--- errors ---
Exception in thread "main" org.dynjs.exception.ThrowException: ReferenceError: step is not defined
at <global>.<anonymous>(/var/folders/vt/nrnb_cw95ps51fgmm9rq2mpw0000gn/T/test262-GytV7s.js:419)
at <global>.<anonymous>(/var/folders/vt/nrnb_cw95ps51fgmm9rq2mpw0000gn/T/test262-GytV7s.js:440)
at <global>.<eval>(/var/folders/vt/nrnb_cw95ps51fgmm9rq2mpw0000gn/T/test262-GytV7s.js:411)
at org.dynjs.runtime.Reference.putValue(Reference.java:92)
at org.dynjs.gen.Function72.call(Unknown Source)
at org.dynjs.runtime.ExecutionContext.call(ExecutionContext.java:139)
at org.dynjs.gen.Function71.call(Unknown Source)
at org.dynjs.runtime.ExecutionContext.call(ExecutionContext.java:139)
at org.dynjs.gen.Program0.execute(Unknown Source)
at org.dynjs.runtime.ExecutionContext.execute(ExecutionContext.java:122)
at org.dynjs.runtime.DynJS.execute(DynJS.java:90)
at org.dynjs.runtime.DynJS.execute(DynJS.java:80)
at org.dynjs.runtime.DynJS.execute(DynJS.java:76)
at org.dynjs.cli.Main.executeFile(Main.java:73)
at org.dynjs.cli.Main.run(Main.java:60)
at org.dynjs.cli.Main.main(Main.java:46)
===
=== ch07/7.8/7.8.4/7.8.4-21-s failed in strict mode ===
--- errors ---
Exception in thread "main" org.dynjs.exception.ThrowException: ReferenceError: step is not defined
at <global>.<anonymous>(/var/folders/vt/nrnb_cw95ps51fgmm9rq2mpw0000gn/T/test262-mziXki.js:419)
at <global>.<anonymous>(/var/folders/vt/nrnb_cw95ps51fgmm9rq2mpw0000gn/T/test262-mziXki.js:440)
at <global>.<eval>(/var/folders/vt/nrnb_cw95ps51fgmm9rq2mpw0000gn/T/test262-mziXki.js:411)
at org.dynjs.runtime.Reference.putValue(Reference.java:92)
at org.dynjs.gen.Function72.call(Unknown Source)
at org.dynjs.runtime.ExecutionContext.call(ExecutionContext.java:139)
at org.dynjs.gen.Function71.call(Unknown Source)
at org.dynjs.runtime.ExecutionContext.call(ExecutionContext.java:139)
at org.dynjs.gen.Program0.execute(Unknown Source)
at org.dynjs.runtime.ExecutionContext.execute(ExecutionContext.java:122)
at org.dynjs.runtime.DynJS.execute(DynJS.java:90)
at org.dynjs.runtime.DynJS.execute(DynJS.java:80)
at org.dynjs.runtime.DynJS.execute(DynJS.java:76)
at org.dynjs.cli.Main.executeFile(Main.java:73)
at org.dynjs.cli.Main.run(Main.java:60)
at org.dynjs.cli.Main.main(Main.java:46)
===
=== ch07/7.8/7.8.4/7.8.4-22-s failed in strict mode ===
--- errors ---
Exception in thread "main" org.dynjs.exception.ThrowException: ReferenceError: step is not defined
at <global>.<anonymous>(/var/folders/vt/nrnb_cw95ps51fgmm9rq2mpw0000gn/T/test262-W8Ex_d.js:419)
at <global>.<anonymous>(/var/folders/vt/nrnb_cw95ps51fgmm9rq2mpw0000gn/T/test262-W8Ex_d.js:440)
at <global>.<eval>(/var/folders/vt/nrnb_cw95ps51fgmm9rq2mpw0000gn/T/test262-W8Ex_d.js:411)
at org.dynjs.runtime.Reference.putValue(Reference.java:92)
at org.dynjs.gen.Function72.call(Unknown Source)
at org.dynjs.runtime.ExecutionContext.call(ExecutionContext.java:139)
at org.dynjs.gen.Function71.call(Unknown Source)
at org.dynjs.runtime.ExecutionContext.call(ExecutionContext.java:139)
at org.dynjs.gen.Program0.execute(Unknown Source)
at org.dynjs.runtime.ExecutionContext.execute(ExecutionContext.java:122)
at org.dynjs.runtime.DynJS.execute(DynJS.java:90)
at org.dynjs.runtime.DynJS.execute(DynJS.java:80)
at org.dynjs.runtime.DynJS.execute(DynJS.java:76)
at org.dynjs.cli.Main.executeFile(Main.java:73)
at org.dynjs.cli.Main.run(Main.java:60)
at org.dynjs.cli.Main.main(Main.java:46)
===
=== ch07/7.8/7.8.4/7.8.4-23-s failed in strict mode ===
--- errors ---
Exception in thread "main" org.dynjs.exception.ThrowException: ReferenceError: step is not defined
at <global>.<anonymous>(/var/folders/vt/nrnb_cw95ps51fgmm9rq2mpw0000gn/T/test262-VJ_7mm.js:419)
at <global>.<anonymous>(/var/folders/vt/nrnb_cw95ps51fgmm9rq2mpw0000gn/T/test262-VJ_7mm.js:440)
at <global>.<eval>(/var/folders/vt/nrnb_cw95ps51fgmm9rq2mpw0000gn/T/test262-VJ_7mm.js:411)
at org.dynjs.runtime.Reference.putValue(Reference.java:92)
at org.dynjs.gen.Function72.call(Unknown Source)
at org.dynjs.runtime.ExecutionContext.call(ExecutionContext.java:139)
at org.dynjs.gen.Function71.call(Unknown Source)
at org.dynjs.runtime.ExecutionContext.call(ExecutionContext.java:139)
at org.dynjs.gen.Program0.execute(Unknown Source)
at org.dynjs.runtime.ExecutionContext.execute(ExecutionContext.java:122)
at org.dynjs.runtime.DynJS.execute(DynJS.java:90)
at org.dynjs.runtime.DynJS.execute(DynJS.java:80)
at org.dynjs.runtime.DynJS.execute(DynJS.java:76)
at org.dynjs.cli.Main.executeFile(Main.java:73)
at org.dynjs.cli.Main.run(Main.java:60)
at org.dynjs.cli.Main.main(Main.java:46)
===
=== ch07/7.8/7.8.4/7.8.4-24-s failed in strict mode ===
--- errors ---
Exception in thread "main" org.dynjs.exception.ThrowException: ReferenceError: step is not defined
at <global>.<anonymous>(/var/folders/vt/nrnb_cw95ps51fgmm9rq2mpw0000gn/T/test262-G8bwZv.js:419)
at <global>.<anonymous>(/var/folders/vt/nrnb_cw95ps51fgmm9rq2mpw0000gn/T/test262-G8bwZv.js:440)
at <global>.<eval>(/var/folders/vt/nrnb_cw95ps51fgmm9rq2mpw0000gn/T/test262-G8bwZv.js:411)
at org.dynjs.runtime.Reference.putValue(Reference.java:92)
at org.dynjs.gen.Function72.call(Unknown Source)
at org.dynjs.runtime.ExecutionContext.call(ExecutionContext.java:139)
at org.dynjs.gen.Function71.call(Unknown Source)
at org.dynjs.runtime.ExecutionContext.call(ExecutionContext.java:139)
at org.dynjs.gen.Program0.execute(Unknown Source)
at org.dynjs.runtime.ExecutionContext.execute(ExecutionContext.java:122)
at org.dynjs.runtime.DynJS.execute(DynJS.java:90)
at org.dynjs.runtime.DynJS.execute(DynJS.java:80)
at org.dynjs.runtime.DynJS.execute(DynJS.java:76)
at org.dynjs.cli.Main.executeFile(Main.java:73)
at org.dynjs.cli.Main.run(Main.java:60)
at org.dynjs.cli.Main.main(Main.java:46)
===
=== ch07/7.8/7.8.4/7.8.4-25-s failed in strict mode ===
--- errors ---
Exception in thread "main" org.dynjs.exception.ThrowException: ReferenceError: step is not defined
at <global>.<anonymous>(/var/folders/vt/nrnb_cw95ps51fgmm9rq2mpw0000gn/T/test262-A5MmO5.js:419)
at <global>.<anonymous>(/var/folders/vt/nrnb_cw95ps51fgmm9rq2mpw0000gn/T/test262-A5MmO5.js:440)
at <global>.<eval>(/var/folders/vt/nrnb_cw95ps51fgmm9rq2mpw0000gn/T/test262-A5MmO5.js:411)
at org.dynjs.runtime.Reference.putValue(Reference.java:92)
at org.dynjs.gen.Function72.call(Unknown Source)
at org.dynjs.runtime.ExecutionContext.call(ExecutionContext.java:139)
at org.dynjs.gen.Function71.call(Unknown Source)
at org.dynjs.runtime.ExecutionContext.call(ExecutionContext.java:139)
at org.dynjs.gen.Program0.execute(Unknown Source)
at org.dynjs.runtime.ExecutionContext.execute(ExecutionContext.java:122)
at org.dynjs.runtime.DynJS.execute(DynJS.java:90)
at org.dynjs.runtime.DynJS.execute(DynJS.java:80)
at org.dynjs.runtime.DynJS.execute(DynJS.java:76)
at org.dynjs.cli.Main.executeFile(Main.java:73)
at org.dynjs.cli.Main.run(Main.java:60)
at org.dynjs.cli.Main.main(Main.java:46)
===
=== ch07/7.8/7.8.4/7.8.4-26-s failed in strict mode ===
--- errors ---
Exception in thread "main" org.dynjs.exception.ThrowException: ReferenceError: step is not defined
at <global>.<anonymous>(/var/folders/vt/nrnb_cw95ps51fgmm9rq2mpw0000gn/T/test262-d6GKvr.js:419)
at <global>.<anonymous>(/var/folders/vt/nrnb_cw95ps51fgmm9rq2mpw0000gn/T/test262-d6GKvr.js:440)
at <global>.<eval>(/var/folders/vt/nrnb_cw95ps51fgmm9rq2mpw0000gn/T/test262-d6GKvr.js:411)
at org.dynjs.runtime.Reference.putValue(Reference.java:92)
at org.dynjs.gen.Function72.call(Unknown Source)
at org.dynjs.runtime.ExecutionContext.call(ExecutionContext.java:139)
at org.dynjs.gen.Function71.call(Unknown Source)
at org.dynjs.runtime.ExecutionContext.call(ExecutionContext.java:139)
at org.dynjs.gen.Program0.execute(Unknown Source)
at org.dynjs.runtime.ExecutionContext.execute(ExecutionContext.java:122)
at org.dynjs.runtime.DynJS.execute(DynJS.java:90)
at org.dynjs.runtime.DynJS.execute(DynJS.java:80)
at org.dynjs.runtime.DynJS.execute(DynJS.java:76)
at org.dynjs.cli.Main.executeFile(Main.java:73)
at org.dynjs.cli.Main.run(Main.java:60)
at org.dynjs.cli.Main.main(Main.java:46)
===
=== ch07/7.8/7.8.4/7.8.4-27-s failed in strict mode ===
--- errors ---
Exception in thread "main" org.dynjs.exception.ThrowException: ReferenceError: step is not defined
at <global>.<anonymous>(/var/folders/vt/nrnb_cw95ps51fgmm9rq2mpw0000gn/T/test262-VNLN6q.js:419)
at <global>.<anonymous>(/var/folders/vt/nrnb_cw95ps51fgmm9rq2mpw0000gn/T/test262-VNLN6q.js:440)
at <global>.<eval>(/var/folders/vt/nrnb_cw95ps51fgmm9rq2mpw0000gn/T/test262-VNLN6q.js:411)
at org.dynjs.runtime.Reference.putValue(Reference.java:92)
at org.dynjs.gen.Function72.call(Unknown Source)
at org.dynjs.runtime.ExecutionContext.call(ExecutionContext.java:139)
at org.dynjs.gen.Function71.call(Unknown Source)
at org.dynjs.runtime.ExecutionContext.call(ExecutionContext.java:139)
at org.dynjs.gen.Program0.execute(Unknown Source)
at org.dynjs.runtime.ExecutionContext.execute(ExecutionContext.java:122)
at org.dynjs.runtime.DynJS.execute(DynJS.java:90)
at org.dynjs.runtime.DynJS.execute(DynJS.java:80)
at org.dynjs.runtime.DynJS.execute(DynJS.java:76)
at org.dynjs.cli.Main.executeFile(Main.java:73)
at org.dynjs.cli.Main.run(Main.java:60)
at org.dynjs.cli.Main.main(Main.java:46)
===
=== ch07/7.8/7.8.4/7.8.4-28-s failed in strict mode ===
--- errors ---
Exception in thread "main" org.dynjs.exception.ThrowException: ReferenceError: step is not defined
at <global>.<anonymous>(/var/folders/vt/nrnb_cw95ps51fgmm9rq2mpw0000gn/T/test262-inXO7Q.js:419)
at <global>.<anonymous>(/var/folders/vt/nrnb_cw95ps51fgmm9rq2mpw0000gn/T/test262-inXO7Q.js:440)
at <global>.<eval>(/var/folders/vt/nrnb_cw95ps51fgmm9rq2mpw0000gn/T/test262-inXO7Q.js:411)
at org.dynjs.runtime.Reference.putValue(Reference.java:92)
at org.dynjs.gen.Function72.call(Unknown Source)
at org.dynjs.runtime.ExecutionContext.call(ExecutionContext.java:139)
at org.dynjs.gen.Function71.call(Unknown Source)
at org.dynjs.runtime.ExecutionContext.call(ExecutionContext.java:139)
at org.dynjs.gen.Program0.execute(Unknown Source)
at org.dynjs.runtime.ExecutionContext.execute(ExecutionContext.java:122)
at org.dynjs.runtime.DynJS.execute(DynJS.java:90)
at org.dynjs.runtime.DynJS.execute(DynJS.java:80)
at org.dynjs.runtime.DynJS.execute(DynJS.java:76)
at org.dynjs.cli.Main.executeFile(Main.java:73)
at org.dynjs.cli.Main.run(Main.java:60)
at org.dynjs.cli.Main.main(Main.java:46)
===
=== ch07/7.8/7.8.4/7.8.4-29-s failed in strict mode ===
--- errors ---
Exception in thread "main" org.dynjs.exception.ThrowException: ReferenceError: step is not defined
at <global>.<anonymous>(/var/folders/vt/nrnb_cw95ps51fgmm9rq2mpw0000gn/T/test262-FDDUEm.js:419)
at <global>.<anonymous>(/var/folders/vt/nrnb_cw95ps51fgmm9rq2mpw0000gn/T/test262-FDDUEm.js:440)
at <global>.<eval>(/var/folders/vt/nrnb_cw95ps51fgmm9rq2mpw0000gn/T/test262-FDDUEm.js:411)
at org.dynjs.runtime.Reference.putValue(Reference.java:92)
at org.dynjs.gen.Function72.call(Unknown Source)
at org.dynjs.runtime.ExecutionContext.call(ExecutionContext.java:139)
at org.dynjs.gen.Function71.call(Unknown Source)
at org.dynjs.runtime.ExecutionContext.call(ExecutionContext.java:139)
at org.dynjs.gen.Program0.execute(Unknown Source)
at org.dynjs.runtime.ExecutionContext.execute(ExecutionContext.java:122)
at org.dynjs.runtime.DynJS.execute(DynJS.java:90)
at org.dynjs.runtime.DynJS.execute(DynJS.java:80)
at org.dynjs.runtime.DynJS.execute(DynJS.java:76)
at org.dynjs.cli.Main.executeFile(Main.java:73)
at org.dynjs.cli.Main.run(Main.java:60)
at org.dynjs.cli.Main.main(Main.java:46)
===
=== ch07/7.8/7.8.4/7.8.4-3-s failed in strict mode ===
--- errors ---
Exception in thread "main" org.dynjs.exception.ThrowException: ReferenceError: step is not defined
at <global>.<anonymous>(/var/folders/vt/nrnb_cw95ps51fgmm9rq2mpw0000gn/T/test262-S42u3q.js:419)
at <global>.<anonymous>(/var/folders/vt/nrnb_cw95ps51fgmm9rq2mpw0000gn/T/test262-S42u3q.js:440)
at <global>.<eval>(/var/folders/vt/nrnb_cw95ps51fgmm9rq2mpw0000gn/T/test262-S42u3q.js:411)
at org.dynjs.runtime.Reference.putValue(Reference.java:92)
at org.dynjs.gen.Function72.call(Unknown Source)
at org.dynjs.runtime.ExecutionContext.call(ExecutionContext.java:139)
at org.dynjs.gen.Function71.call(Unknown Source)
at org.dynjs.runtime.ExecutionContext.call(ExecutionContext.java:139)
at org.dynjs.gen.Program0.execute(Unknown Source)
at org.dynjs.runtime.ExecutionContext.execute(ExecutionContext.java:122)
at org.dynjs.runtime.DynJS.execute(DynJS.java:90)
at org.dynjs.runtime.DynJS.execute(DynJS.java:80)
at org.dynjs.runtime.DynJS.execute(DynJS.java:76)
at org.dynjs.cli.Main.executeFile(Main.java:73)
at org.dynjs.cli.Main.run(Main.java:60)
at org.dynjs.cli.Main.main(Main.java:46)
===
=== ch07/7.8/7.8.4/7.8.4-30-s failed in strict mode ===
--- errors ---
Exception in thread "main" org.dynjs.exception.ThrowException: ReferenceError: step is not defined
at <global>.<anonymous>(/var/folders/vt/nrnb_cw95ps51fgmm9rq2mpw0000gn/T/test262-akIgEL.js:419)
at <global>.<anonymous>(/var/folders/vt/nrnb_cw95ps51fgmm9rq2mpw0000gn/T/test262-akIgEL.js:440)
at <global>.<eval>(/var/folders/vt/nrnb_cw95ps51fgmm9rq2mpw0000gn/T/test262-akIgEL.js:411)
at org.dynjs.runtime.Reference.putValue(Reference.java:92)
at org.dynjs.gen.Function72.call(Unknown Source)
at org.dynjs.runtime.ExecutionContext.call(ExecutionContext.java:139)
at org.dynjs.gen.Function71.call(Unknown Source)
at org.dynjs.runtime.ExecutionContext.call(ExecutionContext.java:139)
at org.dynjs.gen.Program0.execute(Unknown Source)
at org.dynjs.runtime.ExecutionContext.execute(ExecutionContext.java:122)
at org.dynjs.runtime.DynJS.execute(DynJS.java:90)
at org.dynjs.runtime.DynJS.execute(DynJS.java:80)
at org.dynjs.runtime.DynJS.execute(DynJS.java:76)
at org.dynjs.cli.Main.executeFile(Main.java:73)
at org.dynjs.cli.Main.run(Main.java:60)
at org.dynjs.cli.Main.main(Main.java:46)
===
=== ch07/7.8/7.8.4/7.8.4-31-s failed in strict mode ===
--- errors ---
Exception in thread "main" org.dynjs.exception.ThrowException: ReferenceError: step is not defined
at <global>.<anonymous>(/var/folders/vt/nrnb_cw95ps51fgmm9rq2mpw0000gn/T/test262-_EB8X0.js:419)
at <global>.<anonymous>(/var/folders/vt/nrnb_cw95ps51fgmm9rq2mpw0000gn/T/test262-_EB8X0.js:440)
at <global>.<eval>(/var/folders/vt/nrnb_cw95ps51fgmm9rq2mpw0000gn/T/test262-_EB8X0.js:411)
at org.dynjs.runtime.Reference.putValue(Reference.java:92)
at org.dynjs.gen.Function72.call(Unknown Source)
at org.dynjs.runtime.ExecutionContext.call(ExecutionContext.java:139)
at org.dynjs.gen.Function71.call(Unknown Source)
at org.dynjs.runtime.ExecutionContext.call(ExecutionContext.java:139)
at org.dynjs.gen.Program0.execute(Unknown Source)
at org.dynjs.runtime.ExecutionContext.execute(ExecutionContext.java:122)
at org.dynjs.runtime.DynJS.execute(DynJS.java:90)
at org.dynjs.runtime.DynJS.execute(DynJS.java:80)
at org.dynjs.runtime.DynJS.execute(DynJS.java:76)
at org.dynjs.cli.Main.executeFile(Main.java:73)
at org.dynjs.cli.Main.run(Main.java:60)
at org.dynjs.cli.Main.main(Main.java:46)
===
=== ch07/7.8/7.8.4/7.8.4-32-s failed in strict mode ===
--- errors ---
Exception in thread "main" org.dynjs.exception.ThrowException: ReferenceError: step is not defined
at <global>.<anonymous>(/var/folders/vt/nrnb_cw95ps51fgmm9rq2mpw0000gn/T/test262-MmR3P3.js:419)
at <global>.<anonymous>(/var/folders/vt/nrnb_cw95ps51fgmm9rq2mpw0000gn/T/test262-MmR3P3.js:440)
at <global>.<eval>(/var/folders/vt/nrnb_cw95ps51fgmm9rq2mpw0000gn/T/test262-MmR3P3.js:411)
at org.dynjs.runtime.Reference.putValue(Reference.java:92)
at org.dynjs.gen.Function72.call(Unknown Source)
at org.dynjs.runtime.ExecutionContext.call(ExecutionContext.java:139)
at org.dynjs.gen.Function71.call(Unknown Source)
at org.dynjs.runtime.ExecutionContext.call(ExecutionContext.java:139)
at org.dynjs.gen.Program0.execute(Unknown Source)
at org.dynjs.runtime.ExecutionContext.execute(ExecutionContext.java:122)
at org.dynjs.runtime.DynJS.execute(DynJS.java:90)
at org.dynjs.runtime.DynJS.execute(DynJS.java:80)
at org.dynjs.runtime.DynJS.execute(DynJS.java:76)
at org.dynjs.cli.Main.executeFile(Main.java:73)
at org.dynjs.cli.Main.run(Main.java:60)
at org.dynjs.cli.Main.main(Main.java:46)
===
=== ch07/7.8/7.8.4/7.8.4-33-s failed in strict mode ===
--- errors ---
Exception in thread "main" org.dynjs.exception.ThrowException: ReferenceError: step is not defined
at <global>.<anonymous>(/var/folders/vt/nrnb_cw95ps51fgmm9rq2mpw0000gn/T/test262-PTHM8U.js:419)
at <global>.<anonymous>(/var/folders/vt/nrnb_cw95ps51fgmm9rq2mpw0000gn/T/test262-PTHM8U.js:440)
at <global>.<eval>(/var/folders/vt/nrnb_cw95ps51fgmm9rq2mpw0000gn/T/test262-PTHM8U.js:411)
at org.dynjs.runtime.Reference.putValue(Reference.java:92)
at org.dynjs.gen.Function72.call(Unknown Source)
at org.dynjs.runtime.ExecutionContext.call(ExecutionContext.java:139)
at org.dynjs.gen.Function71.call(Unknown Source)
at org.dynjs.runtime.ExecutionContext.call(ExecutionContext.java:139)
at org.dynjs.gen.Program0.execute(Unknown Source)
at org.dynjs.runtime.ExecutionContext.execute(ExecutionContext.java:122)
at org.dynjs.runtime.DynJS.execute(DynJS.java:90)
at org.dynjs.runtime.DynJS.execute(DynJS.java:80)
at org.dynjs.runtime.DynJS.execute(DynJS.java:76)
at org.dynjs.cli.Main.executeFile(Main.java:73)
at org.dynjs.cli.Main.run(Main.java:60)
at org.dynjs.cli.Main.main(Main.java:46)
===
=== ch07/7.8/7.8.4/7.8.4-4-s failed in strict mode ===
--- errors ---
Exception in thread "main" org.dynjs.exception.ThrowException: ReferenceError: step is not defined
at <global>.<anonymous>(/var/folders/vt/nrnb_cw95ps51fgmm9rq2mpw0000gn/T/test262-xqq6uD.js:419)
at <global>.<anonymous>(/var/folders/vt/nrnb_cw95ps51fgmm9rq2mpw0000gn/T/test262-xqq6uD.js:440)
at <global>.<eval>(/var/folders/vt/nrnb_cw95ps51fgmm9rq2mpw0000gn/T/test262-xqq6uD.js:411)
at org.dynjs.runtime.Reference.putValue(Reference.java:92)
at org.dynjs.gen.Function72.call(Unknown Source)
at org.dynjs.runtime.ExecutionContext.call(ExecutionContext.java:139)
at org.dynjs.gen.Function71.call(Unknown Source)
at org.dynjs.runtime.ExecutionContext.call(ExecutionContext.java:139)
at org.dynjs.gen.Program0.execute(Unknown Source)
at org.dynjs.runtime.ExecutionContext.execute(ExecutionContext.java:122)
at org.dynjs.runtime.DynJS.execute(DynJS.java:90)
at org.dynjs.runtime.DynJS.execute(DynJS.java:80)
at org.dynjs.runtime.DynJS.execute(DynJS.java:76)
at org.dynjs.cli.Main.executeFile(Main.java:73)
at org.dynjs.cli.Main.run(Main.java:60)
at org.dynjs.cli.Main.main(Main.java:46)
===
=== ch07/7.8/7.8.4/7.8.4-5-s failed in strict mode ===
--- errors ---
Exception in thread "main" org.dynjs.exception.ThrowException: ReferenceError: step is not defined
at <global>.<anonymous>(/var/folders/vt/nrnb_cw95ps51fgmm9rq2mpw0000gn/T/test262-VZ7tnu.js:419)
at <global>.<anonymous>(/var/folders/vt/nrnb_cw95ps51fgmm9rq2mpw0000gn/T/test262-VZ7tnu.js:440)
at <global>.<eval>(/var/folders/vt/nrnb_cw95ps51fgmm9rq2mpw0000gn/T/test262-VZ7tnu.js:411)
at org.dynjs.runtime.Reference.putValue(Reference.java:92)
at org.dynjs.gen.Function72.call(Unknown Source)
at org.dynjs.runtime.ExecutionContext.call(ExecutionContext.java:139)
at org.dynjs.gen.Function71.call(Unknown Source)
at org.dynjs.runtime.ExecutionContext.call(ExecutionContext.java:139)
at org.dynjs.gen.Program0.execute(Unknown Source)
at org.dynjs.runtime.ExecutionContext.execute(ExecutionContext.java:122)
at org.dynjs.runtime.DynJS.execute(DynJS.java:90)
at org.dynjs.runtime.DynJS.execute(DynJS.java:80)
at org.dynjs.runtime.DynJS.execute(DynJS.java:76)
at org.dynjs.cli.Main.executeFile(Main.java:73)
at org.dynjs.cli.Main.run(Main.java:60)
at org.dynjs.cli.Main.main(Main.java:46)
===
=== ch07/7.8/7.8.4/7.8.4-6-s failed in strict mode ===
--- errors ---
Exception in thread "main" org.dynjs.exception.ThrowException: ReferenceError: step is not defined
at <global>.<anonymous>(/var/folders/vt/nrnb_cw95ps51fgmm9rq2mpw0000gn/T/test262-EDsSKB.js:419)
at <global>.<anonymous>(/var/folders/vt/nrnb_cw95ps51fgmm9rq2mpw0000gn/T/test262-EDsSKB.js:440)
at <global>.<eval>(/var/folders/vt/nrnb_cw95ps51fgmm9rq2mpw0000gn/T/test262-EDsSKB.js:411)
at org.dynjs.runtime.Reference.putValue(Reference.java:92)
at org.dynjs.gen.Function72.call(Unknown Source)
at org.dynjs.runtime.ExecutionContext.call(ExecutionContext.java:139)
at org.dynjs.gen.Function71.call(Unknown Source)
at org.dynjs.runtime.ExecutionContext.call(ExecutionContext.java:139)
at org.dynjs.gen.Program0.execute(Unknown Source)
at org.dynjs.runtime.ExecutionContext.execute(ExecutionContext.java:122)
at org.dynjs.runtime.DynJS.execute(DynJS.java:90)
at org.dynjs.runtime.DynJS.execute(DynJS.java:80)
at org.dynjs.runtime.DynJS.execute(DynJS.java:76)
at org.dynjs.cli.Main.executeFile(Main.java:73)
at org.dynjs.cli.Main.run(Main.java:60)
at org.dynjs.cli.Main.main(Main.java:46)
===
=== ch07/7.8/7.8.4/7.8.4-7-s failed in strict mode ===
--- errors ---
Exception in thread "main" org.dynjs.exception.ThrowException: ReferenceError: step is not defined
at <global>.<anonymous>(/var/folders/vt/nrnb_cw95ps51fgmm9rq2mpw0000gn/T/test262-pvcRG8.js:419)
at <global>.<anonymous>(/var/folders/vt/nrnb_cw95ps51fgmm9rq2mpw0000gn/T/test262-pvcRG8.js:440)
at <global>.<eval>(/var/folders/vt/nrnb_cw95ps51fgmm9rq2mpw0000gn/T/test262-pvcRG8.js:411)
at org.dynjs.runtime.Reference.putValue(Reference.java:92)
at org.dynjs.gen.Function72.call(Unknown Source)
at org.dynjs.runtime.ExecutionContext.call(ExecutionContext.java:139)
at org.dynjs.gen.Function71.call(Unknown Source)
at org.dynjs.runtime.ExecutionContext.call(ExecutionContext.java:139)
at org.dynjs.gen.Program0.execute(Unknown Source)
at org.dynjs.runtime.ExecutionContext.execute(ExecutionContext.java:122)
at org.dynjs.runtime.DynJS.execute(DynJS.java:90)
at org.dynjs.runtime.DynJS.execute(DynJS.java:80)
at org.dynjs.runtime.DynJS.execute(DynJS.java:76)
at org.dynjs.cli.Main.executeFile(Main.java:73)
at org.dynjs.cli.Main.run(Main.java:60)
at org.dynjs.cli.Main.main(Main.java:46)
===
=== ch07/7.8/7.8.4/7.8.4-8-s failed in strict mode ===
--- errors ---
Exception in thread "main" org.dynjs.exception.ThrowException: ReferenceError: step is not defined
at <global>.<anonymous>(/var/folders/vt/nrnb_cw95ps51fgmm9rq2mpw0000gn/T/test262-g8wJLW.js:419)
at <global>.<anonymous>(/var/folders/vt/nrnb_cw95ps51fgmm9rq2mpw0000gn/T/test262-g8wJLW.js:440)
at <global>.<eval>(/var/folders/vt/nrnb_cw95ps51fgmm9rq2mpw0000gn/T/test262-g8wJLW.js:411)
at org.dynjs.runtime.Reference.putValue(Reference.java:92)
at org.dynjs.gen.Function72.call(Unknown Source)
at org.dynjs.runtime.ExecutionContext.call(ExecutionContext.java:139)
at org.dynjs.gen.Function71.call(Unknown Source)
at org.dynjs.runtime.ExecutionContext.call(ExecutionContext.java:139)
at org.dynjs.gen.Program0.execute(Unknown Source)
at org.dynjs.runtime.ExecutionContext.execute(ExecutionContext.java:122)
at org.dynjs.runtime.DynJS.execute(DynJS.java:90)
at org.dynjs.runtime.DynJS.execute(DynJS.java:80)
at org.dynjs.runtime.DynJS.execute(DynJS.java:76)
at org.dynjs.cli.Main.executeFile(Main.java:73)
at org.dynjs.cli.Main.run(Main.java:60)
at org.dynjs.cli.Main.main(Main.java:46)
===
=== ch07/7.8/7.8.4/7.8.4-9-s failed in strict mode ===
--- errors ---
Exception in thread "main" org.dynjs.exception.ThrowException: ReferenceError: step is not defined
at <global>.<anonymous>(/var/folders/vt/nrnb_cw95ps51fgmm9rq2mpw0000gn/T/test262-2fD7F1.js:419)
at <global>.<anonymous>(/var/folders/vt/nrnb_cw95ps51fgmm9rq2mpw0000gn/T/test262-2fD7F1.js:440)
at <global>.<eval>(/var/folders/vt/nrnb_cw95ps51fgmm9rq2mpw0000gn/T/test262-2fD7F1.js:411)
at org.dynjs.runtime.Reference.putValue(Reference.java:92)
at org.dynjs.gen.Function72.call(Unknown Source)
at org.dynjs.runtime.ExecutionContext.call(ExecutionContext.java:139)
at org.dynjs.gen.Function71.call(Unknown Source)
at org.dynjs.runtime.ExecutionContext.call(ExecutionContext.java:139)
at org.dynjs.gen.Program0.execute(Unknown Source)
at org.dynjs.runtime.ExecutionContext.execute(ExecutionContext.java:122)
at org.dynjs.runtime.DynJS.execute(DynJS.java:90)
at org.dynjs.runtime.DynJS.execute(DynJS.java:80)
at org.dynjs.runtime.DynJS.execute(DynJS.java:76)
at org.dynjs.cli.Main.executeFile(Main.java:73)
at org.dynjs.cli.Main.run(Main.java:60)
at org.dynjs.cli.Main.main(Main.java:46)
===
=== ch07/7.8/7.8.4/S7.8.4_A1.1_T1 was expected to fail in non-strict mode, but didn't ===
=== ch07/7.8/7.8.4/S7.8.4_A1.1_T2 was expected to fail in non-strict mode, but didn't ===
=== ch07/7.8/7.8.4/S7.8.4_A1.2_T1 was expected to fail in non-strict mode, but didn't ===
=== ch07/7.8/7.8.4/S7.8.4_A1.2_T2 was expected to fail in non-strict mode, but didn't ===
ch07/7.8/7.8.4/S7.8.4_A2.1_T1 passed in non-strict mode
ch07/7.8/7.8.4/S7.8.4_A2.1_T2 passed in non-strict mode
ch07/7.8/7.8.4/S7.8.4_A2.2_T1 passed in non-strict mode
ch07/7.8/7.8.4/S7.8.4_A2.2_T2 passed in non-strict mode
ch07/7.8/7.8.4/S7.8.4_A2.3_T1 passed in non-strict mode
=== ch07/7.8/7.8.4/S7.8.4_A3.1_T1 was expected to fail in non-strict mode, but didn't ===
=== ch07/7.8/7.8.4/S7.8.4_A3.1_T2 was expected to fail in non-strict mode, but didn't ===
=== ch07/7.8/7.8.4/S7.8.4_A3.2_T1 was expected to fail in non-strict mode, but didn't ===
=== ch07/7.8/7.8.4/S7.8.4_A3.2_T2 was expected to fail in non-strict mode, but didn't ===
=== ch07/7.8/7.8.4/S7.8.4_A4.1_T1 failed in non-strict mode ===
--- errors ---
Exception in thread "main" org.dynjs.exception.ThrowException: #4: String.fromCharCode(0x000B) === "\v"
at <global>.testFailed(/var/folders/vt/nrnb_cw95ps51fgmm9rq2mpw0000gn/T/test262-qQaRFV.js:289)
at <global>.$ERROR(/var/folders/vt/nrnb_cw95ps51fgmm9rq2mpw0000gn/T/test262-qQaRFV.js:305)
at <global>.<eval>(/var/folders/vt/nrnb_cw95ps51fgmm9rq2mpw0000gn/T/test262-qQaRFV.js:2194)
at org.dynjs.gen.Function13.call(Unknown Source)
at org.dynjs.runtime.ExecutionContext.call(ExecutionContext.java:139)
at org.dynjs.gen.Function17.call(Unknown Source)
at org.dynjs.runtime.ExecutionContext.call(ExecutionContext.java:139)
at org.dynjs.gen.ThenBlock20.call(Unknown Source)
at org.dynjs.gen.Program0.execute(Unknown Source)
at org.dynjs.runtime.ExecutionContext.execute(ExecutionContext.java:122)
at org.dynjs.runtime.DynJS.execute(DynJS.java:90)
at org.dynjs.runtime.DynJS.execute(DynJS.java:80)
at org.dynjs.runtime.DynJS.execute(DynJS.java:76)
at org.dynjs.cli.Main.executeFile(Main.java:73)
at org.dynjs.cli.Main.run(Main.java:60)
at org.dynjs.cli.Main.main(Main.java:46)
===
ch07/7.8/7.8.4/S7.8.4_A4.1_T2 passed in non-strict mode
=== ch07/7.8/7.8.4/S7.8.4_A4.2_T1 failed in non-strict mode ===
--- errors ---
Exception in thread "main" org.dynjs.exception.ThrowException: java.lang.NumberFormatException: For input string: "0x004.0E"
at <global>.<eval>(/var/folders/vt/nrnb_cw95ps51fgmm9rq2mpw0000gn/T/test262-2KUf1W.js:2178)
at org.dynjs.runtime.ExecutionContext.execute(ExecutionContext.java:126)
at org.dynjs.runtime.DynJS.execute(DynJS.java:90)
at org.dynjs.runtime.DynJS.execute(DynJS.java:80)
at org.dynjs.runtime.DynJS.execute(DynJS.java:76)
at org.dynjs.cli.Main.executeFile(Main.java:73)
at org.dynjs.cli.Main.run(Main.java:60)
at org.dynjs.cli.Main.main(Main.java:46)
Caused by: java.lang.NumberFormatException: For input string: "0x004.0E"
at sun.misc.FloatingDecimal.parseHexString(FloatingDecimal.java:1891)
at sun.misc.FloatingDecimal.readJavaFormatString(FloatingDecimal.java:1063)
at java.lang.Double.valueOf(Double.java:504)
at org.dynjs.gen.Program0.execute(Unknown Source)
at org.dynjs.runtime.ExecutionContext.execute(ExecutionContext.java:122)
... 6 more
===
ch07/7.8/7.8.4/S7.8.4_A4.2_T2 passed in non-strict mode
ch07/7.8/7.8.4/S7.8.4_A4.2_T3 passed in non-strict mode
ch07/7.8/7.8.4/S7.8.4_A4.2_T4 passed in non-strict mode
=== ch07/7.8/7.8.4/S7.8.4_A4.2_T5 failed in non-strict mode ===
--- errors ---
Exception in thread "main" org.dynjs.exception.ThrowException: java.lang.NumberFormatException: For input string: "0x041.0E"
at <global>.<eval>(/var/folders/vt/nrnb_cw95ps51fgmm9rq2mpw0000gn/T/test262-Ey98uY.js:2178)
at org.dynjs.runtime.ExecutionContext.execute(ExecutionContext.java:126)
at org.dynjs.runtime.DynJS.execute(DynJS.java:90)
at org.dynjs.runtime.DynJS.execute(DynJS.java:80)
at org.dynjs.runtime.DynJS.execute(DynJS.java:76)
at org.dynjs.cli.Main.executeFile(Main.java:73)
at org.dynjs.cli.Main.run(Main.java:60)
at org.dynjs.cli.Main.main(Main.java:46)
Caused by: java.lang.NumberFormatException: For input string: "0x041.0E"
at sun.misc.FloatingDecimal.parseHexString(FloatingDecimal.java:1891)
at sun.misc.FloatingDecimal.readJavaFormatString(FloatingDecimal.java:1063)
at java.lang.Double.valueOf(Double.java:504)
at org.dynjs.gen.Program0.execute(Unknown Source)
at org.dynjs.runtime.ExecutionContext.execute(ExecutionContext.java:122)
... 6 more
===
ch07/7.8/7.8.4/S7.8.4_A4.2_T6 passed in non-strict mode
=== ch07/7.8/7.8.4/S7.8.4_A4.2_T7 failed in non-strict mode ===
--- errors ---
Exception in thread "main" org.dynjs.exception.ThrowException: java.lang.NumberFormatException: For input string: "0x043.0E"
at <global>.<eval>(/var/folders/vt/nrnb_cw95ps51fgmm9rq2mpw0000gn/T/test262-gTSkLq.js:2178)
at org.dynjs.runtime.ExecutionContext.execute(ExecutionContext.java:126)
at org.dynjs.runtime.DynJS.execute(DynJS.java:90)
at org.dynjs.runtime.DynJS.execute(DynJS.java:80)
at org.dynjs.runtime.DynJS.execute(DynJS.java:76)
at org.dynjs.cli.Main.executeFile(Main.java:73)
at org.dynjs.cli.Main.run(Main.java:60)
at org.dynjs.cli.Main.main(Main.java:46)
Caused by: java.lang.NumberFormatException: For input string: "0x043.0E"
at sun.misc.FloatingDecimal.parseHexString(FloatingDecimal.java:1891)
at sun.misc.FloatingDecimal.readJavaFormatString(FloatingDecimal.java:1063)
at java.lang.Double.valueOf(Double.java:504)
at org.dynjs.gen.Program0.execute(Unknown Source)
at org.dynjs.runtime.ExecutionContext.execute(ExecutionContext.java:122)
... 6 more
===
ch07/7.8/7.8.4/S7.8.4_A4.2_T8 passed in non-strict mode
ch07/7.8/7.8.4/S7.8.4_A4.3_T1 failed in strict mode as expected
ch07/7.8/7.8.4/S7.8.4_A4.3_T2 failed in strict mode as expected
=== ch07/7.8/7.8.4/S7.8.4_A4.3_T7 failed in non-strict mode ===
--- errors ---
Exception in thread "main" org.dynjs.exception.ThrowException: #v
at <global>.testFailed(/var/folders/vt/nrnb_cw95ps51fgmm9rq2mpw0000gn/T/test262-tEt5Sn.js:289)
at <global>.$ERROR(/var/folders/vt/nrnb_cw95ps51fgmm9rq2mpw0000gn/T/test262-tEt5Sn.js:305)
at <global>.<eval>(/var/folders/vt/nrnb_cw95ps51fgmm9rq2mpw0000gn/T/test262-tEt5Sn.js:2199)
at org.dynjs.gen.Function13.call(Unknown Source)
at org.dynjs.runtime.ExecutionContext.call(ExecutionContext.java:139)
at org.dynjs.gen.Function17.call(Unknown Source)
at org.dynjs.runtime.ExecutionContext.call(ExecutionContext.java:139)
at org.dynjs.gen.ThenBlock20.call(Unknown Source)
at org.dynjs.gen.Program0.execute(Unknown Source)
at org.dynjs.runtime.ExecutionContext.execute(ExecutionContext.java:122)
at org.dynjs.runtime.DynJS.execute(DynJS.java:90)
at org.dynjs.runtime.DynJS.execute(DynJS.java:80)
at org.dynjs.runtime.DynJS.execute(DynJS.java:76)
at org.dynjs.cli.Main.executeFile(Main.java:73)
at org.dynjs.cli.Main.run(Main.java:60)
at org.dynjs.cli.Main.main(Main.java:46)
===
=== ch07/7.8/7.8.4/S7.8.4_A5.1_T1 failed in non-strict mode ===
--- errors ---
Exception in thread "main" org.dynjs.exception.ThrowException: #1: String.fromCharCode(0x0000) === "\0"
at <global>.testFailed(/var/folders/vt/nrnb_cw95ps51fgmm9rq2mpw0000gn/T/test262-tIBLnS.js:289)
at <global>.$ERROR(/var/folders/vt/nrnb_cw95ps51fgmm9rq2mpw0000gn/T/test262-tIBLnS.js:305)
at <global>.<eval>(/var/folders/vt/nrnb_cw95ps51fgmm9rq2mpw0000gn/T/test262-tIBLnS.js:2179)
at org.dynjs.gen.Function13.call(Unknown Source)
at org.dynjs.runtime.ExecutionContext.call(ExecutionContext.java:139)
at org.dynjs.gen.Function17.call(Unknown Source)
at org.dynjs.runtime.ExecutionContext.call(ExecutionContext.java:139)
at org.dynjs.gen.ThenBlock20.call(Unknown Source)
at org.dynjs.gen.Program0.execute(Unknown Source)
at org.dynjs.runtime.ExecutionContext.execute(ExecutionContext.java:122)
at org.dynjs.runtime.DynJS.execute(DynJS.java:90)
at org.dynjs.runtime.DynJS.execute(DynJS.java:80)
at org.dynjs.runtime.DynJS.execute(DynJS.java:76)
at org.dynjs.cli.Main.executeFile(Main.java:73)
at org.dynjs.cli.Main.run(Main.java:60)
at org.dynjs.cli.Main.main(Main.java:46)
===
=== ch07/7.8/7.8.4/S7.8.4_A5.1_T2 failed in non-strict mode ===
--- errors ---
Exception in thread "main" org.dynjs.exception.ThrowException: #1: "\u0000" === "\0"
at <global>.testFailed(/var/folders/vt/nrnb_cw95ps51fgmm9rq2mpw0000gn/T/test262-GxmDSs.js:289)
at <global>.$ERROR(/var/folders/vt/nrnb_cw95ps51fgmm9rq2mpw0000gn/T/test262-GxmDSs.js:305)
at <global>.<eval>(/var/folders/vt/nrnb_cw95ps51fgmm9rq2mpw0000gn/T/t