Skip to content

Instantly share code, notes, and snippets.

@jingweno jingweno/ch15
Created Oct 17, 2012

Embed
What would you like to do?
specs result for dynjs 2
ch15/15.1/S15.1_A1_T1 failed in non-strict mode as expected
ch15/15.1/S15.1_A1_T2 failed in non-strict mode as expected
ch15/15.1/S15.1_A2_T1 failed in non-strict mode as expected
ch15/15.1/15.1.1/15.1.1.1/15.1.1.1-0 passed in non-strict mode
ch15/15.1/15.1.1/15.1.1.1/S15.1.1.1_A1 passed in non-strict mode
ch15/15.1/15.1.1/15.1.1.1/S15.1.1.1_A3.1 passed in non-strict mode
ch15/15.1/15.1.1/15.1.1.1/S15.1.1.1_A3.2 passed in non-strict mode
ch15/15.1/15.1.1/15.1.1.2/15.1.1.2-0 passed in non-strict mode
ch15/15.1/15.1.1/15.1.1.2/S15.1.1.2_A1 passed in non-strict mode
ch15/15.1/15.1.1/15.1.1.2/S15.1.1.2_A2_T2 passed in non-strict mode
ch15/15.1/15.1.1/15.1.1.2/S15.1.1.2_A3.1 passed in non-strict mode
ch15/15.1/15.1.1/15.1.1.2/S15.1.1.2_A3.2 passed in non-strict mode
ch15/15.1/15.1.1/15.1.1.3/15.1.1.3-0 passed in non-strict mode
ch15/15.1/15.1.1/15.1.1.3/15.1.1.3-1 passed in non-strict mode
=== ch15/15.1/15.1.1/15.1.1.3/15.1.1.3-2 failed in strict mode ===
--- errors ---
Exception in thread "main" org.dynjs.exception.ThrowException: ReferenceError: step is not defined
at <global>.<anonymous>(/var/folders/vt/nrnb_cw95ps51fgmm9rq2mpw0000gn/T/test262-x0Gz4T.js:419)
at <global>.<anonymous>(/var/folders/vt/nrnb_cw95ps51fgmm9rq2mpw0000gn/T/test262-x0Gz4T.js:440)
at <global>.<eval>(/var/folders/vt/nrnb_cw95ps51fgmm9rq2mpw0000gn/T/test262-x0Gz4T.js:411)
at org.dynjs.runtime.Reference.putValue(Reference.java:92)
at org.dynjs.gen.Function72.call(Unknown Source)
at org.dynjs.runtime.ExecutionContext.call(ExecutionContext.java:139)
at org.dynjs.gen.Function71.call(Unknown Source)
at org.dynjs.runtime.ExecutionContext.call(ExecutionContext.java:139)
at org.dynjs.gen.Program0.execute(Unknown Source)
at org.dynjs.runtime.ExecutionContext.execute(ExecutionContext.java:122)
at org.dynjs.runtime.DynJS.execute(DynJS.java:90)
at org.dynjs.runtime.DynJS.execute(DynJS.java:80)
at org.dynjs.runtime.DynJS.execute(DynJS.java:76)
at org.dynjs.cli.Main.executeFile(Main.java:73)
at org.dynjs.cli.Main.run(Main.java:60)
at org.dynjs.cli.Main.main(Main.java:46)
===
ch15/15.1/15.1.1/15.1.1.3/15.1.1.3-3 passed in non-strict mode
ch15/15.1/15.1.1/15.1.1.3/S15.1.1.3_A1 passed in non-strict mode
ch15/15.1/15.1.1/15.1.1.3/S15.1.1.3_A3.1 passed in non-strict mode
ch15/15.1/15.1.1/15.1.1.3/S15.1.1.3_A3.2 passed in non-strict mode
ch15/15.1/15.1.2/15.1.2.1/S15.1.2.1_A1.1_T1 passed in non-strict mode
=== ch15/15.1/15.1.2/15.1.2.1/S15.1.2.1_A1.1_T2 failed in non-strict mode ===
--- errors ---
line 0:0 no viable alternative at character ''
Exception in thread "main" org.dynjs.exception.ThrowException: SyntaxError: line 1:28 no viable alternative at input '754e3'
line 1:33 no viable alternative at input 'd8f'
at <native function: org.dynjs.runtime.builtins.Eval>(org/dynjs/runtime/builtins/Eval.java:0)
at <global>.<eval>(/var/folders/vt/nrnb_cw95ps51fgmm9rq2mpw0000gn/T/test262-d22y91.js:2179)
at org.dynjs.runtime.builtins.Eval.call(Eval.java:39)
at org.dynjs.runtime.AbstractNativeFunction.call(AbstractNativeFunction.java:62)
at org.dynjs.runtime.ExecutionContext.call(ExecutionContext.java:139)
at org.dynjs.gen.Program0.execute(Unknown Source)
at org.dynjs.runtime.ExecutionContext.execute(ExecutionContext.java:122)
at org.dynjs.runtime.DynJS.execute(DynJS.java:90)
at org.dynjs.runtime.DynJS.execute(DynJS.java:80)
at org.dynjs.runtime.DynJS.execute(DynJS.java:76)
at org.dynjs.cli.Main.executeFile(Main.java:73)
at org.dynjs.cli.Main.run(Main.java:60)
at org.dynjs.cli.Main.main(Main.java:46)
===
ch15/15.1/15.1.2/15.1.2.1/S15.1.2.1_A1.2_T1 passed in non-strict mode
ch15/15.1/15.1.2/15.1.2.1/S15.1.2.1_A2_T1 passed in non-strict mode
ch15/15.1/15.1.2/15.1.2.1/S15.1.2.1_A2_T2 failed in non-strict mode as expected
ch15/15.1/15.1.2/15.1.2.1/S15.1.2.1_A3.1_T1 passed in non-strict mode
ch15/15.1/15.1.2/15.1.2.1/S15.1.2.1_A3.1_T2 passed in non-strict mode
ch15/15.1/15.1.2/15.1.2.1/S15.1.2.1_A3.2_T1 passed in non-strict mode
ch15/15.1/15.1.2/15.1.2.1/S15.1.2.1_A3.2_T2 passed in non-strict mode
ch15/15.1/15.1.2/15.1.2.1/S15.1.2.1_A3.2_T3 passed in non-strict mode
=== ch15/15.1/15.1.2/15.1.2.1/S15.1.2.1_A3.2_T4 failed in non-strict mode ===
--- errors ---
Exception in thread "main" org.dynjs.exception.ThrowException: org.antlr.runtime.tree.RewriteEarlyExitException
at <native function: org.dynjs.runtime.builtins.Eval>(org/dynjs/runtime/builtins/Eval.java:0)
at <global>.<eval>(/var/folders/vt/nrnb_cw95ps51fgmm9rq2mpw0000gn/T/test262-7tjKsC.js:2178)
at org.dynjs.runtime.ExecutionContext.call(ExecutionContext.java:148)
at org.dynjs.gen.Program0.execute(Unknown Source)
at org.dynjs.runtime.ExecutionContext.execute(ExecutionContext.java:122)
at org.dynjs.runtime.DynJS.execute(DynJS.java:90)
at org.dynjs.runtime.DynJS.execute(DynJS.java:80)
at org.dynjs.runtime.DynJS.execute(DynJS.java:76)
at org.dynjs.cli.Main.executeFile(Main.java:73)
at org.dynjs.cli.Main.run(Main.java:60)
at org.dynjs.cli.Main.main(Main.java:46)
Caused by: org.antlr.runtime.tree.RewriteEarlyExitException
at org.dynjs.parser.ES3Parser.ifStatement(ES3Parser.java:7301)
at org.dynjs.parser.ES3Parser.statementTail(ES3Parser.java:6341)
at org.dynjs.parser.ES3Parser.statement(ES3Parser.java:6219)
at org.dynjs.parser.ES3Parser.sourceElement(ES3Parser.java:10672)
at org.dynjs.parser.ES3Parser.program(ES3Parser.java:10590)
at org.dynjs.runtime.DynJS.parseSourceCode(DynJS.java:185)
at org.dynjs.runtime.DynJS.parseSourceCode(DynJS.java:165)
at org.dynjs.runtime.DynJS.compile(DynJS.java:136)
at org.dynjs.runtime.DynJS.execute(DynJS.java:100)
at org.dynjs.runtime.DynJS.execute(DynJS.java:95)
at org.dynjs.runtime.DynJS.evaluate(DynJS.java:123)
at org.dynjs.runtime.builtins.Eval.call(Eval.java:36)
at org.dynjs.runtime.AbstractNativeFunction.call(AbstractNativeFunction.java:62)
at org.dynjs.runtime.ExecutionContext.call(ExecutionContext.java:139)
... 8 more
===
ch15/15.1/15.1.2/15.1.2.1/S15.1.2.1_A3.2_T5 passed in non-strict mode
=== ch15/15.1/15.1.2/15.1.2.1/S15.1.2.1_A3.2_T6 failed in non-strict mode ===
--- errors ---
Exception in thread "main" org.dynjs.exception.ThrowException: org.antlr.runtime.tree.RewriteEmptyStreamException: rule statement
at <native function: org.dynjs.runtime.builtins.Eval>(org/dynjs/runtime/builtins/Eval.java:0)
at <global>.<eval>(/var/folders/vt/nrnb_cw95ps51fgmm9rq2mpw0000gn/T/test262-Kb8wmh.js:2178)
at org.dynjs.runtime.ExecutionContext.call(ExecutionContext.java:148)
at org.dynjs.gen.Program0.execute(Unknown Source)
at org.dynjs.runtime.ExecutionContext.execute(ExecutionContext.java:122)
at org.dynjs.runtime.DynJS.execute(DynJS.java:90)
at org.dynjs.runtime.DynJS.execute(DynJS.java:80)
at org.dynjs.runtime.DynJS.execute(DynJS.java:76)
at org.dynjs.cli.Main.executeFile(Main.java:73)
at org.dynjs.cli.Main.run(Main.java:60)
at org.dynjs.cli.Main.main(Main.java:46)
Caused by: org.antlr.runtime.tree.RewriteEmptyStreamException: rule statement
at org.antlr.runtime.tree.RewriteRuleElementStream._next(RewriteRuleElementStream.java:157)
at org.antlr.runtime.tree.RewriteRuleElementStream.nextTree(RewriteRuleElementStream.java:144)
at org.dynjs.parser.ES3Parser.doStatement(ES3Parser.java:7566)
at org.dynjs.parser.ES3Parser.iterationStatement(ES3Parser.java:7389)
at org.dynjs.parser.ES3Parser.statementTail(ES3Parser.java:6355)
at org.dynjs.parser.ES3Parser.statement(ES3Parser.java:6219)
at org.dynjs.parser.ES3Parser.sourceElement(ES3Parser.java:10672)
at org.dynjs.parser.ES3Parser.program(ES3Parser.java:10590)
at org.dynjs.runtime.DynJS.parseSourceCode(DynJS.java:185)
at org.dynjs.runtime.DynJS.parseSourceCode(DynJS.java:165)
at org.dynjs.runtime.DynJS.compile(DynJS.java:136)
at org.dynjs.runtime.DynJS.execute(DynJS.java:100)
at org.dynjs.runtime.DynJS.execute(DynJS.java:95)
at org.dynjs.runtime.DynJS.evaluate(DynJS.java:123)
at org.dynjs.runtime.builtins.Eval.call(Eval.java:36)
at org.dynjs.runtime.AbstractNativeFunction.call(AbstractNativeFunction.java:62)
at org.dynjs.runtime.ExecutionContext.call(ExecutionContext.java:139)
... 8 more
===
=== ch15/15.1/15.1.2/15.1.2.1/S15.1.2.1_A3.2_T7 failed in non-strict mode ===
--- errors ---
org/dynjs/parser/ES3Walker.g: node from after line 1:6 no viable alternative at input 'UP'
Exception in thread "main" org.dynjs.exception.ThrowException: java.lang.NullPointerException
at <native function: org.dynjs.runtime.builtins.Eval>(org/dynjs/runtime/builtins/Eval.java:0)
at <global>.<eval>(/var/folders/vt/nrnb_cw95ps51fgmm9rq2mpw0000gn/T/test262-b6J_Rt.js:2178)
at org.dynjs.runtime.ExecutionContext.call(ExecutionContext.java:148)
at org.dynjs.gen.Program0.execute(Unknown Source)
at org.dynjs.runtime.ExecutionContext.execute(ExecutionContext.java:122)
at org.dynjs.runtime.DynJS.execute(DynJS.java:90)
at org.dynjs.runtime.DynJS.execute(DynJS.java:80)
at org.dynjs.runtime.DynJS.execute(DynJS.java:76)
at org.dynjs.cli.Main.executeFile(Main.java:73)
at org.dynjs.cli.Main.run(Main.java:60)
at org.dynjs.cli.Main.main(Main.java:46)
Caused by: java.lang.NullPointerException
at org.dynjs.compiler.CodeBlockUtils$2.<init>(CodeBlockUtils.java:68)
at org.dynjs.compiler.CodeBlockUtils.compiledStatementBlock(CodeBlockUtils.java:63)
at org.dynjs.compiler.CodeBlockUtils$1.<init>(CodeBlockUtils.java:51)
at org.dynjs.compiler.CodeBlockUtils.invokeCompiledStatementBlock(CodeBlockUtils.java:49)
at org.dynjs.parser.ast.WhileStatement$1.<init>(WhileStatement.java:76)
at org.dynjs.parser.ast.WhileStatement.getCodeBlock(WhileStatement.java:53)
at org.dynjs.parser.ast.BlockStatement$1.<init>(BlockStatement.java:116)
at org.dynjs.parser.ast.BlockStatement.getCodeBlock(BlockStatement.java:88)
at org.dynjs.compiler.ProgramCompiler$1$2.<init>(ProgramCompiler.java:51)
at org.dynjs.compiler.ProgramCompiler$1.getCodeBlock(ProgramCompiler.java:49)
at org.dynjs.compiler.ProgramCompiler$1.<init>(ProgramCompiler.java:45)
at org.dynjs.compiler.ProgramCompiler.compile(ProgramCompiler.java:26)
at org.dynjs.compiler.JSCompiler.compileProgram(JSCompiler.java:31)
at org.dynjs.runtime.DynJS.compile(DynJS.java:140)
at org.dynjs.runtime.DynJS.execute(DynJS.java:100)
at org.dynjs.runtime.DynJS.execute(DynJS.java:95)
at org.dynjs.runtime.DynJS.evaluate(DynJS.java:123)
at org.dynjs.runtime.builtins.Eval.call(Eval.java:36)
at org.dynjs.runtime.AbstractNativeFunction.call(AbstractNativeFunction.java:62)
at org.dynjs.runtime.ExecutionContext.call(ExecutionContext.java:139)
... 8 more
===
=== ch15/15.1/15.1.2/15.1.2.1/S15.1.2.1_A3.2_T8 failed in non-strict mode ===
--- errors ---
Exception in thread "main" org.dynjs.exception.ThrowException: java.util.NoSuchElementException: can't look backwards more than one token in this stream
at <native function: org.dynjs.runtime.builtins.Eval>(org/dynjs/runtime/builtins/Eval.java:0)
at <global>.<eval>(/var/folders/vt/nrnb_cw95ps51fgmm9rq2mpw0000gn/T/test262-kRPFud.js:2178)
at org.dynjs.runtime.ExecutionContext.call(ExecutionContext.java:148)
at org.dynjs.gen.Program0.execute(Unknown Source)
at org.dynjs.runtime.ExecutionContext.execute(ExecutionContext.java:122)
at org.dynjs.runtime.DynJS.execute(DynJS.java:90)
at org.dynjs.runtime.DynJS.execute(DynJS.java:80)
at org.dynjs.runtime.DynJS.execute(DynJS.java:76)
at org.dynjs.cli.Main.executeFile(Main.java:73)
at org.dynjs.cli.Main.run(Main.java:60)
at org.dynjs.cli.Main.main(Main.java:46)
Caused by: java.util.NoSuchElementException: can't look backwards more than one token in this stream
at org.antlr.runtime.misc.LookaheadStream.LB(LookaheadStream.java:159)
at org.antlr.runtime.misc.LookaheadStream.LT(LookaheadStream.java:120)
at org.antlr.runtime.RecognitionException.extractInformationFromTreeNodeStream(RecognitionException.java:144)
at org.antlr.runtime.RecognitionException.<init>(RecognitionException.java:111)
at org.antlr.runtime.NoViableAltException.<init>(NoViableAltException.java:43)
at org.dynjs.parser.ES3Walker.statement(ES3Walker.java:539)
at org.dynjs.parser.ES3Walker.forStatement(ES3Walker.java:1465)
at org.dynjs.parser.ES3Walker.statement(ES3Walker.java:634)
at org.dynjs.parser.ES3Walker.program(ES3Walker.java:322)
at org.dynjs.runtime.DynJS.parseSourceCode(DynJS.java:204)
at org.dynjs.runtime.DynJS.parseSourceCode(DynJS.java:165)
at org.dynjs.runtime.DynJS.compile(DynJS.java:136)
at org.dynjs.runtime.DynJS.execute(DynJS.java:100)
at org.dynjs.runtime.DynJS.execute(DynJS.java:95)
at org.dynjs.runtime.DynJS.evaluate(DynJS.java:123)
at org.dynjs.runtime.builtins.Eval.call(Eval.java:36)
at org.dynjs.runtime.AbstractNativeFunction.call(AbstractNativeFunction.java:62)
at org.dynjs.runtime.ExecutionContext.call(ExecutionContext.java:139)
... 8 more
===
ch15/15.1/15.1.2/15.1.2.1/S15.1.2.1_A3.3_T1 passed in non-strict mode
ch15/15.1/15.1.2/15.1.2.1/S15.1.2.1_A3.3_T2 passed in non-strict mode
=== ch15/15.1/15.1.2/15.1.2.1/S15.1.2.1_A3.3_T3 failed in non-strict mode ===
--- errors ---
Exception in thread "main" org.dynjs.exception.ThrowException: #1.2: return must throw SyntaxError. Actual: Test262 Error: #1.1: return must throw SyntaxError. Actual: undefined
at <global>.testFailed(/var/folders/vt/nrnb_cw95ps51fgmm9rq2mpw0000gn/T/test262-aSDsfk.js:289)
at <global>.$ERROR(/var/folders/vt/nrnb_cw95ps51fgmm9rq2mpw0000gn/T/test262-aSDsfk.js:305)
at <global>.<eval>(<eval>:2183)
at org.dynjs.gen.Function13.call(Unknown Source)
at org.dynjs.runtime.ExecutionContext.call(ExecutionContext.java:139)
at org.dynjs.gen.Function17.call(Unknown Source)
at org.dynjs.runtime.ExecutionContext.call(ExecutionContext.java:139)
at org.dynjs.gen.ThenBlock23.call(Unknown Source)
at org.dynjs.gen.CatchBlock22.call(Unknown Source)
at org.dynjs.runtime.ExecutionContext.executeCatch(ExecutionContext.java:235)
at org.dynjs.gen.Program0.execute(Unknown Source)
at org.dynjs.runtime.ExecutionContext.execute(ExecutionContext.java:122)
at org.dynjs.runtime.DynJS.execute(DynJS.java:90)
at org.dynjs.runtime.DynJS.execute(DynJS.java:80)
at org.dynjs.runtime.DynJS.execute(DynJS.java:76)
at org.dynjs.cli.Main.executeFile(Main.java:73)
at org.dynjs.cli.Main.run(Main.java:60)
at org.dynjs.cli.Main.main(Main.java:46)
===
ch15/15.1/15.1.2/15.1.2.1/S15.1.2.1_A3.3_T4 passed in non-strict mode
ch15/15.1/15.1.2/15.1.2.1/S15.1.2.1_A4.1 passed in non-strict mode
ch15/15.1/15.1.2/15.1.2.1/S15.1.2.1_A4.2 passed in non-strict mode
ch15/15.1/15.1.2/15.1.2.1/S15.1.2.1_A4.3 passed in non-strict mode
ch15/15.1/15.1.2/15.1.2.1/S15.1.2.1_A4.4 passed in non-strict mode
ch15/15.1/15.1.2/15.1.2.1/S15.1.2.1_A4.5 passed in non-strict mode
ch15/15.1/15.1.2/15.1.2.1/S15.1.2.1_A4.6 passed in non-strict mode
=== ch15/15.1/15.1.2/15.1.2.1/S15.1.2.1_A4.7 failed in non-strict mode ===
--- errors ---
Exception in thread "main" org.dynjs.exception.ThrowException: #1.2: new eval() throw TypeError. Actual: Test262 Error: #1.1: new eval() throw TypeError. Actual: [object Object]
at <global>.testFailed(/var/folders/vt/nrnb_cw95ps51fgmm9rq2mpw0000gn/T/test262-z7JR0N.js:289)
at <global>.$ERROR(/var/folders/vt/nrnb_cw95ps51fgmm9rq2mpw0000gn/T/test262-z7JR0N.js:305)
at <global>.<eval>(/var/folders/vt/nrnb_cw95ps51fgmm9rq2mpw0000gn/T/test262-z7JR0N.js:2184)
at org.dynjs.gen.Function13.call(Unknown Source)
at org.dynjs.runtime.ExecutionContext.call(ExecutionContext.java:139)
at org.dynjs.gen.Function17.call(Unknown Source)
at org.dynjs.runtime.ExecutionContext.call(ExecutionContext.java:139)
at org.dynjs.gen.ThenBlock23.call(Unknown Source)
at org.dynjs.gen.CatchBlock22.call(Unknown Source)
at org.dynjs.runtime.ExecutionContext.executeCatch(ExecutionContext.java:235)
at org.dynjs.gen.Program0.execute(Unknown Source)
at org.dynjs.runtime.ExecutionContext.execute(ExecutionContext.java:122)
at org.dynjs.runtime.DynJS.execute(DynJS.java:90)
at org.dynjs.runtime.DynJS.execute(DynJS.java:80)
at org.dynjs.runtime.DynJS.execute(DynJS.java:76)
at org.dynjs.cli.Main.executeFile(Main.java:73)
at org.dynjs.cli.Main.run(Main.java:60)
at org.dynjs.cli.Main.main(Main.java:46)
===
ch15/15.1/15.1.2/15.1.2.2/15.1.2.2-2-1 passed in non-strict mode
ch15/15.1/15.1.2/15.1.2.2/S15.1.2.2_A1_T1 passed in non-strict mode
ch15/15.1/15.1.2/15.1.2.2/S15.1.2.2_A1_T2 passed in non-strict mode
ch15/15.1/15.1.2/15.1.2.2/S15.1.2.2_A1_T3 passed in non-strict mode
ch15/15.1/15.1.2/15.1.2.2/S15.1.2.2_A1_T4 passed in non-strict mode
ch15/15.1/15.1.2/15.1.2.2/S15.1.2.2_A1_T5 passed in non-strict mode
ch15/15.1/15.1.2/15.1.2.2/S15.1.2.2_A1_T6 passed in non-strict mode
ch15/15.1/15.1.2/15.1.2.2/S15.1.2.2_A1_T7 passed in non-strict mode
ch15/15.1/15.1.2/15.1.2.2/S15.1.2.2_A2_T1 passed in non-strict mode
ch15/15.1/15.1.2/15.1.2.2/S15.1.2.2_A2_T10 passed in non-strict mode
ch15/15.1/15.1.2/15.1.2.2/S15.1.2.2_A2_T2 passed in non-strict mode
ch15/15.1/15.1.2/15.1.2.2/S15.1.2.2_A2_T3 passed in non-strict mode
ch15/15.1/15.1.2/15.1.2.2/S15.1.2.2_A2_T4 passed in non-strict mode
ch15/15.1/15.1.2/15.1.2.2/S15.1.2.2_A2_T5 passed in non-strict mode
ch15/15.1/15.1.2/15.1.2.2/S15.1.2.2_A2_T6 passed in non-strict mode
ch15/15.1/15.1.2/15.1.2.2/S15.1.2.2_A2_T7 passed in non-strict mode
ch15/15.1/15.1.2/15.1.2.2/S15.1.2.2_A2_T8 passed in non-strict mode
ch15/15.1/15.1.2/15.1.2.2/S15.1.2.2_A2_T9 passed in non-strict mode
ch15/15.1/15.1.2/15.1.2.2/S15.1.2.2_A3.1_T1 passed in non-strict mode
ch15/15.1/15.1.2/15.1.2.2/S15.1.2.2_A3.1_T2 passed in non-strict mode
ch15/15.1/15.1.2/15.1.2.2/S15.1.2.2_A3.1_T3 passed in non-strict mode
ch15/15.1/15.1.2/15.1.2.2/S15.1.2.2_A3.1_T4 passed in non-strict mode
ch15/15.1/15.1.2/15.1.2.2/S15.1.2.2_A3.1_T5 passed in non-strict mode
ch15/15.1/15.1.2/15.1.2.2/S15.1.2.2_A3.1_T6 passed in non-strict mode
ch15/15.1/15.1.2/15.1.2.2/S15.1.2.2_A3.1_T7 passed in non-strict mode
ch15/15.1/15.1.2/15.1.2.2/S15.1.2.2_A3.2_T1 passed in non-strict mode
ch15/15.1/15.1.2/15.1.2.2/S15.1.2.2_A3.2_T2 passed in non-strict mode
ch15/15.1/15.1.2/15.1.2.2/S15.1.2.2_A3.2_T3 passed in non-strict mode
ch15/15.1/15.1.2/15.1.2.2/S15.1.2.2_A4.1_T1 passed in non-strict mode
ch15/15.1/15.1.2/15.1.2.2/S15.1.2.2_A4.1_T2 passed in non-strict mode
ch15/15.1/15.1.2/15.1.2.2/S15.1.2.2_A4.2_T1 passed in non-strict mode
ch15/15.1/15.1.2/15.1.2.2/S15.1.2.2_A4.2_T2 passed in non-strict mode
=== ch15/15.1/15.1.2/15.1.2.2/S15.1.2.2_A4.2_T3 failed in non-strict mode ===
--- errors ---
Exception in thread "main" org.dynjs.exception.ThrowException: java.util.regex.PatternSyntaxException: Illegal character range near index 6
[^-.0--65].*
^
at <global>.<native function: ParseInt>(org/dynjs/runtime/builtins/ParseInt.java:0)
at <global>.<eval>(/var/folders/vt/nrnb_cw95ps51fgmm9rq2mpw0000gn/T/test262-pqwf4R.js:2185)
at org.dynjs.runtime.ExecutionContext.call(ExecutionContext.java:148)
at org.dynjs.gen.ThenBlock21.call(Unknown Source)
at org.dynjs.gen.ForBlock20.call(Unknown Source)
at org.dynjs.gen.Program0.execute(Unknown Source)
at org.dynjs.runtime.ExecutionContext.execute(ExecutionContext.java:122)
at org.dynjs.runtime.DynJS.execute(DynJS.java:90)
at org.dynjs.runtime.DynJS.execute(DynJS.java:80)
at org.dynjs.runtime.DynJS.execute(DynJS.java:76)
at org.dynjs.cli.Main.executeFile(Main.java:73)
at org.dynjs.cli.Main.run(Main.java:60)
at org.dynjs.cli.Main.main(Main.java:46)
Caused by: java.util.regex.PatternSyntaxException: Illegal character range near index 6
[^-.0--65].*
^
at java.util.regex.Pattern.error(Pattern.java:1924)
at java.util.regex.Pattern.range(Pattern.java:2594)
at java.util.regex.Pattern.clazz(Pattern.java:2507)
at java.util.regex.Pattern.sequence(Pattern.java:2030)
at java.util.regex.Pattern.expr(Pattern.java:1964)
at java.util.regex.Pattern.compile(Pattern.java:1665)
at java.util.regex.Pattern.<init>(Pattern.java:1337)
at java.util.regex.Pattern.compile(Pattern.java:1022)
at java.lang.String.replaceAll(String.java:2162)
at org.dynjs.runtime.builtins.ParseInt.cleanText(ParseInt.java:61)
at org.dynjs.runtime.builtins.ParseInt.call(ParseInt.java:41)
at org.dynjs.runtime.AbstractNativeFunction.call(AbstractNativeFunction.java:62)
at org.dynjs.runtime.ExecutionContext.call(ExecutionContext.java:139)
... 10 more
===
ch15/15.1/15.1.2/15.1.2.2/S15.1.2.2_A5.1_T1 passed in non-strict mode
=== ch15/15.1/15.1.2/15.1.2.2/S15.1.2.2_A5.2_T1 failed in non-strict mode ===
--- errors ---
Exception in thread "main" org.dynjs.exception.ThrowException: #2: parseInt("0x2", 0) === parseInt("2", 16). Actual: 2
at <global>.testFailed(/var/folders/vt/nrnb_cw95ps51fgmm9rq2mpw0000gn/T/test262-f9wyR9.js:289)
at <global>.$ERROR(/var/folders/vt/nrnb_cw95ps51fgmm9rq2mpw0000gn/T/test262-f9wyR9.js:305)
at <global>.<eval>(/var/folders/vt/nrnb_cw95ps51fgmm9rq2mpw0000gn/T/test262-f9wyR9.js:2189)
at org.dynjs.gen.Function13.call(Unknown Source)
at org.dynjs.runtime.ExecutionContext.call(ExecutionContext.java:139)
at org.dynjs.gen.Function17.call(Unknown Source)
at org.dynjs.runtime.ExecutionContext.call(ExecutionContext.java:139)
at org.dynjs.gen.ThenBlock20.call(Unknown Source)
at org.dynjs.gen.Program0.execute(Unknown Source)
at org.dynjs.runtime.ExecutionContext.execute(ExecutionContext.java:122)
at org.dynjs.runtime.DynJS.execute(DynJS.java:90)
at org.dynjs.runtime.DynJS.execute(DynJS.java:80)
at org.dynjs.runtime.DynJS.execute(DynJS.java:76)
at org.dynjs.cli.Main.executeFile(Main.java:73)
at org.dynjs.cli.Main.run(Main.java:60)
at org.dynjs.cli.Main.main(Main.java:46)
===
=== ch15/15.1/15.1.2/15.1.2.2/S15.1.2.2_A5.2_T2 failed in non-strict mode ===
--- errors ---
Exception in thread "main" org.dynjs.exception.ThrowException: #1: parseInt("0X1") === parseInt("1", 16). Actual: 0
at <global>.testFailed(/var/folders/vt/nrnb_cw95ps51fgmm9rq2mpw0000gn/T/test262-RQAHLO.js:289)
at <global>.$ERROR(/var/folders/vt/nrnb_cw95ps51fgmm9rq2mpw0000gn/T/test262-RQAHLO.js:305)
at <global>.<eval>(/var/folders/vt/nrnb_cw95ps51fgmm9rq2mpw0000gn/T/test262-RQAHLO.js:2184)
at org.dynjs.gen.Function13.call(Unknown Source)
at org.dynjs.runtime.ExecutionContext.call(ExecutionContext.java:139)
at org.dynjs.gen.Function17.call(Unknown Source)
at org.dynjs.runtime.ExecutionContext.call(ExecutionContext.java:139)
at org.dynjs.gen.ThenBlock20.call(Unknown Source)
at org.dynjs.gen.Program0.execute(Unknown Source)
at org.dynjs.runtime.ExecutionContext.execute(ExecutionContext.java:122)
at org.dynjs.runtime.DynJS.execute(DynJS.java:90)
at org.dynjs.runtime.DynJS.execute(DynJS.java:80)
at org.dynjs.runtime.DynJS.execute(DynJS.java:76)
at org.dynjs.cli.Main.executeFile(Main.java:73)
at org.dynjs.cli.Main.run(Main.java:60)
at org.dynjs.cli.Main.main(Main.java:46)
===
ch15/15.1/15.1.2/15.1.2.2/S15.1.2.2_A6.1_T1 passed in non-strict mode
=== ch15/15.1/15.1.2/15.1.2.2/S15.1.2.2_A6.1_T2 failed in non-strict mode ===
--- errors ---
Exception in thread "main" org.dynjs.exception.ThrowException: #11:
at <global>.testFailed(/var/folders/vt/nrnb_cw95ps51fgmm9rq2mpw0000gn/T/test262-WO8IJg.js:289)
at <global>.$ERROR(/var/folders/vt/nrnb_cw95ps51fgmm9rq2mpw0000gn/T/test262-WO8IJg.js:305)
at <global>.<eval>(/var/folders/vt/nrnb_cw95ps51fgmm9rq2mpw0000gn/T/test262-WO8IJg.js:2181)
at org.dynjs.gen.Function13.call(Unknown Source)
at org.dynjs.runtime.ExecutionContext.call(ExecutionContext.java:139)
at org.dynjs.gen.Function17.call(Unknown Source)
at org.dynjs.runtime.ExecutionContext.call(ExecutionContext.java:139)
at org.dynjs.gen.ThenBlock21.call(Unknown Source)
at org.dynjs.gen.ForBlock20.call(Unknown Source)
at org.dynjs.gen.Program0.execute(Unknown Source)
at org.dynjs.runtime.ExecutionContext.execute(ExecutionContext.java:122)
at org.dynjs.runtime.DynJS.execute(DynJS.java:90)
at org.dynjs.runtime.DynJS.execute(DynJS.java:80)
at org.dynjs.runtime.DynJS.execute(DynJS.java:76)
at org.dynjs.cli.Main.executeFile(Main.java:73)
at org.dynjs.cli.Main.run(Main.java:60)
at org.dynjs.cli.Main.main(Main.java:46)
===
=== ch15/15.1/15.1.2/15.1.2.2/S15.1.2.2_A6.1_T3 failed in non-strict mode ===
--- errors ---
Exception in thread "main" org.dynjs.exception.ThrowException: #11:
at <global>.testFailed(/var/folders/vt/nrnb_cw95ps51fgmm9rq2mpw0000gn/T/test262-JCS8wD.js:289)
at <global>.$ERROR(/var/folders/vt/nrnb_cw95ps51fgmm9rq2mpw0000gn/T/test262-JCS8wD.js:305)
at <global>.<eval>(/var/folders/vt/nrnb_cw95ps51fgmm9rq2mpw0000gn/T/test262-JCS8wD.js:2181)
at org.dynjs.gen.Function13.call(Unknown Source)
at org.dynjs.runtime.ExecutionContext.call(ExecutionContext.java:139)
at org.dynjs.gen.Function17.call(Unknown Source)
at org.dynjs.runtime.ExecutionContext.call(ExecutionContext.java:139)
at org.dynjs.gen.ThenBlock21.call(Unknown Source)
at org.dynjs.gen.ForBlock20.call(Unknown Source)
at org.dynjs.gen.Program0.execute(Unknown Source)
at org.dynjs.runtime.ExecutionContext.execute(ExecutionContext.java:122)
at org.dynjs.runtime.DynJS.execute(DynJS.java:90)
at org.dynjs.runtime.DynJS.execute(DynJS.java:80)
at org.dynjs.runtime.DynJS.execute(DynJS.java:76)
at org.dynjs.cli.Main.executeFile(Main.java:73)
at org.dynjs.cli.Main.run(Main.java:60)
at org.dynjs.cli.Main.main(Main.java:46)
===
=== ch15/15.1/15.1.2/15.1.2.2/S15.1.2.2_A6.1_T4 failed in non-strict mode ===
--- errors ---
Exception in thread "main" org.dynjs.exception.ThrowException: #11:
at <global>.testFailed(/var/folders/vt/nrnb_cw95ps51fgmm9rq2mpw0000gn/T/test262-nHeptI.js:289)
at <global>.$ERROR(/var/folders/vt/nrnb_cw95ps51fgmm9rq2mpw0000gn/T/test262-nHeptI.js:305)
at <global>.<eval>(/var/folders/vt/nrnb_cw95ps51fgmm9rq2mpw0000gn/T/test262-nHeptI.js:2181)
at org.dynjs.gen.Function13.call(Unknown Source)
at org.dynjs.runtime.ExecutionContext.call(ExecutionContext.java:139)
at org.dynjs.gen.Function17.call(Unknown Source)
at org.dynjs.runtime.ExecutionContext.call(ExecutionContext.java:139)
at org.dynjs.gen.ThenBlock21.call(Unknown Source)
at org.dynjs.gen.ForBlock20.call(Unknown Source)
at org.dynjs.gen.Program0.execute(Unknown Source)
at org.dynjs.runtime.ExecutionContext.execute(ExecutionContext.java:122)
at org.dynjs.runtime.DynJS.execute(DynJS.java:90)
at org.dynjs.runtime.DynJS.execute(DynJS.java:80)
at org.dynjs.runtime.DynJS.execute(DynJS.java:76)
at org.dynjs.cli.Main.executeFile(Main.java:73)
at org.dynjs.cli.Main.run(Main.java:60)
at org.dynjs.cli.Main.main(Main.java:46)
===
=== ch15/15.1/15.1.2/15.1.2.2/S15.1.2.2_A6.1_T5 failed in non-strict mode ===
--- errors ---
Exception in thread "main" org.dynjs.exception.ThrowException: #11:
at <global>.testFailed(/var/folders/vt/nrnb_cw95ps51fgmm9rq2mpw0000gn/T/test262-o8F88m.js:289)
at <global>.$ERROR(/var/folders/vt/nrnb_cw95ps51fgmm9rq2mpw0000gn/T/test262-o8F88m.js:305)
at <global>.<eval>(/var/folders/vt/nrnb_cw95ps51fgmm9rq2mpw0000gn/T/test262-o8F88m.js:2181)
at org.dynjs.gen.Function13.call(Unknown Source)
at org.dynjs.runtime.ExecutionContext.call(ExecutionContext.java:139)
at org.dynjs.gen.Function17.call(Unknown Source)
at org.dynjs.runtime.ExecutionContext.call(ExecutionContext.java:139)
at org.dynjs.gen.ThenBlock21.call(Unknown Source)
at org.dynjs.gen.ForBlock20.call(Unknown Source)
at org.dynjs.gen.Program0.execute(Unknown Source)
at org.dynjs.runtime.ExecutionContext.execute(ExecutionContext.java:122)
at org.dynjs.runtime.DynJS.execute(DynJS.java:90)
at org.dynjs.runtime.DynJS.execute(DynJS.java:80)
at org.dynjs.runtime.DynJS.execute(DynJS.java:76)
at org.dynjs.cli.Main.executeFile(Main.java:73)
at org.dynjs.cli.Main.run(Main.java:60)
at org.dynjs.cli.Main.main(Main.java:46)
===
ch15/15.1/15.1.2/15.1.2.2/S15.1.2.2_A6.1_T6 passed in non-strict mode
ch15/15.1/15.1.2/15.1.2.2/S15.1.2.2_A7.1_T1 passed in non-strict mode
ch15/15.1/15.1.2/15.1.2.2/S15.1.2.2_A7.1_T2 passed in non-strict mode
=== ch15/15.1/15.1.2/15.1.2.2/S15.1.2.2_A7.2_T1 failed in non-strict mode ===
--- errors ---
Exception in thread "main" org.dynjs.exception.ThrowException: #11.0 :
at <global>.testFailed(/var/folders/vt/nrnb_cw95ps51fgmm9rq2mpw0000gn/T/test262-AANusx.js:289)
at <global>.$ERROR(/var/folders/vt/nrnb_cw95ps51fgmm9rq2mpw0000gn/T/test262-AANusx.js:305)
at <global>.<eval>(/var/folders/vt/nrnb_cw95ps51fgmm9rq2mpw0000gn/T/test262-AANusx.js:2196)
at org.dynjs.gen.Function13.call(Unknown Source)
at org.dynjs.runtime.ExecutionContext.call(ExecutionContext.java:139)
at org.dynjs.gen.Function17.call(Unknown Source)
at org.dynjs.runtime.ExecutionContext.call(ExecutionContext.java:139)
at org.dynjs.gen.ThenBlock25.call(Unknown Source)
at org.dynjs.gen.ForBlock21.call(Unknown Source)
at org.dynjs.gen.ForBlock20.call(Unknown Source)
at org.dynjs.gen.Program0.execute(Unknown Source)
at org.dynjs.runtime.ExecutionContext.execute(ExecutionContext.java:122)
at org.dynjs.runtime.DynJS.execute(DynJS.java:90)
at org.dynjs.runtime.DynJS.execute(DynJS.java:80)
at org.dynjs.runtime.DynJS.execute(DynJS.java:76)
at org.dynjs.cli.Main.executeFile(Main.java:73)
at org.dynjs.cli.Main.run(Main.java:60)
at org.dynjs.cli.Main.main(Main.java:46)
===
ch15/15.1/15.1.2/15.1.2.2/S15.1.2.2_A7.2_T2 passed in non-strict mode
=== ch15/15.1/15.1.2/15.1.2.2/S15.1.2.2_A7.2_T3 failed in non-strict mode ===
--- errors ---
Exception in thread "main" org.dynjs.exception.ThrowException: #9: parseInt("0x100000000", 16) === 4294967296. Actual: NaN
at <global>.testFailed(/var/folders/vt/nrnb_cw95ps51fgmm9rq2mpw0000gn/T/test262-36NmCn.js:289)
at <global>.$ERROR(/var/folders/vt/nrnb_cw95ps51fgmm9rq2mpw0000gn/T/test262-36NmCn.js:305)
at <global>.<eval>(/var/folders/vt/nrnb_cw95ps51fgmm9rq2mpw0000gn/T/test262-36NmCn.js:2219)
at org.dynjs.gen.Function13.call(Unknown Source)
at org.dynjs.runtime.ExecutionContext.call(ExecutionContext.java:139)
at org.dynjs.gen.Function17.call(Unknown Source)
at org.dynjs.runtime.ExecutionContext.call(ExecutionContext.java:139)
at org.dynjs.gen.ThenBlock20.call(Unknown Source)
at org.dynjs.gen.Program0.execute(Unknown Source)
at org.dynjs.runtime.ExecutionContext.execute(ExecutionContext.java:122)
at org.dynjs.runtime.DynJS.execute(DynJS.java:90)
at org.dynjs.runtime.DynJS.execute(DynJS.java:80)
at org.dynjs.runtime.DynJS.execute(DynJS.java:76)
at org.dynjs.cli.Main.executeFile(Main.java:73)
at org.dynjs.cli.Main.run(Main.java:60)
at org.dynjs.cli.Main.main(Main.java:46)
===
=== ch15/15.1/15.1.2/15.1.2.2/S15.1.2.2_A7.3_T1 failed in non-strict mode ===
--- errors ---
Exception in thread "main" org.dynjs.exception.ThrowException: #2.0 :
at <global>.testFailed(/var/folders/vt/nrnb_cw95ps51fgmm9rq2mpw0000gn/T/test262-ZhKWcn.js:289)
at <global>.$ERROR(/var/folders/vt/nrnb_cw95ps51fgmm9rq2mpw0000gn/T/test262-ZhKWcn.js:305)
at <global>.<eval>(/var/folders/vt/nrnb_cw95ps51fgmm9rq2mpw0000gn/T/test262-ZhKWcn.js:2201)
at org.dynjs.gen.Function13.call(Unknown Source)
at org.dynjs.runtime.ExecutionContext.call(ExecutionContext.java:139)
at org.dynjs.gen.Function17.call(Unknown Source)
at org.dynjs.runtime.ExecutionContext.call(ExecutionContext.java:139)
at org.dynjs.gen.ThenBlock24.call(Unknown Source)
at org.dynjs.gen.ForBlock21.call(Unknown Source)
at org.dynjs.gen.ForBlock20.call(Unknown Source)
at org.dynjs.gen.Program0.execute(Unknown Source)
at org.dynjs.runtime.ExecutionContext.execute(ExecutionContext.java:122)
at org.dynjs.runtime.DynJS.execute(DynJS.java:90)
at org.dynjs.runtime.DynJS.execute(DynJS.java:80)
at org.dynjs.runtime.DynJS.execute(DynJS.java:76)
at org.dynjs.cli.Main.executeFile(Main.java:73)
at org.dynjs.cli.Main.run(Main.java:60)
at org.dynjs.cli.Main.main(Main.java:46)
===
ch15/15.1/15.1.2/15.1.2.2/S15.1.2.2_A7.3_T2 passed in non-strict mode
=== ch15/15.1/15.1.2/15.1.2.2/S15.1.2.2_A7.3_T3 failed in non-strict mode ===
--- errors ---
Exception in thread "main" org.dynjs.exception.ThrowException: #10: parseInt("-10000000000", 10) === -10000000000. Actual: NaN
at <global>.testFailed(/var/folders/vt/nrnb_cw95ps51fgmm9rq2mpw0000gn/T/test262-mwoQAy.js:289)
at <global>.$ERROR(/var/folders/vt/nrnb_cw95ps51fgmm9rq2mpw0000gn/T/test262-mwoQAy.js:305)
at <global>.<eval>(/var/folders/vt/nrnb_cw95ps51fgmm9rq2mpw0000gn/T/test262-mwoQAy.js:2229)
at org.dynjs.gen.Function13.call(Unknown Source)
at org.dynjs.runtime.ExecutionContext.call(ExecutionContext.java:139)
at org.dynjs.gen.Function17.call(Unknown Source)
at org.dynjs.runtime.ExecutionContext.call(ExecutionContext.java:139)
at org.dynjs.gen.ThenBlock29.call(Unknown Source)
at org.dynjs.gen.Program0.execute(Unknown Source)
at org.dynjs.runtime.ExecutionContext.execute(ExecutionContext.java:122)
at org.dynjs.runtime.DynJS.execute(DynJS.java:90)
at org.dynjs.runtime.DynJS.execute(DynJS.java:80)
at org.dynjs.runtime.DynJS.execute(DynJS.java:76)
at org.dynjs.cli.Main.executeFile(Main.java:73)
at org.dynjs.cli.Main.run(Main.java:60)
at org.dynjs.cli.Main.main(Main.java:46)
===
=== ch15/15.1/15.1.2/15.1.2.2/S15.1.2.2_A8 failed in non-strict mode ===
--- errors ---
Exception in thread "main" org.dynjs.exception.ThrowException: #0001-002F
at <global>.testFailed(/var/folders/vt/nrnb_cw95ps51fgmm9rq2mpw0000gn/T/test262-Ffnjob.js:289)
at <global>.$ERROR(/var/folders/vt/nrnb_cw95ps51fgmm9rq2mpw0000gn/T/test262-Ffnjob.js:305)
at <global>.<eval>(/var/folders/vt/nrnb_cw95ps51fgmm9rq2mpw0000gn/T/test262-Ffnjob.js:2195)
at org.dynjs.gen.Function13.call(Unknown Source)
at org.dynjs.runtime.ExecutionContext.call(ExecutionContext.java:139)
at org.dynjs.gen.Function17.call(Unknown Source)
at org.dynjs.runtime.ExecutionContext.call(ExecutionContext.java:139)
at org.dynjs.gen.ThenBlock39.call(Unknown Source)
at org.dynjs.gen.ThenBlock38.call(Unknown Source)
at org.dynjs.gen.ElseBlock30.call(Unknown Source)
at org.dynjs.gen.ThenBlock28.call(Unknown Source)
at org.dynjs.gen.ThenBlock21.call(Unknown Source)
at org.dynjs.gen.ForBlock20.call(Unknown Source)
at org.dynjs.gen.Program0.execute(Unknown Source)
at org.dynjs.runtime.ExecutionContext.execute(ExecutionContext.java:122)
at org.dynjs.runtime.DynJS.execute(DynJS.java:90)
at org.dynjs.runtime.DynJS.execute(DynJS.java:80)
at org.dynjs.runtime.DynJS.execute(DynJS.java:76)
at org.dynjs.cli.Main.executeFile(Main.java:73)
at org.dynjs.cli.Main.run(Main.java:60)
at org.dynjs.cli.Main.main(Main.java:46)
===
ch15/15.1/15.1.2/15.1.2.2/S15.1.2.2_A9.1 passed in non-strict mode
ch15/15.1/15.1.2/15.1.2.2/S15.1.2.2_A9.2 passed in non-strict mode
ch15/15.1/15.1.2/15.1.2.2/S15.1.2.2_A9.3 passed in non-strict mode
ch15/15.1/15.1.2/15.1.2.2/S15.1.2.2_A9.4 passed in non-strict mode
ch15/15.1/15.1.2/15.1.2.2/S15.1.2.2_A9.5 passed in non-strict mode
ch15/15.1/15.1.2/15.1.2.2/S15.1.2.2_A9.6 passed in non-strict mode
ch15/15.1/15.1.2/15.1.2.2/S15.1.2.2_A9.7 passed in non-strict mode
ch15/15.1/15.1.2/15.1.2.3/15.1.2.3-2-1 passed in non-strict mode
ch15/15.1/15.1.2/15.1.2.3/S15.1.2.3_A1_T1 passed in non-strict mode
=== ch15/15.1/15.1.2/15.1.2.3/S15.1.2.3_A1_T2 failed in non-strict mode ===
--- errors ---
Exception in thread "main" org.dynjs.exception.ThrowException: java.lang.NumberFormatException: multiple points
at <global>.<eval>(/var/folders/vt/nrnb_cw95ps51fgmm9rq2mpw0000gn/T/test262-GU1J33.js:2193)
at org.dynjs.runtime.ExecutionContext.execute(ExecutionContext.java:126)
at org.dynjs.runtime.DynJS.execute(DynJS.java:90)
at org.dynjs.runtime.DynJS.execute(DynJS.java:80)
at org.dynjs.runtime.DynJS.execute(DynJS.java:76)
at org.dynjs.cli.Main.executeFile(Main.java:73)
at org.dynjs.cli.Main.run(Main.java:60)
at org.dynjs.cli.Main.main(Main.java:46)
Caused by: java.lang.NumberFormatException: multiple points
at sun.misc.FloatingDecimal.readJavaFormatString(FloatingDecimal.java:1101)
at java.lang.Double.valueOf(Double.java:504)
at org.dynjs.gen.Program0.execute(Unknown Source)
at org.dynjs.runtime.ExecutionContext.execute(ExecutionContext.java:122)
... 6 more
===
ch15/15.1/15.1.2/15.1.2.3/S15.1.2.3_A1_T3 passed in non-strict mode
ch15/15.1/15.1.2/15.1.2.3/S15.1.2.3_A1_T4 passed in non-strict mode
=== ch15/15.1/15.1.2/15.1.2.3/S15.1.2.3_A1_T5 failed in non-strict mode ===
--- errors ---
Exception in thread "main" org.dynjs.exception.ThrowException: java.lang.NumberFormatException: multiple points
at <global>.<eval>(/var/folders/vt/nrnb_cw95ps51fgmm9rq2mpw0000gn/T/test262-eHeLoC.js:2193)
at org.dynjs.runtime.ExecutionContext.execute(ExecutionContext.java:126)
at org.dynjs.runtime.DynJS.execute(DynJS.java:90)
at org.dynjs.runtime.DynJS.execute(DynJS.java:80)
at org.dynjs.runtime.DynJS.execute(DynJS.java:76)
at org.dynjs.cli.Main.executeFile(Main.java:73)
at org.dynjs.cli.Main.run(Main.java:60)
at org.dynjs.cli.Main.main(Main.java:46)
Caused by: java.lang.NumberFormatException: multiple points
at sun.misc.FloatingDecimal.readJavaFormatString(FloatingDecimal.java:1101)
at java.lang.Double.valueOf(Double.java:504)
at org.dynjs.gen.Program0.execute(Unknown Source)
at org.dynjs.runtime.ExecutionContext.execute(ExecutionContext.java:122)
... 6 more
===
ch15/15.1/15.1.2/15.1.2.3/S15.1.2.3_A1_T6 passed in non-strict mode
ch15/15.1/15.1.2/15.1.2.3/S15.1.2.3_A1_T7 passed in non-strict mode
ch15/15.1/15.1.2/15.1.2.3/S15.1.2.3_A2_T1 passed in non-strict mode
ch15/15.1/15.1.2/15.1.2.3/S15.1.2.3_A2_T10 passed in non-strict mode
ch15/15.1/15.1.2/15.1.2.3/S15.1.2.3_A2_T2 passed in non-strict mode
ch15/15.1/15.1.2/15.1.2.3/S15.1.2.3_A2_T3 passed in non-strict mode
ch15/15.1/15.1.2/15.1.2.3/S15.1.2.3_A2_T4 passed in non-strict mode
ch15/15.1/15.1.2/15.1.2.3/S15.1.2.3_A2_T5 passed in non-strict mode
ch15/15.1/15.1.2/15.1.2.3/S15.1.2.3_A2_T6 passed in non-strict mode
ch15/15.1/15.1.2/15.1.2.3/S15.1.2.3_A2_T7 passed in non-strict mode
ch15/15.1/15.1.2/15.1.2.3/S15.1.2.3_A2_T8 passed in non-strict mode
ch15/15.1/15.1.2/15.1.2.3/S15.1.2.3_A2_T9 passed in non-strict mode
ch15/15.1/15.1.2/15.1.2.3/S15.1.2.3_A3_T1 passed in non-strict mode
ch15/15.1/15.1.2/15.1.2.3/S15.1.2.3_A3_T2 passed in non-strict mode
ch15/15.1/15.1.2/15.1.2.3/S15.1.2.3_A3_T3 passed in non-strict mode
=== ch15/15.1/15.1.2/15.1.2.3/S15.1.2.3_A4_T1 failed in non-strict mode ===
--- errors ---
Exception in thread "main" org.dynjs.exception.ThrowException: #1: parseFloat("0x") === 0. Actual: NaN
at <global>.testFailed(/var/folders/vt/nrnb_cw95ps51fgmm9rq2mpw0000gn/T/test262-lDC2b7.js:289)
at <global>.$ERROR(/var/folders/vt/nrnb_cw95ps51fgmm9rq2mpw0000gn/T/test262-lDC2b7.js:305)
at <global>.<eval>(/var/folders/vt/nrnb_cw95ps51fgmm9rq2mpw0000gn/T/test262-lDC2b7.js:2179)
at org.dynjs.gen.Function13.call(Unknown Source)
at org.dynjs.runtime.ExecutionContext.call(ExecutionContext.java:139)
at org.dynjs.gen.Function17.call(Unknown Source)
at org.dynjs.runtime.ExecutionContext.call(ExecutionContext.java:139)
at org.dynjs.gen.ThenBlock20.call(Unknown Source)
at org.dynjs.gen.Program0.execute(Unknown Source)
at org.dynjs.runtime.ExecutionContext.execute(ExecutionContext.java:122)
at org.dynjs.runtime.DynJS.execute(DynJS.java:90)
at org.dynjs.runtime.DynJS.execute(DynJS.java:80)
at org.dynjs.runtime.DynJS.execute(DynJS.java:76)
at org.dynjs.cli.Main.executeFile(Main.java:73)
at org.dynjs.cli.Main.run(Main.java:60)
at org.dynjs.cli.Main.main(Main.java:46)
===
=== ch15/15.1/15.1.2/15.1.2.3/S15.1.2.3_A4_T2 failed in non-strict mode ===
--- errors ---
Exception in thread "main" org.dynjs.exception.ThrowException: #1: parseFloat("1ex") === 1. Actual: NaN
at <global>.testFailed(/var/folders/vt/nrnb_cw95ps51fgmm9rq2mpw0000gn/T/test262-hgE05V.js:289)
at <global>.$ERROR(/var/folders/vt/nrnb_cw95ps51fgmm9rq2mpw0000gn/T/test262-hgE05V.js:305)
at <global>.<eval>(/var/folders/vt/nrnb_cw95ps51fgmm9rq2mpw0000gn/T/test262-hgE05V.js:2179)
at org.dynjs.gen.Function13.call(Unknown Source)
at org.dynjs.runtime.ExecutionContext.call(ExecutionContext.java:139)
at org.dynjs.gen.Function17.call(Unknown Source)
at org.dynjs.runtime.ExecutionContext.call(ExecutionContext.java:139)
at org.dynjs.gen.ThenBlock20.call(Unknown Source)
at org.dynjs.gen.Program0.execute(Unknown Source)
at org.dynjs.runtime.ExecutionContext.execute(ExecutionContext.java:122)
at org.dynjs.runtime.DynJS.execute(DynJS.java:90)
at org.dynjs.runtime.DynJS.execute(DynJS.java:80)
at org.dynjs.runtime.DynJS.execute(DynJS.java:76)
at org.dynjs.cli.Main.executeFile(Main.java:73)
at org.dynjs.cli.Main.run(Main.java:60)
at org.dynjs.cli.Main.main(Main.java:46)
===
=== ch15/15.1/15.1.2/15.1.2.3/S15.1.2.3_A4_T3 failed in non-strict mode ===
--- errors ---
Exception in thread "main" org.dynjs.exception.ThrowException: #0: parseFloat("0x0") === 0. Actual: NaN
at <global>.testFailed(/var/folders/vt/nrnb_cw95ps51fgmm9rq2mpw0000gn/T/test262-3gCp8A.js:289)
at <global>.$ERROR(/var/folders/vt/nrnb_cw95ps51fgmm9rq2mpw0000gn/T/test262-3gCp8A.js:305)
at <global>.<eval>(/var/folders/vt/nrnb_cw95ps51fgmm9rq2mpw0000gn/T/test262-3gCp8A.js:2179)
at org.dynjs.gen.Function13.call(Unknown Source)
at org.dynjs.runtime.ExecutionContext.call(ExecutionContext.java:139)
at org.dynjs.gen.Function17.call(Unknown Source)
at org.dynjs.runtime.ExecutionContext.call(ExecutionContext.java:139)
at org.dynjs.gen.ThenBlock20.call(Unknown Source)
at org.dynjs.gen.Program0.execute(Unknown Source)
at org.dynjs.runtime.ExecutionContext.execute(ExecutionContext.java:122)
at org.dynjs.runtime.DynJS.execute(DynJS.java:90)
at org.dynjs.runtime.DynJS.execute(DynJS.java:80)
at org.dynjs.runtime.DynJS.execute(DynJS.java:76)
at org.dynjs.cli.Main.executeFile(Main.java:73)
at org.dynjs.cli.Main.run(Main.java:60)
at org.dynjs.cli.Main.main(Main.java:46)
===
=== ch15/15.1/15.1.2/15.1.2.3/S15.1.2.3_A4_T4 failed in non-strict mode ===
--- errors ---
Exception in thread "main" org.dynjs.exception.ThrowException: #1: parseFloat("Infinity1") === Number.POSITIVE_INFINITY. Actual: NaN
at <global>.testFailed(/var/folders/vt/nrnb_cw95ps51fgmm9rq2mpw0000gn/T/test262-PvbynQ.js:289)
at <global>.$ERROR(/var/folders/vt/nrnb_cw95ps51fgmm9rq2mpw0000gn/T/test262-PvbynQ.js:305)
at <global>.<eval>(/var/folders/vt/nrnb_cw95ps51fgmm9rq2mpw0000gn/T/test262-PvbynQ.js:2179)
at org.dynjs.gen.Function13.call(Unknown Source)
at org.dynjs.runtime.ExecutionContext.call(ExecutionContext.java:139)
at org.dynjs.gen.Function17.call(Unknown Source)
at org.dynjs.runtime.ExecutionContext.call(ExecutionContext.java:139)
at org.dynjs.gen.ThenBlock20.call(Unknown Source)
at org.dynjs.gen.Program0.execute(Unknown Source)
at org.dynjs.runtime.ExecutionContext.execute(ExecutionContext.java:122)
at org.dynjs.runtime.DynJS.execute(DynJS.java:90)
at org.dynjs.runtime.DynJS.execute(DynJS.java:80)
at org.dynjs.runtime.DynJS.execute(DynJS.java:76)
at org.dynjs.cli.Main.executeFile(Main.java:73)
at org.dynjs.cli.Main.run(Main.java:60)
at org.dynjs.cli.Main.main(Main.java:46)
===
=== ch15/15.1/15.1.2/15.1.2.3/S15.1.2.3_A4_T5 failed in non-strict mode ===
--- errors ---
Exception in thread "main" org.dynjs.exception.ThrowException: #1: parseFloat("-11.string") === -11. Actual: NaN
at <global>.testFailed(/var/folders/vt/nrnb_cw95ps51fgmm9rq2mpw0000gn/T/test262-I5KDy3.js:289)
at <global>.$ERROR(/var/folders/vt/nrnb_cw95ps51fgmm9rq2mpw0000gn/T/test262-I5KDy3.js:305)
at <global>.<eval>(/var/folders/vt/nrnb_cw95ps51fgmm9rq2mpw0000gn/T/test262-I5KDy3.js:2179)
at org.dynjs.gen.Function13.call(Unknown Source)
at org.dynjs.runtime.ExecutionContext.call(ExecutionContext.java:139)
at org.dynjs.gen.Function17.call(Unknown Source)
at org.dynjs.runtime.ExecutionContext.call(ExecutionContext.java:139)
at org.dynjs.gen.ThenBlock20.call(Unknown Source)
at org.dynjs.gen.Program0.execute(Unknown Source)
at org.dynjs.runtime.ExecutionContext.execute(ExecutionContext.java:122)
at org.dynjs.runtime.DynJS.execute(DynJS.java:90)
at org.dynjs.runtime.DynJS.execute(DynJS.java:80)
at org.dynjs.runtime.DynJS.execute(DynJS.java:76)
at org.dynjs.cli.Main.executeFile(Main.java:73)
at org.dynjs.cli.Main.run(Main.java:60)
at org.dynjs.cli.Main.main(Main.java:46)
===
=== ch15/15.1/15.1.2/15.1.2.3/S15.1.2.3_A4_T6 failed in non-strict mode ===
--- errors ---
Exception in thread "main" org.dynjs.exception.ThrowException: #1: parseFloat("+.1string") === 0.1. Actual: NaN
at <global>.testFailed(/var/folders/vt/nrnb_cw95ps51fgmm9rq2mpw0000gn/T/test262-xbAr0V.js:289)
at <global>.$ERROR(/var/folders/vt/nrnb_cw95ps51fgmm9rq2mpw0000gn/T/test262-xbAr0V.js:305)
at <global>.<eval>(/var/folders/vt/nrnb_cw95ps51fgmm9rq2mpw0000gn/T/test262-xbAr0V.js:2179)
at org.dynjs.gen.Function13.call(Unknown Source)
at org.dynjs.runtime.ExecutionContext.call(ExecutionContext.java:139)
at org.dynjs.gen.Function17.call(Unknown Source)
at org.dynjs.runtime.ExecutionContext.call(ExecutionContext.java:139)
at org.dynjs.gen.ThenBlock20.call(Unknown Source)
at org.dynjs.gen.Program0.execute(Unknown Source)
at org.dynjs.runtime.ExecutionContext.execute(ExecutionContext.java:122)
at org.dynjs.runtime.DynJS.execute(DynJS.java:90)
at org.dynjs.runtime.DynJS.execute(DynJS.java:80)
at org.dynjs.runtime.DynJS.execute(DynJS.java:76)
at org.dynjs.cli.Main.executeFile(Main.java:73)
at org.dynjs.cli.Main.run(Main.java:60)
at org.dynjs.cli.Main.main(Main.java:46)
===
=== ch15/15.1/15.1.2/15.1.2.3/S15.1.2.3_A4_T7 failed in non-strict mode ===
--- errors ---
Exception in thread "main" org.dynjs.exception.ThrowException: #1: parseFloat("-11string") === -11. Actual: NaN
at <global>.testFailed(/var/folders/vt/nrnb_cw95ps51fgmm9rq2mpw0000gn/T/test262-e5twzv.js:289)
at <global>.$ERROR(/var/folders/vt/nrnb_cw95ps51fgmm9rq2mpw0000gn/T/test262-e5twzv.js:305)
at <global>.<eval>(/var/folders/vt/nrnb_cw95ps51fgmm9rq2mpw0000gn/T/test262-e5twzv.js:2179)
at org.dynjs.gen.Function13.call(Unknown Source)
at org.dynjs.runtime.ExecutionContext.call(ExecutionContext.java:139)
at org.dynjs.gen.Function17.call(Unknown Source)
at org.dynjs.runtime.ExecutionContext.call(ExecutionContext.java:139)
at org.dynjs.gen.ThenBlock20.call(Unknown Source)
at org.dynjs.gen.Program0.execute(Unknown Source)
at org.dynjs.runtime.ExecutionContext.execute(ExecutionContext.java:122)
at org.dynjs.runtime.DynJS.execute(DynJS.java:90)
at org.dynjs.runtime.DynJS.execute(DynJS.java:80)
at org.dynjs.runtime.DynJS.execute(DynJS.java:76)
at org.dynjs.cli.Main.executeFile(Main.java:73)
at org.dynjs.cli.Main.run(Main.java:60)
at org.dynjs.cli.Main.main(Main.java:46)
===
ch15/15.1/15.1.2/15.1.2.3/S15.1.2.3_A5_T1 passed in non-strict mode
ch15/15.1/15.1.2/15.1.2.3/S15.1.2.3_A5_T2 passed in non-strict mode
ch15/15.1/15.1.2/15.1.2.3/S15.1.2.3_A5_T3 passed in non-strict mode
ch15/15.1/15.1.2/15.1.2.3/S15.1.2.3_A5_T4 passed in non-strict mode
=== ch15/15.1/15.1.2/15.1.2.3/S15.1.2.3_A6 failed in non-strict mode ===
--- errors ---
Exception in thread "main" org.dynjs.exception.ThrowException: #0021-002F
at <global>.testFailed(/var/folders/vt/nrnb_cw95ps51fgmm9rq2mpw0000gn/T/test262-tAS8At.js:289)
at <global>.$ERROR(/var/folders/vt/nrnb_cw95ps51fgmm9rq2mpw0000gn/T/test262-tAS8At.js:305)
at <global>.<eval>(/var/folders/vt/nrnb_cw95ps51fgmm9rq2mpw0000gn/T/test262-tAS8At.js:2193)
at org.dynjs.gen.Function13.call(Unknown Source)
at org.dynjs.runtime.ExecutionContext.call(ExecutionContext.java:139)
at org.dynjs.gen.Function17.call(Unknown Source)
at org.dynjs.runtime.ExecutionContext.call(ExecutionContext.java:139)
at org.dynjs.gen.ThenBlock40.call(Unknown Source)
at org.dynjs.gen.ThenBlock39.call(Unknown Source)
at org.dynjs.gen.ElseBlock38.call(Unknown Source)
at org.dynjs.gen.ThenBlock36.call(Unknown Source)
at org.dynjs.gen.ThenBlock21.call(Unknown Source)
at org.dynjs.gen.ForBlock20.call(Unknown Source)
at org.dynjs.gen.Program0.execute(Unknown Source)
at org.dynjs.runtime.ExecutionContext.execute(ExecutionContext.java:122)
at org.dynjs.runtime.DynJS.execute(DynJS.java:90)
at org.dynjs.runtime.DynJS.execute(DynJS.java:80)
at org.dynjs.runtime.DynJS.execute(DynJS.java:76)
at org.dynjs.cli.Main.executeFile(Main.java:73)
at org.dynjs.cli.Main.run(Main.java:60)
at org.dynjs.cli.Main.main(Main.java:46)
===
ch15/15.1/15.1.2/15.1.2.3/S15.1.2.3_A7.1 passed in non-strict mode
ch15/15.1/15.1.2/15.1.2.3/S15.1.2.3_A7.2 passed in non-strict mode
ch15/15.1/15.1.2/15.1.2.3/S15.1.2.3_A7.3 passed in non-strict mode
ch15/15.1/15.1.2/15.1.2.3/S15.1.2.3_A7.4 passed in non-strict mode
ch15/15.1/15.1.2/15.1.2.3/S15.1.2.3_A7.5 passed in non-strict mode
ch15/15.1/15.1.2/15.1.2.3/S15.1.2.3_A7.6 passed in non-strict mode
ch15/15.1/15.1.2/15.1.2.3/S15.1.2.3_A7.7 passed in non-strict mode
=== ch15/15.1/15.1.2/15.1.2.4/S15.1.2.4_A1_T1 failed in non-strict mode ===
--- errors ---
Exception in thread "main" org.dynjs.exception.ThrowException: #4: void 0 === Not-a-Number. Actual: undefined
at <global>.testFailed(/var/folders/vt/nrnb_cw95ps51fgmm9rq2mpw0000gn/T/test262-QzBv_n.js:289)
at <global>.$ERROR(/var/folders/vt/nrnb_cw95ps51fgmm9rq2mpw0000gn/T/test262-QzBv_n.js:305)
at <global>.<eval>(/var/folders/vt/nrnb_cw95ps51fgmm9rq2mpw0000gn/T/test262-QzBv_n.js:2194)
at org.dynjs.gen.Function13.call(Unknown Source)
at org.dynjs.runtime.ExecutionContext.call(ExecutionContext.java:139)
at org.dynjs.gen.Function17.call(Unknown Source)
at org.dynjs.runtime.ExecutionContext.call(ExecutionContext.java:139)
at org.dynjs.gen.ThenBlock20.call(Unknown Source)
at org.dynjs.gen.Program0.execute(Unknown Source)
at org.dynjs.runtime.ExecutionContext.execute(ExecutionContext.java:122)
at org.dynjs.runtime.DynJS.execute(DynJS.java:90)
at org.dynjs.runtime.DynJS.execute(DynJS.java:80)
at org.dynjs.runtime.DynJS.execute(DynJS.java:76)
at org.dynjs.cli.Main.executeFile(Main.java:73)
at org.dynjs.cli.Main.run(Main.java:60)
at org.dynjs.cli.Main.main(Main.java:46)
===
ch15/15.1/15.1.2/15.1.2.4/S15.1.2.4_A1_T2 passed in non-strict mode
ch15/15.1/15.1.2/15.1.2.4/S15.1.2.4_A2.1 passed in non-strict mode
ch15/15.1/15.1.2/15.1.2.4/S15.1.2.4_A2.2 passed in non-strict mode
ch15/15.1/15.1.2/15.1.2.4/S15.1.2.4_A2.3 passed in non-strict mode
ch15/15.1/15.1.2/15.1.2.4/S15.1.2.4_A2.4 passed in non-strict mode
ch15/15.1/15.1.2/15.1.2.4/S15.1.2.4_A2.5 passed in non-strict mode
ch15/15.1/15.1.2/15.1.2.4/S15.1.2.4_A2.6 passed in non-strict mode
=== ch15/15.1/15.1.2/15.1.2.4/S15.1.2.4_A2.7 failed in non-strict mode ===
--- errors ---
Exception in thread "main" org.dynjs.exception.ThrowException: #1.2: new isNaN() throw TypeError. Actual: Test262 Error: #1.1: new isNaN() throw TypeError. Actual: [object Object]
at <global>.testFailed(/var/folders/vt/nrnb_cw95ps51fgmm9rq2mpw0000gn/T/test262-QNK4Rb.js:289)
at <global>.$ERROR(/var/folders/vt/nrnb_cw95ps51fgmm9rq2mpw0000gn/T/test262-QNK4Rb.js:305)
at <global>.<eval>(/var/folders/vt/nrnb_cw95ps51fgmm9rq2mpw0000gn/T/test262-QNK4Rb.js:2184)
at org.dynjs.gen.Function13.call(Unknown Source)
at org.dynjs.runtime.ExecutionContext.call(ExecutionContext.java:139)
at org.dynjs.gen.Function17.call(Unknown Source)
at org.dynjs.runtime.ExecutionContext.call(ExecutionContext.java:139)
at org.dynjs.gen.ThenBlock23.call(Unknown Source)
at org.dynjs.gen.CatchBlock22.call(Unknown Source)
at org.dynjs.runtime.ExecutionContext.executeCatch(ExecutionContext.java:235)
at org.dynjs.gen.Program0.execute(Unknown Source)
at org.dynjs.runtime.ExecutionContext.execute(ExecutionContext.java:122)
at org.dynjs.runtime.DynJS.execute(DynJS.java:90)
at org.dynjs.runtime.DynJS.execute(DynJS.java:80)
at org.dynjs.runtime.DynJS.execute(DynJS.java:76)
at org.dynjs.cli.Main.executeFile(Main.java:73)
at org.dynjs.cli.Main.run(Main.java:60)
at org.dynjs.cli.Main.main(Main.java:46)
===
=== ch15/15.1/15.1.2/15.1.2.5/S15.1.2.5_A1_T1 failed in non-strict mode ===
--- errors ---
Exception in thread "main" org.dynjs.exception.ThrowException: #4: void 0 === Not-a-Finite. Actual: undefined
at <global>.testFailed(/var/folders/vt/nrnb_cw95ps51fgmm9rq2mpw0000gn/T/test262-YtwwA5.js:289)
at <global>.$ERROR(/var/folders/vt/nrnb_cw95ps51fgmm9rq2mpw0000gn/T/test262-YtwwA5.js:305)
at <global>.<eval>(/var/folders/vt/nrnb_cw95ps51fgmm9rq2mpw0000gn/T/test262-YtwwA5.js:2194)
at org.dynjs.gen.Function13.call(Unknown Source)
at org.dynjs.runtime.ExecutionContext.call(ExecutionContext.java:139)
at org.dynjs.gen.Function17.call(Unknown Source)
at org.dynjs.runtime.ExecutionContext.call(ExecutionContext.java:139)
at org.dynjs.gen.ThenBlock20.call(Unknown Source)
at org.dynjs.gen.Program0.execute(Unknown Source)
at org.dynjs.runtime.ExecutionContext.execute(ExecutionContext.java:122)
at org.dynjs.runtime.DynJS.execute(DynJS.java:90)
at org.dynjs.runtime.DynJS.execute(DynJS.java:80)
at org.dynjs.runtime.DynJS.execute(DynJS.java:76)
at org.dynjs.cli.Main.executeFile(Main.java:73)
at org.dynjs.cli.Main.run(Main.java:60)
at org.dynjs.cli.Main.main(Main.java:46)
===
ch15/15.1/15.1.2/15.1.2.5/S15.1.2.5_A1_T2 passed in non-strict mode
ch15/15.1/15.1.2/15.1.2.5/S15.1.2.5_A2.1 passed in non-strict mode
ch15/15.1/15.1.2/15.1.2.5/S15.1.2.5_A2.2 passed in non-strict mode
ch15/15.1/15.1.2/15.1.2.5/S15.1.2.5_A2.3 passed in non-strict mode
ch15/15.1/15.1.2/15.1.2.5/S15.1.2.5_A2.4 passed in non-strict mode
ch15/15.1/15.1.2/15.1.2.5/S15.1.2.5_A2.5 passed in non-strict mode
ch15/15.1/15.1.2/15.1.2.5/S15.1.2.5_A2.6 passed in non-strict mode
=== ch15/15.1/15.1.2/15.1.2.5/S15.1.2.5_A2.7 failed in non-strict mode ===
--- errors ---
Exception in thread "main" org.dynjs.exception.ThrowException: #1.2: new isFinite() throw TypeError. Actual: Test262 Error: #1.1: new isFinite() throw TypeError. Actual: [object Object]
at <global>.testFailed(/var/folders/vt/nrnb_cw95ps51fgmm9rq2mpw0000gn/T/test262-lNE6V7.js:289)
at <global>.$ERROR(/var/folders/vt/nrnb_cw95ps51fgmm9rq2mpw0000gn/T/test262-lNE6V7.js:305)
at <global>.<eval>(/var/folders/vt/nrnb_cw95ps51fgmm9rq2mpw0000gn/T/test262-lNE6V7.js:2184)
at org.dynjs.gen.Function13.call(Unknown Source)
at org.dynjs.runtime.ExecutionContext.call(ExecutionContext.java:139)
at org.dynjs.gen.Function17.call(Unknown Source)
at org.dynjs.runtime.ExecutionContext.call(ExecutionContext.java:139)
at org.dynjs.gen.ThenBlock23.call(Unknown Source)
at org.dynjs.gen.CatchBlock22.call(Unknown Source)
at org.dynjs.runtime.ExecutionContext.executeCatch(ExecutionContext.java:235)
at org.dynjs.gen.Program0.execute(Unknown Source)
at org.dynjs.runtime.ExecutionContext.execute(ExecutionContext.java:122)
at org.dynjs.runtime.DynJS.execute(DynJS.java:90)
at org.dynjs.runtime.DynJS.execute(DynJS.java:80)
at org.dynjs.runtime.DynJS.execute(DynJS.java:76)
at org.dynjs.cli.Main.executeFile(Main.java:73)
at org.dynjs.cli.Main.run(Main.java:60)
at org.dynjs.cli.Main.main(Main.java:46)
===
=== ch15/15.1/15.1.3/15.1.3.1/S15.1.3.1_A1.10_T1 failed in non-strict mode ===
--- errors ---
Exception in thread "main" org.dynjs.exception.ThrowException: #1: If B = 110xxxxx (n = 2) and (string.charAt(k + 4) and string.charAt(k + 5)) do not represent hexadecimal digits, throw URIError
at <global>.testFailed(/var/folders/vt/nrnb_cw95ps51fgmm9rq2mpw0000gn/T/test262-a97dZ1.js:289)
at <global>.$ERROR(/var/folders/vt/nrnb_cw95ps51fgmm9rq2mpw0000gn/T/test262-a97dZ1.js:305)
at <global>.<eval>(/var/folders/vt/nrnb_cw95ps51fgmm9rq2mpw0000gn/T/test262-a97dZ1.js:2194)
at org.dynjs.gen.Function13.call(Unknown Source)
at org.dynjs.runtime.ExecutionContext.call(ExecutionContext.java:139)
at org.dynjs.gen.Function17.call(Unknown Source)
at org.dynjs.runtime.ExecutionContext.call(ExecutionContext.java:139)
at org.dynjs.gen.ThenBlock47.call(Unknown Source)
at org.dynjs.gen.Program0.execute(Unknown Source)
at org.dynjs.runtime.ExecutionContext.execute(ExecutionContext.java:122)
at org.dynjs.runtime.DynJS.execute(DynJS.java:90)
at org.dynjs.runtime.DynJS.execute(DynJS.java:80)
at org.dynjs.runtime.DynJS.execute(DynJS.java:76)
at org.dynjs.cli.Main.executeFile(Main.java:73)
at org.dynjs.cli.Main.run(Main.java:60)
at org.dynjs.cli.Main.main(Main.java:46)
===
=== ch15/15.1/15.1.3/15.1.3.1/S15.1.3.1_A1.11_T1 failed in non-strict mode ===
--- errors ---
Exception in thread "main" org.dynjs.exception.ThrowException: #1: If B = 1110xxxx (n = 3) and (string.charAt(k + 4) and string.charAt(k + 5)) do not represent hexadecimal digits, throw URIError
at <global>.testFailed(/var/folders/vt/nrnb_cw95ps51fgmm9rq2mpw0000gn/T/test262-q91jjR.js:289)
at <global>.$ERROR(/var/folders/vt/nrnb_cw95ps51fgmm9rq2mpw0000gn/T/test262-q91jjR.js:305)
at <global>.<eval>(/var/folders/vt/nrnb_cw95ps51fgmm9rq2mpw0000gn/T/test262-q91jjR.js:2194)
at org.dynjs.gen.Function13.call(Unknown Source)
at org.dynjs.runtime.ExecutionContext.call(ExecutionContext.java:139)
at org.dynjs.gen.Function17.call(Unknown Source)
at org.dynjs.runtime.ExecutionContext.call(ExecutionContext.java:139)
at org.dynjs.gen.ThenBlock48.call(Unknown Source)
at org.dynjs.gen.Program0.execute(Unknown Source)
at org.dynjs.runtime.ExecutionContext.execute(ExecutionContext.java:122)
at org.dynjs.runtime.DynJS.execute(DynJS.java:90)
at org.dynjs.runtime.DynJS.execute(DynJS.java:80)
at org.dynjs.runtime.DynJS.execute(DynJS.java:76)
at org.dynjs.cli.Main.executeFile(Main.java:73)
at org.dynjs.cli.Main.run(Main.java:60)
at org.dynjs.cli.Main.main(Main.java:46)
===
=== ch15/15.1/15.1.3/15.1.3.1/S15.1.3.1_A1.11_T2 failed in non-strict mode ===
--- errors ---
Exception in thread "main" org.dynjs.exception.ThrowException: #1: If B = 1110xxxx (n = 3) and (string.charAt(k + 7) and string.charAt(k + 8)) do not represent hexadecimal digits, throw URIError
at <global>.testFailed(/var/folders/vt/nrnb_cw95ps51fgmm9rq2mpw0000gn/T/test262-yQfTVV.js:289)
at <global>.$ERROR(/var/folders/vt/nrnb_cw95ps51fgmm9rq2mpw0000gn/T/test262-yQfTVV.js:305)
at <global>.<eval>(/var/folders/vt/nrnb_cw95ps51fgmm9rq2mpw0000gn/T/test262-yQfTVV.js:2194)
at org.dynjs.gen.Function13.call(Unknown Source)
at org.dynjs.runtime.ExecutionContext.call(ExecutionContext.java:139)
at org.dynjs.gen.Function17.call(Unknown Source)
at org.dynjs.runtime.ExecutionContext.call(ExecutionContext.java:139)
at org.dynjs.gen.ThenBlock55.call(Unknown Source)
at org.dynjs.gen.Program0.execute(Unknown Source)
at org.dynjs.runtime.ExecutionContext.execute(ExecutionContext.java:122)
at org.dynjs.runtime.DynJS.execute(DynJS.java:90)
at org.dynjs.runtime.DynJS.execute(DynJS.java:80)
at org.dynjs.runtime.DynJS.execute(DynJS.java:76)
at org.dynjs.cli.Main.executeFile(Main.java:73)
at org.dynjs.cli.Main.run(Main.java:60)
at org.dynjs.cli.Main.main(Main.java:46)
===
=== ch15/15.1/15.1.3/15.1.3.1/S15.1.3.1_A1.12_T1 failed in non-strict mode ===
--- errors ---
Exception in thread "main" org.dynjs.exception.ThrowException: #1: If B = 11110xxx (n = 4) and (string.charAt(k + 4) and string.charAt(k + 5)) do not represent hexadecimal digits, throw URIError
at <global>.testFailed(/var/folders/vt/nrnb_cw95ps51fgmm9rq2mpw0000gn/T/test262-TTS1JN.js:289)
at <global>.$ERROR(/var/folders/vt/nrnb_cw95ps51fgmm9rq2mpw0000gn/T/test262-TTS1JN.js:305)
at <global>.<eval>(/var/folders/vt/nrnb_cw95ps51fgmm9rq2mpw0000gn/T/test262-TTS1JN.js:2194)
at org.dynjs.gen.Function13.call(Unknown Source)
at org.dynjs.runtime.ExecutionContext.call(ExecutionContext.java:139)
at org.dynjs.gen.Function17.call(Unknown Source)
at org.dynjs.runtime.ExecutionContext.call(ExecutionContext.java:139)
at org.dynjs.gen.ThenBlock49.call(Unknown Source)
at org.dynjs.gen.Program0.execute(Unknown Source)
at org.dynjs.runtime.ExecutionContext.execute(ExecutionContext.java:122)
at org.dynjs.runtime.DynJS.execute(DynJS.java:90)
at org.dynjs.runtime.DynJS.execute(DynJS.java:80)
at org.dynjs.runtime.DynJS.execute(DynJS.java:76)
at org.dynjs.cli.Main.executeFile(Main.java:73)
at org.dynjs.cli.Main.run(Main.java:60)
at org.dynjs.cli.Main.main(Main.java:46)
===
=== ch15/15.1/15.1.3/15.1.3.1/S15.1.3.1_A1.12_T2 failed in non-strict mode ===
--- errors ---
Exception in thread "main" org.dynjs.exception.ThrowException: #1: If B = 11110xxx (n = 4) and (string.charAt(k + 7) and string.charAt(k + 8)) do not represent hexadecimal digits, throw URIError
at <global>.testFailed(/var/folders/vt/nrnb_cw95ps51fgmm9rq2mpw0000gn/T/test262-3ulRkP.js:289)
at <global>.$ERROR(/var/folders/vt/nrnb_cw95ps51fgmm9rq2mpw0000gn/T/test262-3ulRkP.js:305)
at <global>.<eval>(/var/folders/vt/nrnb_cw95ps51fgmm9rq2mpw0000gn/T/test262-3ulRkP.js:2194)
at org.dynjs.gen.Function13.call(Unknown Source)
at org.dynjs.runtime.ExecutionContext.call(ExecutionContext.java:139)
at org.dynjs.gen.Function17.call(Unknown Source)
at org.dynjs.runtime.ExecutionContext.call(ExecutionContext.java:139)
at org.dynjs.gen.ThenBlock56.call(Unknown Source)
at org.dynjs.gen.Program0.execute(Unknown Source)
at org.dynjs.runtime.ExecutionContext.execute(ExecutionContext.java:122)
at org.dynjs.runtime.DynJS.execute(DynJS.java:90)
at org.dynjs.runtime.DynJS.execute(DynJS.java:80)
at org.dynjs.runtime.DynJS.execute(DynJS.java:76)
at org.dynjs.cli.Main.executeFile(Main.java:73)
at org.dynjs.cli.Main.run(Main.java:60)
at org.dynjs.cli.Main.main(Main.java:46)
===
=== ch15/15.1/15.1.3/15.1.3.1/S15.1.3.1_A1.12_T3 failed in non-strict mode ===
--- errors ---
Exception in thread "main" org.dynjs.exception.ThrowException: #1: If B = 11110xxx (n = 4) and (string.charAt(k + 10) and string.charAt(k + 11)) do not represent hexadecimal digits, throw URIError
at <global>.testFailed(/var/folders/vt/nrnb_cw95ps51fgmm9rq2mpw0000gn/T/test262-svgrXK.js:289)
at <global>.$ERROR(/var/folders/vt/nrnb_cw95ps51fgmm9rq2mpw0000gn/T/test262-svgrXK.js:305)
at <global>.<eval>(/var/folders/vt/nrnb_cw95ps51fgmm9rq2mpw0000gn/T/test262-svgrXK.js:2194)
at org.dynjs.gen.Function13.call(Unknown Source)
at org.dynjs.runtime.ExecutionContext.call(ExecutionContext.java:139)
at org.dynjs.gen.Function17.call(Unknown Source)
at org.dynjs.runtime.ExecutionContext.call(ExecutionContext.java:139)
at org.dynjs.gen.ThenBlock52.call(Unknown Source)
at org.dynjs.gen.Program0.execute(Unknown Source)
at org.dynjs.runtime.ExecutionContext.execute(ExecutionContext.java:122)
at org.dynjs.runtime.DynJS.execute(DynJS.java:90)
at org.dynjs.runtime.DynJS.execute(DynJS.java:80)
at org.dynjs.runtime.DynJS.execute(DynJS.java:76)
at org.dynjs.cli.Main.executeFile(Main.java:73)
at org.dynjs.cli.Main.run(Main.java:60)
at org.dynjs.cli.Main.main(Main.java:46)
===
=== ch15/15.1/15.1.3/15.1.3.1/S15.1.3.1_A1.13_T1 failed in non-strict mode ===
--- errors ---
Exception in thread "main" org.dynjs.exception.ThrowException: #00C0-00DF
at <global>.testFailed(/var/folders/vt/nrnb_cw95ps51fgmm9rq2mpw0000gn/T/test262-K9_jzX.js:289)
at <global>.$ERROR(/var/folders/vt/nrnb_cw95ps51fgmm9rq2mpw0000gn/T/test262-K9_jzX.js:305)
at <global>.<eval>(/var/folders/vt/nrnb_cw95ps51fgmm9rq2mpw0000gn/T/test262-K9_jzX.js:2221)
at org.dynjs.gen.Function13.call(Unknown Source)
at org.dynjs.runtime.ExecutionContext.call(ExecutionContext.java:139)
at org.dynjs.gen.Function17.call(Unknown Source)
at org.dynjs.runtime.ExecutionContext.call(ExecutionContext.java:139)
at org.dynjs.gen.ThenBlock93.call(Unknown Source)
at org.dynjs.gen.ThenBlock92.call(Unknown Source)
at org.dynjs.gen.Program0.execute(Unknown Source)
at org.dynjs.runtime.ExecutionContext.execute(ExecutionContext.java:122)
at org.dynjs.runtime.DynJS.execute(DynJS.java:90)
at org.dynjs.runtime.DynJS.execute(DynJS.java:80)
at org.dynjs.runtime.DynJS.execute(DynJS.java:76)
at org.dynjs.cli.Main.executeFile(Main.java:73)
at org.dynjs.cli.Main.run(Main.java:60)
at org.dynjs.cli.Main.main(Main.java:46)
===
=== ch15/15.1/15.1.3/15.1.3.1/S15.1.3.1_A1.13_T2 failed in non-strict mode ===
--- errors ---
Exception in thread "main" org.dynjs.exception.ThrowException: #00C0-00DF
at <global>.testFailed(/var/folders/vt/nrnb_cw95ps51fgmm9rq2mpw0000gn/T/test262-IxYsiJ.js:289)
at <global>.$ERROR(/var/folders/vt/nrnb_cw95ps51fgmm9rq2mpw0000gn/T/test262-IxYsiJ.js:305)
at <global>.<eval>(/var/folders/vt/nrnb_cw95ps51fgmm9rq2mpw0000gn/T/test262-IxYsiJ.js:2221)
at org.dynjs.gen.Function13.call(Unknown Source)
at org.dynjs.runtime.ExecutionContext.call(ExecutionContext.java:139)
at org.dynjs.gen.Function17.call(Unknown Source)
at org.dynjs.runtime.ExecutionContext.call(ExecutionContext.java:139)
at org.dynjs.gen.ThenBlock81.call(Unknown Source)
at org.dynjs.gen.ThenBlock80.call(Unknown Source)
at org.dynjs.gen.Program0.execute(Unknown Source)
at org.dynjs.runtime.ExecutionContext.execute(ExecutionContext.java:122)
at org.dynjs.runtime.DynJS.execute(DynJS.java:90)
at org.dynjs.runtime.DynJS.execute(DynJS.java:80)
at org.dynjs.runtime.DynJS.execute(DynJS.java:76)
at org.dynjs.cli.Main.executeFile(Main.java:73)
at org.dynjs.cli.Main.run(Main.java:60)
at org.dynjs.cli.Main.main(Main.java:46)
===
=== ch15/15.1/15.1.3/15.1.3.1/S15.1.3.1_A1.14_T1 failed in non-strict mode ===
--- errors ---
Exception in thread "main" org.dynjs.exception.ThrowException: java.lang.NumberFormatException: For input string: "0x.0E0"
at <global>.<eval>(/var/folders/vt/nrnb_cw95ps51fgmm9rq2mpw0000gn/T/test262-9oseS_.js:2182)
at org.dynjs.runtime.ExecutionContext.execute(ExecutionContext.java:126)
at org.dynjs.runtime.DynJS.execute(DynJS.java:90)
at org.dynjs.runtime.DynJS.execute(DynJS.java:80)
at org.dynjs.runtime.DynJS.execute(DynJS.java:76)
at org.dynjs.cli.Main.executeFile(Main.java:73)
at org.dynjs.cli.Main.run(Main.java:60)
at org.dynjs.cli.Main.main(Main.java:46)
Caused by: java.lang.NumberFormatException: For input string: "0x.0E0"
at sun.misc.FloatingDecimal.parseHexString(FloatingDecimal.java:1891)
at sun.misc.FloatingDecimal.readJavaFormatString(FloatingDecimal.java:1063)
at java.lang.Double.valueOf(Double.java:504)
at org.dynjs.gen.Program0.execute(Unknown Source)
at org.dynjs.runtime.ExecutionContext.execute(ExecutionContext.java:122)
... 6 more
===
=== ch15/15.1/15.1.3/15.1.3.1/S15.1.3.1_A1.14_T2 failed in non-strict mode ===
--- errors ---
Exception in thread "main" org.dynjs.exception.ThrowException: java.lang.NumberFormatException: For input string: "0x.0E0"
at <global>.<eval>(/var/folders/vt/nrnb_cw95ps51fgmm9rq2mpw0000gn/T/test262-i5E8oM.js:2182)
at org.dynjs.runtime.ExecutionContext.execute(ExecutionContext.java:126)
at org.dynjs.runtime.DynJS.execute(DynJS.java:90)
at org.dynjs.runtime.DynJS.execute(DynJS.java:80)
at org.dynjs.runtime.DynJS.execute(DynJS.java:76)
at org.dynjs.cli.Main.executeFile(Main.java:73)
at org.dynjs.cli.Main.run(Main.java:60)
at org.dynjs.cli.Main.main(Main.java:46)
Caused by: java.lang.NumberFormatException: For input string: "0x.0E0"
at sun.misc.FloatingDecimal.parseHexString(FloatingDecimal.java:1891)
at sun.misc.FloatingDecimal.readJavaFormatString(FloatingDecimal.java:1063)
at java.lang.Double.valueOf(Double.java:504)
at org.dynjs.gen.Program0.execute(Unknown Source)
at org.dynjs.runtime.ExecutionContext.execute(ExecutionContext.java:122)
... 6 more
===
=== ch15/15.1/15.1.3/15.1.3.1/S15.1.3.1_A1.14_T3 failed in non-strict mode ===
--- errors ---
Exception in thread "main" org.dynjs.exception.ThrowException: java.lang.NumberFormatException: For input string: "0x.0E0"
at <global>.<eval>(/var/folders/vt/nrnb_cw95ps51fgmm9rq2mpw0000gn/T/test262-mxYVMA.js:2182)
at org.dynjs.runtime.ExecutionContext.execute(ExecutionContext.java:126)
at org.dynjs.runtime.DynJS.execute(DynJS.java:90)
at org.dynjs.runtime.DynJS.execute(DynJS.java:80)
at org.dynjs.runtime.DynJS.execute(DynJS.java:76)
at org.dynjs.cli.Main.executeFile(Main.java:73)
at org.dynjs.cli.Main.run(Main.java:60)
at org.dynjs.cli.Main.main(Main.java:46)
Caused by: java.lang.NumberFormatException: For input string: "0x.0E0"
at sun.misc.FloatingDecimal.parseHexString(FloatingDecimal.java:1891)
at sun.misc.FloatingDecimal.readJavaFormatString(FloatingDecimal.java:1063)
at java.lang.Double.valueOf(Double.java:504)
at org.dynjs.gen.Program0.execute(Unknown Source)
at org.dynjs.runtime.ExecutionContext.execute(ExecutionContext.java:122)
... 6 more
===
=== ch15/15.1/15.1.3/15.1.3.1/S15.1.3.1_A1.14_T4 failed in non-strict mode ===
--- errors ---
Exception in thread "main" org.dynjs.exception.ThrowException: java.lang.NumberFormatException: For input string: "0x.0E0"
at <global>.<eval>(/var/folders/vt/nrnb_cw95ps51fgmm9rq2mpw0000gn/T/test262-GG7Pwi.js:2182)
at org.dynjs.runtime.ExecutionContext.execute(ExecutionContext.java:126)
at org.dynjs.runtime.DynJS.execute(DynJS.java:90)
at org.dynjs.runtime.DynJS.execute(DynJS.java:80)
at org.dynjs.runtime.DynJS.execute(DynJS.java:76)
at org.dynjs.cli.Main.executeFile(Main.java:73)
at org.dynjs.cli.Main.run(Main.java:60)
at org.dynjs.cli.Main.main(Main.java:46)
Caused by: java.lang.NumberFormatException: For input string: "0x.0E0"
at sun.misc.FloatingDecimal.parseHexString(FloatingDecimal.java:1891)
at sun.misc.FloatingDecimal.readJavaFormatString(FloatingDecimal.java:1063)
at java.lang.Double.valueOf(Double.java:504)
at org.dynjs.gen.Program0.execute(Unknown Source)
at org.dynjs.runtime.ExecutionContext.execute(ExecutionContext.java:122)
... 6 more
===
=== ch15/15.1/15.1.3/15.1.3.1/S15.1.3.1_A1.15_T1 failed in non-strict mode ===
--- errors ---
Exception in thread "main" org.dynjs.exception.ThrowException: #00F0-00F7
at <global>.testFailed(/var/folders/vt/nrnb_cw95ps51fgmm9rq2mpw0000gn/T/test262-y8Iekh.js:289)
at <global>.$ERROR(/var/folders/vt/nrnb_cw95ps51fgmm9rq2mpw0000gn/T/test262-y8Iekh.js:305)
at <global>.<eval>(/var/folders/vt/nrnb_cw95ps51fgmm9rq2mpw0000gn/T/test262-y8Iekh.js:2221)
at org.dynjs.gen.Function13.call(Unknown Source)
at org.dynjs.runtime.ExecutionContext.call(ExecutionContext.java:139)
at org.dynjs.gen.Function17.call(Unknown Source)
at org.dynjs.runtime.ExecutionContext.call(ExecutionContext.java:139)
at org.dynjs.gen.ThenBlock69.call(Unknown Source)
at org.dynjs.gen.ThenBlock68.call(Unknown Source)
at org.dynjs.gen.Program0.execute(Unknown Source)
at org.dynjs.runtime.ExecutionContext.execute(ExecutionContext.java:122)
at org.dynjs.runtime.DynJS.execute(DynJS.java:90)
at org.dynjs.runtime.DynJS.execute(DynJS.java:80)
at org.dynjs.runtime.DynJS.execute(DynJS.java:76)
at org.dynjs.cli.Main.executeFile(Main.java:73)
at org.dynjs.cli.Main.run(Main.java:60)
at org.dynjs.cli.Main.main(Main.java:46)
===
=== ch15/15.1/15.1.3/15.1.3.1/S15.1.3.1_A1.15_T2 failed in non-strict mode ===
--- errors ---
Exception in thread "main" org.dynjs.exception.ThrowException: #00F0-00F7
at <global>.testFailed(/var/folders/vt/nrnb_cw95ps51fgmm9rq2mpw0000gn/T/test262-OeUKAn.js:289)
at <global>.$ERROR(/var/folders/vt/nrnb_cw95ps51fgmm9rq2mpw0000gn/T/test262-OeUKAn.js:305)
at <global>.<eval>(/var/folders/vt/nrnb_cw95ps51fgmm9rq2mpw0000gn/T/test262-OeUKAn.js:2221)
at org.dynjs.gen.Function13.call(Unknown Source)
at org.dynjs.runtime.ExecutionContext.call(ExecutionContext.java:139)
at org.dynjs.gen.Function17.call(Unknown Source)
at org.dynjs.runtime.ExecutionContext.call(ExecutionContext.java:139)
at org.dynjs.gen.ThenBlock69.call(Unknown Source)
at org.dynjs.gen.ThenBlock68.call(Unknown Source)
at org.dynjs.gen.Program0.execute(Unknown Source)
at org.dynjs.runtime.ExecutionContext.execute(ExecutionContext.java:122)
at org.dynjs.runtime.DynJS.execute(DynJS.java:90)
at org.dynjs.runtime.DynJS.execute(DynJS.java:80)
at org.dynjs.runtime.DynJS.execute(DynJS.java:76)
at org.dynjs.cli.Main.executeFile(Main.java:73)
at org.dynjs.cli.Main.run(Main.java:60)
at org.dynjs.cli.Main.main(Main.java:46)
===
=== ch15/15.1/15.1.3/15.1.3.1/S15.1.3.1_A1.15_T3 failed in non-strict mode ===
--- errors ---
Exception in thread "main" org.dynjs.exception.ThrowException: #00F0-00F7
at <global>.testFailed(/var/folders/vt/nrnb_cw95ps51fgmm9rq2mpw0000gn/T/test262-lyo2ep.js:289)
at <global>.$ERROR(/var/folders/vt/nrnb_cw95ps51fgmm9rq2mpw0000gn/T/test262-lyo2ep.js:305)
at <global>.<eval>(/var/folders/vt/nrnb_cw95ps51fgmm9rq2mpw0000gn/T/test262-lyo2ep.js:2221)
at org.dynjs.gen.Function13.call(Unknown Source)
at org.dynjs.runtime.ExecutionContext.call(ExecutionContext.java:139)
at org.dynjs.gen.Function17.call(Unknown Source)
at org.dynjs.runtime.ExecutionContext.call(ExecutionContext.java:139)
at org.dynjs.gen.ThenBlock636.call(Unknown Source)
at org.dynjs.gen.ThenBlock635.call(Unknown Source)
at org.dynjs.gen.Program0.execute(Unknown Source)
at org.dynjs.runtime.ExecutionContext.execute(ExecutionContext.java:122)
at org.dynjs.runtime.DynJS.execute(DynJS.java:90)
at org.dynjs.runtime.DynJS.execute(DynJS.java:80)
at org.dynjs.runtime.DynJS.execute(DynJS.java:76)
at org.dynjs.cli.Main.executeFile(Main.java:73)
at org.dynjs.cli.Main.run(Main.java:60)
at org.dynjs.cli.Main.main(Main.java:46)
===
=== ch15/15.1/15.1.3/15.1.3.1/S15.1.3.1_A1.15_T4 failed in non-strict mode ===
--- errors ---
Exception in thread "main" org.dynjs.exception.ThrowException: #00F0-00F7
at <global>.testFailed(/var/folders/vt/nrnb_cw95ps51fgmm9rq2mpw0000gn/T/test262-YOdKmw.js:289)
at <global>.$ERROR(/var/folders/vt/nrnb_cw95ps51fgmm9rq2mpw0000gn/T/test262-YOdKmw.js:305)
at <global>.<eval>(/var/folders/vt/nrnb_cw95ps51fgmm9rq2mpw0000gn/T/test262-YOdKmw.js:2221)
at org.dynjs.gen.Function13.call(Unknown Source)
at org.dynjs.runtime.ExecutionContext.call(ExecutionContext.java:139)
at org.dynjs.gen.Function17.call(Unknown Source)
at org.dynjs.runtime.ExecutionContext.call(ExecutionContext.java:139)
at org.dynjs.gen.ThenBlock56.call(Unknown Source)
at org.dynjs.gen.ThenBlock55.call(Unknown Source)
at org.dynjs.gen.Program0.execute(Unknown Source)
at org.dynjs.runtime.ExecutionContext.execute(ExecutionContext.java:122)
at org.dynjs.runtime.DynJS.execute(DynJS.java:90)
at org.dynjs.runtime.DynJS.execute(DynJS.java:80)
at org.dynjs.runtime.DynJS.execute(DynJS.java:76)
at org.dynjs.cli.Main.executeFile(Main.java:73)
at org.dynjs.cli.Main.run(Main.java:60)
at org.dynjs.cli.Main.main(Main.java:46)
===
=== ch15/15.1/15.1.3/15.1.3.1/S15.1.3.1_A1.15_T5 failed in non-strict mode ===
--- errors ---
Exception in thread "main" org.dynjs.exception.ThrowException: #00F0-00F7
at <global>.testFailed(/var/folders/vt/nrnb_cw95ps51fgmm9rq2mpw0000gn/T/test262-0l7a0N.js:289)
at <global>.$ERROR(/var/folders/vt/nrnb_cw95ps51fgmm9rq2mpw0000gn/T/test262-0l7a0N.js:305)
at <global>.<eval>(/var/folders/vt/nrnb_cw95ps51fgmm9rq2mpw0000gn/T/test262-0l7a0N.js:2221)
at org.dynjs.gen.Function13.call(Unknown Source)
at org.dynjs.runtime.ExecutionContext.call(ExecutionContext.java:139)
at org.dynjs.gen.Function17.call(Unknown Source)
at org.dynjs.runtime.ExecutionContext.call(ExecutionContext.java:139)
at org.dynjs.gen.ThenBlock347.call(Unknown Source)
at org.dynjs.gen.ThenBlock346.call(Unknown Source)
at org.dynjs.gen.Program0.execute(Unknown Source)
at org.dynjs.runtime.ExecutionContext.execute(ExecutionContext.java:122)
at org.dynjs.runtime.DynJS.execute(DynJS.java:90)
at org.dynjs.runtime.DynJS.execute(DynJS.java:80)
at org.dynjs.runtime.DynJS.execute(DynJS.java:76)
at org.dynjs.cli.Main.executeFile(Main.java:73)
at org.dynjs.cli.Main.run(Main.java:60)
at org.dynjs.cli.Main.main(Main.java:46)
===
=== ch15/15.1/15.1.3/15.1.3.1/S15.1.3.1_A1.15_T6 failed in non-strict mode ===
--- errors ---
Exception in thread "main" org.dynjs.exception.ThrowException: #00F0-00F7
at <global>.testFailed(/var/folders/vt/nrnb_cw95ps51fgmm9rq2mpw0000gn/T/test262-HFaajF.js:289)
at <global>.$ERROR(/var/folders/vt/nrnb_cw95ps51fgmm9rq2mpw0000gn/T/test262-HFaajF.js:305)
at <global>.<eval>(/var/folders/vt/nrnb_cw95ps51fgmm9rq2mpw0000gn/T/test262-HFaajF.js:2221)
at org.dynjs.gen.Function13.call(Unknown Source)
at org.dynjs.runtime.ExecutionContext.call(ExecutionContext.java:139)
at org.dynjs.gen.Function17.call(Unknown Source)
at org.dynjs.runtime.ExecutionContext.call(ExecutionContext.java:139)
at org.dynjs.gen.ThenBlock56.call(Unknown Source)
at org.dynjs.gen.ThenBlock55.call(Unknown Source)
at org.dynjs.gen.Program0.execute(Unknown Source)
at org.dynjs.runtime.ExecutionContext.execute(ExecutionContext.java:122)
at org.dynjs.runtime.DynJS.execute(DynJS.java:90)
at org.dynjs.runtime.DynJS.execute(DynJS.java:80)
at org.dynjs.runtime.DynJS.execute(DynJS.java:76)
at org.dynjs.cli.Main.executeFile(Main.java:73)
at org.dynjs.cli.Main.run(Main.java:60)
at org.dynjs.cli.Main.main(Main.java:46)
===
=== ch15/15.1/15.1.3/15.1.3.1/S15.1.3.1_A1.1_T1 failed in non-strict mode ===
--- errors ---
Exception in thread "main" org.dynjs.exception.ThrowException: #1: If string.charAt(k) equal "%" and k + 2 >= string.length, throw URIError
at <global>.testFailed(/var/folders/vt/nrnb_cw95ps51fgmm9rq2mpw0000gn/T/test262-EaMKVt.js:289)
at <global>.$ERROR(/var/folders/vt/nrnb_cw95ps51fgmm9rq2mpw0000gn/T/test262-EaMKVt.js:305)
at <global>.<eval>(/var/folders/vt/nrnb_cw95ps51fgmm9rq2mpw0000gn/T/test262-EaMKVt.js:2220)
at org.dynjs.gen.Function13.call(Unknown Source)
at org.dynjs.runtime.ExecutionContext.call(ExecutionContext.java:139)
at org.dynjs.gen.Function17.call(Unknown Source)
at org.dynjs.runtime.ExecutionContext.call(ExecutionContext.java:139)
at org.dynjs.gen.ThenBlock32.call(Unknown Source)
at org.dynjs.gen.Program0.execute(Unknown Source)
at org.dynjs.runtime.ExecutionContext.execute(ExecutionContext.java:122)
at org.dynjs.runtime.DynJS.execute(DynJS.java:90)
at org.dynjs.runtime.DynJS.execute(DynJS.java:80)
at org.dynjs.runtime.DynJS.execute(DynJS.java:76)
at org.dynjs.cli.Main.executeFile(Main.java:73)
at org.dynjs.cli.Main.run(Main.java:60)
at org.dynjs.cli.Main.main(Main.java:46)
===
=== ch15/15.1/15.1.3/15.1.3.1/S15.1.3.1_A1.2_T1 failed in non-strict mode ===
--- errors ---
Exception in thread "main" org.dynjs.exception.ThrowException: #1: If string.charAt(k+1) does not represent hexadecimal digits, throw URIError
at <global>.testFailed(/var/folders/vt/nrnb_cw95ps51fgmm9rq2mpw0000gn/T/test262-bxJ_sO.js:289)
at <global>.$ERROR(/var/folders/vt/nrnb_cw95ps51fgmm9rq2mpw0000gn/T/test262-bxJ_sO.js:305)
at <global>.<eval>(/var/folders/vt/nrnb_cw95ps51fgmm9rq2mpw0000gn/T/test262-bxJ_sO.js:2194)
at org.dynjs.gen.Function13.call(Unknown Source)
at org.dynjs.runtime.ExecutionContext.call(ExecutionContext.java:139)
at org.dynjs.gen.Function17.call(Unknown Source)
at org.dynjs.runtime.ExecutionContext.call(ExecutionContext.java:139)
at org.dynjs.gen.ThenBlock51.call(Unknown Source)
at org.dynjs.gen.Program0.execute(Unknown Source)
at org.dynjs.runtime.ExecutionContext.execute(ExecutionContext.java:122)
at org.dynjs.runtime.DynJS.execute(DynJS.java:90)
at org.dynjs.runtime.DynJS.execute(DynJS.java:80)
at org.dynjs.runtime.DynJS.execute(DynJS.java:76)
at org.dynjs.cli.Main.executeFile(Main.java:73)
at org.dynjs.cli.Main.run(Main.java:60)
at org.dynjs.cli.Main.main(Main.java:46)
===
=== ch15/15.1/15.1.3/15.1.3.1/S15.1.3.1_A1.2_T2 failed in non-strict mode ===
--- errors ---
Exception in thread "main" org.dynjs.exception.ThrowException: #1: If string.charAt(k+2) does not represent hexadecimal digits, throw URIError
at <global>.testFailed(/var/folders/vt/nrnb_cw95ps51fgmm9rq2mpw0000gn/T/test262-yZNIhY.js:289)
at <global>.$ERROR(/var/folders/vt/nrnb_cw95ps51fgmm9rq2mpw0000gn/T/test262-yZNIhY.js:305)
at <global>.<eval>(/var/folders/vt/nrnb_cw95ps51fgmm9rq2mpw0000gn/T/test262-yZNIhY.js:2194)
at org.dynjs.gen.Function13.call(Unknown Source)
at org.dynjs.runtime.ExecutionContext.call(ExecutionContext.java:139)
at org.dynjs.gen.Function17.call(Unknown Source)
at org.dynjs.runtime.ExecutionContext.call(ExecutionContext.java:139)
at org.dynjs.gen.ThenBlock51.call(Unknown Source)
at org.dynjs.gen.Program0.execute(Unknown Source)
at org.dynjs.runtime.ExecutionContext.execute(ExecutionContext.java:122)
at org.dynjs.runtime.DynJS.execute(DynJS.java:90)
at org.dynjs.runtime.DynJS.execute(DynJS.java:80)
at org.dynjs.runtime.DynJS.execute(DynJS.java:76)
at org.dynjs.cli.Main.executeFile(Main.java:73)
at org.dynjs.cli.Main.run(Main.java:60)
at org.dynjs.cli.Main.main(Main.java:46)
===
=== ch15/15.1/15.1.3/15.1.3.1/S15.1.3.1_A1.3_T1 failed in non-strict mode ===
--- errors ---
Exception in thread "main" org.dynjs.exception.ThrowException: #0080-00BF
at <global>.testFailed(/var/folders/vt/nrnb_cw95ps51fgmm9rq2mpw0000gn/T/test262-AgOI9P.js:289)
at <global>.$ERROR(/var/folders/vt/nrnb_cw95ps51fgmm9rq2mpw0000gn/T/test262-AgOI9P.js:305)
at <global>.<eval>(/var/folders/vt/nrnb_cw95ps51fgmm9rq2mpw0000gn/T/test262-AgOI9P.js:2214)
at org.dynjs.gen.Function13.call(Unknown Source)
at org.dynjs.runtime.ExecutionContext.call(ExecutionContext.java:139)
at org.dynjs.gen.Function17.call(Unknown Source)
at org.dynjs.runtime.ExecutionContext.call(ExecutionContext.java:139)
at org.dynjs.gen.ThenBlock41.call(Unknown Source)
at org.dynjs.gen.ThenBlock40.call(Unknown Source)
at org.dynjs.gen.Program0.execute(Unknown Source)
at org.dynjs.runtime.ExecutionContext.execute(ExecutionContext.java:122)
at org.dynjs.runtime.DynJS.execute(DynJS.java:90)
at org.dynjs.runtime.DynJS.execute(DynJS.java:80)
at org.dynjs.runtime.DynJS.execute(DynJS.java:76)
at org.dynjs.cli.Main.executeFile(Main.java:73)
at org.dynjs.cli.Main.run(Main.java:60)
at org.dynjs.cli.Main.main(Main.java:46)
===
=== ch15/15.1/15.1.3/15.1.3.1/S15.1.3.1_A1.3_T2 failed in non-strict mode ===
--- errors ---
Exception in thread "main" org.dynjs.exception.ThrowException: #00F8-00FF
at <global>.testFailed(/var/folders/vt/nrnb_cw95ps51fgmm9rq2mpw0000gn/T/test262-H2fOdp.js:289)
at <global>.$ERROR(/var/folders/vt/nrnb_cw95ps51fgmm9rq2mpw0000gn/T/test262-H2fOdp.js:305)
at <global>.<eval>(/var/folders/vt/nrnb_cw95ps51fgmm9rq2mpw0000gn/T/test262-H2fOdp.js:2214)
at org.dynjs.gen.Function13.call(Unknown Source)
at org.dynjs.runtime.ExecutionContext.call(ExecutionContext.java:139)
at org.dynjs.gen.Function17.call(Unknown Source)
at org.dynjs.runtime.ExecutionContext.call(ExecutionContext.java:139)
at org.dynjs.gen.ThenBlock42.call(Unknown Source)
at org.dynjs.gen.ThenBlock41.call(Unknown Source)
at org.dynjs.gen.Program0.execute(Unknown Source)
at org.dynjs.runtime.ExecutionContext.execute(ExecutionContext.java:122)
at org.dynjs.runtime.DynJS.execute(DynJS.java:90)
at org.dynjs.runtime.DynJS.execute(DynJS.java:80)
at org.dynjs.runtime.DynJS.execute(DynJS.java:76)
at org.dynjs.cli.Main.executeFile(Main.java:73)
at org.dynjs.cli.Main.run(Main.java:60)
at org.dynjs.cli.Main.main(Main.java:46)
===
=== ch15/15.1/15.1.3/15.1.3.1/S15.1.3.1_A1.4_T1 failed in non-strict mode ===
--- errors ---
Exception in thread "main" org.dynjs.exception.ThrowException: #00C0-00DF
at <global>.testFailed(/var/folders/vt/nrnb_cw95ps51fgmm9rq2mpw0000gn/T/test262-6VTB69.js:289)
at <global>.$ERROR(/var/folders/vt/nrnb_cw95ps51fgmm9rq2mpw0000gn/T/test262-6VTB69.js:305)
at <global>.<eval>(/var/folders/vt/nrnb_cw95ps51fgmm9rq2mpw0000gn/T/test262-6VTB69.js:2222)
at org.dynjs.gen.Function13.call(Unknown Source)
at org.dynjs.runtime.ExecutionContext.call(ExecutionContext.java:139)
at org.dynjs.gen.Function17.call(Unknown Source)
at org.dynjs.runtime.ExecutionContext.call(ExecutionContext.java:139)
at org.dynjs.gen.ThenBlock39.call(Unknown Source)
at org.dynjs.gen.ThenBlock38.call(Unknown Source)
at org.dynjs.gen.Program0.execute(Unknown Source)
at org.dynjs.runtime.ExecutionContext.execute(ExecutionContext.java:122)
at org.dynjs.runtime.DynJS.execute(DynJS.java:90)
at org.dynjs.runtime.DynJS.execute(DynJS.java:80)
at org.dynjs.runtime.DynJS.execute(DynJS.java:76)
at org.dynjs.cli.Main.executeFile(Main.java:73)
at org.dynjs.cli.Main.run(Main.java:60)
at org.dynjs.cli.Main.main(Main.java:46)
===
=== ch15/15.1/15.1.3/15.1.3.1/S15.1.3.1_A1.5_T1 failed in non-strict mode ===
--- errors ---
Exception in thread "main" org.dynjs.exception.ThrowException: java.lang.NumberFormatException: For input string: "0x.0E0"
at <global>.<eval>(/var/folders/vt/nrnb_cw95ps51fgmm9rq2mpw0000gn/T/test262-AgaO23.js:2182)
at org.dynjs.runtime.ExecutionContext.execute(ExecutionContext.java:126)
at org.dynjs.runtime.DynJS.execute(DynJS.java:90)
at org.dynjs.runtime.DynJS.execute(DynJS.java:80)
at org.dynjs.runtime.DynJS.execute(DynJS.java:76)
at org.dynjs.cli.Main.executeFile(Main.java:73)
at org.dynjs.cli.Main.run(Main.java:60)
at org.dynjs.cli.Main.main(Main.java:46)
Caused by: java.lang.NumberFormatException: For input string: "0x.0E0"
at sun.misc.FloatingDecimal.parseHexString(FloatingDecimal.java:1891)
at sun.misc.FloatingDecimal.readJavaFormatString(FloatingDecimal.java:1063)
at java.lang.Double.valueOf(Double.java:504)
at org.dynjs.gen.Program0.execute(Unknown Source)
at org.dynjs.runtime.ExecutionContext.execute(ExecutionContext.java:122)
... 6 more
===
=== ch15/15.1/15.1.3/15.1.3.1/S15.1.3.1_A1.6_T1 failed in non-strict mode ===
--- errors ---
Exception in thread "main" org.dynjs.exception.ThrowException: #00F0-00F7
at <global>.testFailed(/var/folders/vt/nrnb_cw95ps51fgmm9rq2mpw0000gn/T/test262-ISMs_l.js:289)
at <global>.$ERROR(/var/folders/vt/nrnb_cw95ps51fgmm9rq2mpw0000gn/T/test262-ISMs_l.js:305)
at <global>.<eval>(/var/folders/vt/nrnb_cw95ps51fgmm9rq2mpw0000gn/T/test262-ISMs_l.js:2222)
at org.dynjs.gen.Function13.call(Unknown Source)
at org.dynjs.runtime.ExecutionContext.call(ExecutionContext.java:139)
at org.dynjs.gen.Function17.call(Unknown Source)
at org.dynjs.runtime.ExecutionContext.call(ExecutionContext.java:139)
at org.dynjs.gen.ThenBlock34.call(Unknown Source)
at org.dynjs.gen.ThenBlock33.call(Unknown Source)
at org.dynjs.gen.Program0.execute(Unknown Source)
at org.dynjs.runtime.ExecutionContext.execute(ExecutionContext.java:122)
at org.dynjs.runtime.DynJS.execute(DynJS.java:90)
at org.dynjs.runtime.DynJS.execute(DynJS.java:80)
at org.dynjs.runtime.DynJS.execute(DynJS.java:76)
at org.dynjs.cli.Main.executeFile(Main.java:73)
at org.dynjs.cli.Main.run(Main.java:60)
at org.dynjs.cli.Main.main(Main.java:46)
===
=== ch15/15.1/15.1.3/15.1.3.1/S15.1.3.1_A1.7_T1 failed in non-strict mode ===
--- errors ---
Exception in thread "main" org.dynjs.exception.ThrowException: #00C0-00DF
at <global>.testFailed(/var/folders/vt/nrnb_cw95ps51fgmm9rq2mpw0000gn/T/test262-8KUYz0.js:289)
at <global>.$ERROR(/var/folders/vt/nrnb_cw95ps51fgmm9rq2mpw0000gn/T/test262-8KUYz0.js:305)
at <global>.<eval>(/var/folders/vt/nrnb_cw95ps51fgmm9rq2mpw0000gn/T/test262-8KUYz0.js:2214)
at org.dynjs.gen.Function13.call(Unknown Source)
at org.dynjs.runtime.ExecutionContext.call(ExecutionContext.java:139)
at org.dynjs.gen.Function17.call(Unknown Source)
at org.dynjs.runtime.ExecutionContext.call(ExecutionContext.java:139)
at org.dynjs.gen.ThenBlock41.call(Unknown Source)
at org.dynjs.gen.ThenBlock40.call(Unknown Source)
at org.dynjs.gen.Program0.execute(Unknown Source)
at org.dynjs.runtime.ExecutionContext.execute(ExecutionContext.java:122)
at org.dynjs.runtime.DynJS.execute(DynJS.java:90)
at org.dynjs.runtime.DynJS.execute(DynJS.java:80)
at org.dynjs.runtime.DynJS.execute(DynJS.java:76)
at org.dynjs.cli.Main.executeFile(Main.java:73)
at org.dynjs.cli.Main.run(Main.java:60)
at org.dynjs.cli.Main.main(Main.java:46)
===
=== ch15/15.1/15.1.3/15.1.3.1/S15.1.3.1_A1.8_T1 failed in non-strict mode ===
--- errors ---
Exception in thread "main" org.dynjs.exception.ThrowException: java.lang.NumberFormatException: For input string: "0x.0E0"
at <global>.<eval>(/var/folders/vt/nrnb_cw95ps51fgmm9rq2mpw0000gn/T/test262-Ef3ti5.js:2182)
at org.dynjs.runtime.ExecutionContext.execute(ExecutionContext.java:126)
at org.dynjs.runtime.DynJS.execute(DynJS.java:90)
at org.dynjs.runtime.DynJS.execute(DynJS.java:80)
at org.dynjs.runtime.DynJS.execute(DynJS.java:76)
at org.dynjs.cli.Main.executeFile(Main.java:73)
at org.dynjs.cli.Main.run(Main.java:60)
at org.dynjs.cli.Main.main(Main.java:46)
Caused by: java.lang.NumberFormatException: For input string: "0x.0E0"
at sun.misc.FloatingDecimal.parseHexString(FloatingDecimal.java:1891)
at sun.misc.FloatingDecimal.readJavaFormatString(FloatingDecimal.java:1063)
at java.lang.Double.valueOf(Double.java:504)
at org.dynjs.gen.Program0.execute(Unknown Source)
at org.dynjs.runtime.ExecutionContext.execute(ExecutionContext.java:122)
... 6 more
===
=== ch15/15.1/15.1.3/15.1.3.1/S15.1.3.1_A1.8_T2 failed in non-strict mode ===
--- errors ---
Exception in thread "main" org.dynjs.exception.ThrowException: java.lang.NumberFormatException: For input string: "0x.0E0"
at <global>.<eval>(/var/folders/vt/nrnb_cw95ps51fgmm9rq2mpw0000gn/T/test262-zwVnlU.js:2182)
at org.dynjs.runtime.ExecutionContext.execute(ExecutionContext.java:126)
at org.dynjs.runtime.DynJS.execute(DynJS.java:90)
at org.dynjs.runtime.DynJS.execute(DynJS.java:80)
at org.dynjs.runtime.DynJS.execute(DynJS.java:76)
at org.dynjs.cli.Main.executeFile(Main.java:73)
at org.dynjs.cli.Main.run(Main.java:60)
at org.dynjs.cli.Main.main(Main.java:46)
Caused by: java.lang.NumberFormatException: For input string: "0x.0E0"
at sun.misc.FloatingDecimal.parseHexString(FloatingDecimal.java:1891)
at sun.misc.FloatingDecimal.readJavaFormatString(FloatingDecimal.java:1063)
at java.lang.Double.valueOf(Double.java:504)
at org.dynjs.gen.Program0.execute(Unknown Source)
at org.dynjs.runtime.ExecutionContext.execute(ExecutionContext.java:122)
... 6 more
===
=== ch15/15.1/15.1.3/15.1.3.1/S15.1.3.1_A1.9_T1 failed in non-strict mode ===
--- errors ---
Exception in thread "main" org.dynjs.exception.ThrowException: #00F0-00F7
at <global>.testFailed(/var/folders/vt/nrnb_cw95ps51fgmm9rq2mpw0000gn/T/test262-pHxAmJ.js:289)
at <global>.$ERROR(/var/folders/vt/nrnb_cw95ps51fgmm9rq2mpw0000gn/T/test262-pHxAmJ.js:305)
at <global>.<eval>(/var/folders/vt/nrnb_cw95ps51fgmm9rq2mpw0000gn/T/test262-pHxAmJ.js:2214)
at org.dynjs.gen.Function13.call(Unknown Source)
at org.dynjs.runtime.ExecutionContext.call(ExecutionContext.java:139)
at org.dynjs.gen.Function17.call(Unknown Source)
at org.dynjs.runtime.ExecutionContext.call(ExecutionContext.java:139)
at org.dynjs.gen.ThenBlock36.call(Unknown Source)
at org.dynjs.gen.ThenBlock35.call(Unknown Source)
at org.dynjs.gen.Program0.execute(Unknown Source)
at org.dynjs.runtime.ExecutionContext.execute(ExecutionContext.java:122)
at org.dynjs.runtime.DynJS.execute(DynJS.java:90)
at org.dynjs.runtime.DynJS.execute(DynJS.java:80)
at org.dynjs.runtime.DynJS.execute(DynJS.java:76)
at org.dynjs.cli.Main.executeFile(Main.java:73)
at org.dynjs.cli.Main.run(Main.java:60)
at org.dynjs.cli.Main.main(Main.java:46)
===
=== ch15/15.1/15.1.3/15.1.3.1/S15.1.3.1_A1.9_T2 failed in non-strict mode ===
--- errors ---
Exception in thread "main" org.dynjs.exception.ThrowException: #00F0-00F7
at <global>.testFailed(/var/folders/vt/nrnb_cw95ps51fgmm9rq2mpw0000gn/T/test262-rDpyzU.js:289)
at <global>.$ERROR(/var/folders/vt/nrnb_cw95ps51fgmm9rq2mpw0000gn/T/test262-rDpyzU.js:305)
at <global>.<eval>(/var/folders/vt/nrnb_cw95ps51fgmm9rq2mpw0000gn/T/test262-rDpyzU.js:2214)
at org.dynjs.gen.Function13.call(Unknown Source)
at org.dynjs.runtime.ExecutionContext.call(ExecutionContext.java:139)
at org.dynjs.gen.Function17.call(Unknown Source)
at org.dynjs.runtime.ExecutionContext.call(ExecutionContext.java:139)
at org.dynjs.gen.ThenBlock32.call(Unknown Source)
at org.dynjs.gen.ThenBlock31.call(Unknown Source)
at org.dynjs.gen.Program0.execute(Unknown Source)
at org.dynjs.runtime.ExecutionContext.execute(ExecutionContext.java:122)
at org.dynjs.runtime.DynJS.execute(DynJS.java:90)
at org.dynjs.runtime.DynJS.execute(DynJS.java:80)
at org.dynjs.runtime.DynJS.execute(DynJS.java:76)
at org.dynjs.cli.Main.executeFile(Main.java:73)
at org.dynjs.cli.Main.run(Main.java:60)
at org.dynjs.cli.Main.main(Main.java:46)
===
=== ch15/15.1/15.1.3/15.1.3.1/S15.1.3.1_A1.9_T3 failed in non-strict mode ===
--- errors ---
Exception in thread "main" org.dynjs.exception.ThrowException: #00F0-00F7
at <global>.testFailed(/var/folders/vt/nrnb_cw95ps51fgmm9rq2mpw0000gn/T/test262-gfC2vN.js:289)
at <global>.$ERROR(/var/folders/vt/nrnb_cw95ps51fgmm9rq2mpw0000gn/T/test262-gfC2vN.js:305)
at <global>.<eval>(/var/folders/vt/nrnb_cw95ps51fgmm9rq2mpw0000gn/T/test262-gfC2vN.js:2214)
at org.dynjs.gen.Function13.call(Unknown Source)
at org.dynjs.runtime.ExecutionContext.call(ExecutionContext.java:139)
at org.dynjs.gen.Function17.call(Unknown Source)
at org.dynjs.runtime.ExecutionContext.call(ExecutionContext.java:139)
at org.dynjs.gen.ThenBlock32.call(Unknown Source)
at org.dynjs.gen.ThenBlock31.call(Unknown Source)
at org.dynjs.gen.Program0.execute(Unknown Source)
at org.dynjs.runtime.ExecutionContext.execute(ExecutionContext.java:122)
at org.dynjs.runtime.DynJS.execute(DynJS.java:90)
at org.dynjs.runtime.DynJS.execute(DynJS.java:80)
at org.dynjs.runtime.DynJS.execute(DynJS.java:76)
at org.dynjs.cli.Main.executeFile(Main.java:73)
at org.dynjs.cli.Main.run(Main.java:60)
at org.dynjs.cli.Main.main(Main.java:46)
===
=== ch15/15.1/15.1.3/15.1.3.1/S15.1.3.1_A2.1_T1 failed in non-strict mode ===
--- errors ---
Exception in thread "main" org.dynjs.exception.ThrowException: #002B
at <global>.testFailed(/var/folders/vt/nrnb_cw95ps51fgmm9rq2mpw0000gn/T/test262-zjyVIi.js:289)
at <global>.$ERROR(/var/folders/vt/nrnb_cw95ps51fgmm9rq2mpw0000gn/T/test262-zjyVIi.js:305)
at <global>.<eval>(/var/folders/vt/nrnb_cw95ps51fgmm9rq2mpw0000gn/T/test262-zjyVIi.js:2190)
at org.dynjs.gen.Function13.call(Unknown Source)
at org.dynjs.runtime.ExecutionContext.call(ExecutionContext.java:139)
at org.dynjs.gen.Function17.call(Unknown Source)
at org.dynjs.runtime.ExecutionContext.call(ExecutionContext.java:139)
at org.dynjs.gen.CatchBlock41.call(Unknown Source)
at org.dynjs.runtime.ExecutionContext.executeCatch(ExecutionContext.java:235)
at org.dynjs.gen.ThenBlock21.call(Unknown Source)
at org.dynjs.gen.ForBlock20.call(Unknown Source)
at org.dynjs.gen.Program0.execute(Unknown Source)
at org.dynjs.runtime.ExecutionContext.execute(ExecutionContext.java:122)
at org.dynjs.runtime.DynJS.execute(DynJS.java:90)
at org.dynjs.runtime.DynJS.execute(DynJS.java:80)
at org.dynjs.runtime.DynJS.execute(DynJS.java:76)
at org.dynjs.cli.Main.executeFile(Main.java:73)
at org.dynjs.cli.Main.run(Main.java:60)
at org.dynjs.cli.Main.main(Main.java:46)
===
ch15/15.1/15.1.3/15.1.3.1/S15.1.3.1_A2.2_T1 passed in non-strict mode
ch15/15.1/15.1.3/15.1.3.1/S15.1.3.1_A2.3_T1 passed in non-strict mode
=== ch15/15.1/15.1.3/15.1.3.1/S15.1.3.1_A2.4_T1 failed in non-strict mode ===
--- errors ---
Exception in thread "main" org.dynjs.exception.ThrowException: java.lang.NumberFormatException: For input string: "0x.0E0"
at <global>.<eval>(/var/folders/vt/nrnb_cw95ps51fgmm9rq2mpw0000gn/T/test262-BPQ6Hd.js:2182)
at org.dynjs.runtime.ExecutionContext.execute(ExecutionContext.java:126)
at org.dynjs.runtime.DynJS.execute(DynJS.java:90)
at org.dynjs.runtime.DynJS.execute(DynJS.java:80)
at org.dynjs.runtime.DynJS.execute(DynJS.java:76)
at org.dynjs.cli.Main.executeFile(Main.java:73)
at org.dynjs.cli.Main.run(Main.java:60)
at org.dynjs.cli.Main.main(Main.java:46)
Caused by: java.lang.NumberFormatException: For input string: "0x.0E0"
at sun.misc.FloatingDecimal.parseHexString(FloatingDecimal.java:1891)
at sun.misc.FloatingDecimal.readJavaFormatString(FloatingDecimal.java:1063)
at java.lang.Double.valueOf(Double.java:504)
at org.dynjs.gen.Program0.execute(Unknown Source)
at org.dynjs.runtime.ExecutionContext.execute(ExecutionContext.java:122)
... 6 more
===
ch15/15.1/15.1.3/15.1.3.1/S15.1.3.1_A2.5_T1 passed in non-strict mode
=== ch15/15.1/15.1.3/15.1.3.1/S15.1.3.1_A3_T1 failed in non-strict mode ===
--- errors ---
Exception in thread "main" org.dynjs.exception.ThrowException: #1: decodeURI("%3B") equal "%3B", not ";"
at <global>.testFailed(/var/folders/vt/nrnb_cw95ps51fgmm9rq2mpw0000gn/T/test262-ngWFtZ.js:289)
at <global>.$ERROR(/var/folders/vt/nrnb_cw95ps51fgmm9rq2mpw0000gn/T/test262-ngWFtZ.js:305)
at <global>.<eval>(/var/folders/vt/nrnb_cw95ps51fgmm9rq2mpw0000gn/T/test262-ngWFtZ.js:2179)
at org.dynjs.gen.Function13.call(Unknown Source)
at org.dynjs.runtime.ExecutionContext.call(ExecutionContext.java:139)
at org.dynjs.gen.Function17.call(Unknown Source)
at org.dynjs.runtime.ExecutionContext.call(ExecutionContext.java:139)
at org.dynjs.gen.ThenBlock20.call(Unknown Source)
at org.dynjs.gen.Program0.execute(Unknown Source)
at org.dynjs.runtime.ExecutionContext.execute(ExecutionContext.java:122)
at org.dynjs.runtime.DynJS.execute(DynJS.java:90)
at org.dynjs.runtime.DynJS.execute(DynJS.java:80)
at org.dynjs.runtime.DynJS.execute(DynJS.java:76)
at org.dynjs.cli.Main.executeFile(Main.java:73)
at org.dynjs.cli.Main.run(Main.java:60)
at org.dynjs.cli.Main.main(Main.java:46)
===
=== ch15/15.1/15.1.3/15.1.3.1/S15.1.3.1_A3_T2 failed in non-strict mode ===
--- errors ---
Exception in thread "main" org.dynjs.exception.ThrowException: #1: decodeURI("%3b") equal "%3b", not ";" or "%3B"
at <global>.testFailed(/var/folders/vt/nrnb_cw95ps51fgmm9rq2mpw0000gn/T/test262-WMhJB2.js:289)
at <global>.$ERROR(/var/folders/vt/nrnb_cw95ps51fgmm9rq2mpw0000gn/T/test262-WMhJB2.js:305)
at <global>.<eval>(/var/folders/vt/nrnb_cw95ps51fgmm9rq2mpw0000gn/T/test262-WMhJB2.js:2179)
at org.dynjs.gen.Function13.call(Unknown Source)
at org.dynjs.runtime.ExecutionContext.call(ExecutionContext.java:139)
at org.dynjs.gen.Function17.call(Unknown Source)
at org.dynjs.runtime.ExecutionContext.call(ExecutionContext.java:139)
at org.dynjs.gen.ThenBlock20.call(Unknown Source)
at org.dynjs.gen.Program0.execute(Unknown Source)
at org.dynjs.runtime.ExecutionContext.execute(ExecutionContext.java:122)
at org.dynjs.runtime.DynJS.execute(DynJS.java:90)
at org.dynjs.runtime.DynJS.execute(DynJS.java:80)
at org.dynjs.runtime.DynJS.execute(DynJS.java:76)
at org.dynjs.cli.Main.executeFile(Main.java:73)
at org.dynjs.cli.Main.run(Main.java:60)
at org.dynjs.cli.Main.main(Main.java:46)
===
=== ch15/15.1/15.1.3/15.1.3.1/S15.1.3.1_A3_T3 failed in non-strict mode ===
--- errors ---
Exception in thread "main" org.dynjs.exception.ThrowException: #1: decodeURI("%3B%2F%3F%3A%40%26%3D%2B%24%2C%23") equal "%3B%2F%3F%3A%40%26%3D%2B%24%2C%23", not ";/?:@&=+$,#"
at <global>.testFailed(/var/folders/vt/nrnb_cw95ps51fgmm9rq2mpw0000gn/T/test262-w2nGG7.js:289)
at <global>.$ERROR(/var/folders/vt/nrnb_cw95ps51fgmm9rq2mpw0000gn/T/test262-w2nGG7.js:305)
at <global>.<eval>(/var/folders/vt/nrnb_cw95ps51fgmm9rq2mpw0000gn/T/test262-w2nGG7.js:2179)
at org.dynjs.gen.Function13.call(Unknown Source)
at org.dynjs.runtime.ExecutionContext.call(ExecutionContext.java:139)
at org.dynjs.gen.Function17.call(Unknown Source)
at org.dynjs.runtime.ExecutionContext.call(ExecutionContext.java:139)
at org.dynjs.gen.ThenBlock20.call(Unknown Source)
at org.dynjs.gen.Program0.execute(Unknown Source)
at org.dynjs.runtime.ExecutionContext.execute(ExecutionContext.java:122)
at org.dynjs.runtime.DynJS.execute(DynJS.java:90)
at org.dynjs.runtime.DynJS.execute(DynJS.java:80)
at org.dynjs.runtime.DynJS.execute(DynJS.java:76)
at org.dynjs.cli.Main.executeFile(Main.java:73)
at org.dynjs.cli.Main.run(Main.java:60)
at org.dynjs.cli.Main.main(Main.java:46)
===
ch15/15.1/15.1.3/15.1.3.1/S15.1.3.1_A4_T1 passed in non-strict mode
=== ch15/15.1/15.1.3/15.1.3.1/S15.1.3.1_A4_T2 failed in non-strict mode ===
--- errors ---
Exception in thread "main" org.dynjs.exception.ThrowException: #3: http://ru.wikipedia.org/wiki/Юникод%23Версии Юникода
at <global>.testFailed(/var/folders/vt/nrnb_cw95ps51fgmm9rq2mpw0000gn/T/test262-1dcTMd.js:289)
at <global>.$ERROR(/var/folders/vt/nrnb_cw95ps51fgmm9rq2mpw0000gn/T/test262-1dcTMd.js:305)
at <global>.<eval>(/var/folders/vt/nrnb_cw95ps51fgmm9rq2mpw0000gn/T/test262-1dcTMd.js:2189)
at org.dynjs.gen.Function13.call(Unknown Source)
at org.dynjs.runtime.ExecutionContext.call(ExecutionContext.java:139)
at org.dynjs.gen.Function17.call(Unknown Source)
at org.dynjs.runtime.ExecutionContext.call(ExecutionContext.java:139)
at org.dynjs.gen.ThenBlock20.call(Unknown Source)
at org.dynjs.gen.Program0.execute(Unknown Source)
at org.dynjs.runtime.ExecutionContext.execute(ExecutionContext.java:122)
at org.dynjs.runtime.DynJS.execute(DynJS.java:90)
at org.dynjs.runtime.DynJS.execute(DynJS.java:80)
at org.dynjs.runtime.DynJS.execute(DynJS.java:76)
at org.dynjs.cli.Main.executeFile(Main.java:73)
at org.dynjs.cli.Main.run(Main.java:60)
at org.dynjs.cli.Main.main(Main.java:46)
===
=== ch15/15.1/15.1.3/15.1.3.1/S15.1.3.1_A4_T3 failed in non-strict mode ===
--- errors ---
Exception in thread "main" org.dynjs.exception.ThrowException: #2: http://unipro.ru/%0Babout
at <global>.testFailed(/var/folders/vt/nrnb_cw95ps51fgmm9rq2mpw0000gn/T/test262-qhUTs1.js:289)
at <global>.$ERROR(/var/folders/vt/nrnb_cw95ps51fgmm9rq2mpw0000gn/T/test262-qhUTs1.js:305)
at <global>.<eval>(/var/folders/vt/nrnb_cw95ps51fgmm9rq2mpw0000gn/T/test262-qhUTs1.js:2184)
at org.dynjs.gen.Function13.call(Unknown Source)
at org.dynjs.runtime.ExecutionContext.call(ExecutionContext.java:139)
at org.dynjs.gen.Function17.call(Unknown Source)
at org.dynjs.runtime.ExecutionContext.call(ExecutionContext.java:139)
at org.dynjs.gen.ThenBlock20.call(Unknown Source)
at org.dynjs.gen.Program0.execute(Unknown Source)
at org.dynjs.runtime.ExecutionContext.execute(ExecutionContext.java:122)
at org.dynjs.runtime.DynJS.execute(DynJS.java:90)
at org.dynjs.runtime.DynJS.execute(DynJS.java:80)
at org.dynjs.runtime.DynJS.execute(DynJS.java:76)
at org.dynjs.cli.Main.executeFile(Main.java:73)
at org.dynjs.cli.Main.run(Main.java:60)
at org.dynjs.cli.Main.main(Main.java:46)
===
=== ch15/15.1/15.1.3/15.1.3.1/S15.1.3.1_A4_T4 failed in non-strict mode ===
--- errors ---
Exception in thread "main" org.dynjs.exception.ThrowException: #2: http:%2f%2Funipro.ru
at <global>.testFailed(/var/folders/vt/nrnb_cw95ps51fgmm9rq2mpw0000gn/T/test262-sGEP2G.js:289)
at <global>.$ERROR(/var/folders/vt/nrnb_cw95ps51fgmm9rq2mpw0000gn/T/test262-sGEP2G.js:305)
at <global>.<eval>(/var/folders/vt/nrnb_cw95ps51fgmm9rq2mpw0000gn/T/test262-sGEP2G.js:2184)
at org.dynjs.gen.Function13.call(Unknown Source)
at org.dynjs.runtime.ExecutionContext.call(ExecutionContext.java:139)
at org.dynjs.gen.Function17.call(Unknown Source)
at org.dynjs.runtime.ExecutionContext.call(ExecutionContext.java:139)
at org.dynjs.gen.ThenBlock20.call(Unknown Source)
at org.dynjs.gen.Program0.execute(Unknown Source)
at org.dynjs.runtime.ExecutionContext.execute(ExecutionContext.java:122)
at org.dynjs.runtime.DynJS.execute(DynJS.java:90)
at org.dynjs.runtime.DynJS.execute(DynJS.java:80)
at org.dynjs.runtime.DynJS.execute(DynJS.java:76)
at org.dynjs.cli.Main.executeFile(Main.java:73)
at org.dynjs.cli.Main.run(Main.java:60)
at org.dynjs.cli.Main.main(Main.java:46)
===
ch15/15.1/15.1.3/15.1.3.1/S15.1.3.1_A5.1 passed in non-strict mode
ch15/15.1/15.1.3/15.1.3.1/S15.1.3.1_A5.2 passed in non-strict mode
ch15/15.1/15.1.3/15.1.3.1/S15.1.3.1_A5.3 passed in non-strict mode
ch15/15.1/15.1.3/15.1.3.1/S15.1.3.1_A5.4 passed in non-strict mode
ch15/15.1/15.1.3/15.1.3.1/S15.1.3.1_A5.5 passed in non-strict mode
ch15/15.1/15.1.3/15.1.3.1/S15.1.3.1_A5.6 passed in non-strict mode
=== ch15/15.1/15.1.3/15.1.3.1/S15.1.3.1_A5.7 failed in non-strict mode ===
--- errors ---
Exception in thread "main" org.dynjs.exception.ThrowException: #1.2: new decodeURI() throw TypeError. Actual: Test262 Error: #1.1: new decodeURI() throw TypeError. Actual: [object Object]
at <global>.testFailed(/var/folders/vt/nrnb_cw95ps51fgmm9rq2mpw0000gn/T/test262-hbPLrH.js:289)
at <global>.$ERROR(/var/folders/vt/nrnb_cw95ps51fgmm9rq2mpw0000gn/T/test262-hbPLrH.js:305)
at <global>.<eval>(/var/folders/vt/nrnb_cw95ps51fgmm9rq2mpw0000gn/T/test262-hbPLrH.js:2184)
at org.dynjs.gen.Function13.call(Unknown Source)
at org.dynjs.runtime.ExecutionContext.call(ExecutionContext.java:139)
at org.dynjs.gen.Function17.call(Unknown Source)
at org.dynjs.runtime.ExecutionContext.call(ExecutionContext.java:139)
at org.dynjs.gen.ThenBlock23.call(Unknown Source)
at org.dynjs.gen.CatchBlock22.call(Unknown Source)
at org.dynjs.runtime.ExecutionContext.executeCatch(ExecutionContext.java:235)
at org.dynjs.gen.Program0.execute(Unknown Source)
at org.dynjs.runtime.ExecutionContext.execute(ExecutionContext.java:122)
at org.dynjs.runtime.DynJS.execute(DynJS.java:90)
at org.dynjs.runtime.DynJS.execute(DynJS.java:80)
at org.dynjs.runtime.DynJS.execute(DynJS.java:76)
at org.dynjs.cli.Main.executeFile(Main.java:73)
at org.dynjs.cli.Main.run(Main.java:60)
at org.dynjs.cli.Main.main(Main.java:46)
===
ch15/15.1/15.1.3/15.1.3.1/S15.1.3.1_A6_T1 passed in non-strict mode
=== ch15/15.1/15.1.3/15.1.3.2/S15.1.3.2_A1.10_T1 failed in non-strict mode ===
--- errors ---
Exception in thread "main" org.dynjs.exception.ThrowException: #1: If B = 110xxxxx (n = 2) and (string.charAt(k + 4) and string.charAt(k + 5)) do not represent hexadecimal digits, throw URIError
at <global>.testFailed(/var/folders/vt/nrnb_cw95ps51fgmm9rq2mpw0000gn/T/test262-d_2Wo5.js:289)
at <global>.$ERROR(/var/folders/vt/nrnb_cw95ps51fgmm9rq2mpw0000gn/T/test262-d_2Wo5.js:305)
at <global>.<eval>(/var/folders/vt/nrnb_cw95ps51fgmm9rq2mpw0000gn/T/test262-d_2Wo5.js:2194)
at org.dynjs.gen.Function13.call(Unknown Source)
at org.dynjs.runtime.ExecutionContext.call(ExecutionContext.java:139)
at org.dynjs.gen.Function17.call(Unknown Source)
at org.dynjs.runtime.ExecutionContext.call(ExecutionContext.java:139)
at org.dynjs.gen.ThenBlock51.call(Unknown Source)
at org.dynjs.gen.Program0.execute(Unknown Source)
at org.dynjs.runtime.ExecutionContext.execute(ExecutionContext.java:122)
at org.dynjs.runtime.DynJS.execute(DynJS.java:90)
at org.dynjs.runtime.DynJS.execute(DynJS.java:80)
at org.dynjs.runtime.DynJS.execute(DynJS.java:76)
at org.dynjs.cli.Main.executeFile(Main.java:73)
at org.dynjs.cli.Main.run(Main.java:60)
at org.dynjs.cli.Main.main(Main.java:46)
===
=== ch15/15.1/15.1.3/15.1.3.2/S15.1.3.2_A1.11_T1 failed in non-strict mode ===
--- errors ---
Exception in thread "main" org.dynjs.exception.ThrowException: #1: If B = 1110xxxx (n = 3) and (string.charAt(k + 4) and string.charAt(k + 5)) do not represent hexadecimal digits, throw URIError
at <global>.testFailed(/var/folders/vt/nrnb_cw95ps51fgmm9rq2mpw0000gn/T/test262-8kit9K.js:289)
at <global>.$ERROR(/var/folders/vt/nrnb_cw95ps51fgmm9rq2mpw0000gn/T/test262-8kit9K.js:305)
at <global>.<eval>(/var/folders/vt/nrnb_cw95ps51fgmm9rq2mpw0000gn/T/test262-8kit9K.js:2194)
at org.dynjs.gen.Function13.call(Unknown Source)
at org.dynjs.runtime.ExecutionContext.call(ExecutionContext.java:139)
at org.dynjs.gen.Function17.call(Unknown Source)
at org.dynjs.runtime.ExecutionContext.call(ExecutionContext.java:139)
at org.dynjs.gen.ThenBlock55.call(Unknown Source)
at org.dynjs.gen.Program0.execute(Unknown Source)
at org.dynjs.runtime.ExecutionContext.execute(ExecutionContext.java:122)
at org.dynjs.runtime.DynJS.execute(DynJS.java:90)
at org.dynjs.runtime.DynJS.execute(DynJS.java:80)
at org.dynjs.runtime.DynJS.execute(DynJS.java:76)
at org.dynjs.cli.Main.executeFile(Main.java:73)
at org.dynjs.cli.Main.run(Main.java:60)
at org.dynjs.cli.Main.main(Main.java:46)
===
=== ch15/15.1/15.1.3/15.1.3.2/S15.1.3.2_A1.11_T2 failed in non-strict mode ===
--- errors ---
Exception in thread "main" org.dynjs.exception.ThrowException: #1: If B = 1110xxxx (n = 3) and (string.charAt(k + 7) and string.charAt(k + 8)) do not represent hexadecimal digits, throw URIError
at <global>.testFailed(/var/folders/vt/nrnb_cw95ps51fgmm9rq2mpw0000gn/T/test262-Ch5FYv.js:289)
at <global>.$ERROR(/var/folders/vt/nrnb_cw95ps51fgmm9rq2mpw0000gn/T/test262-Ch5FYv.js:305)
at <global>.<eval>(/var/folders/vt/nrnb_cw95ps51fgmm9rq2mpw0000gn/T/test262-Ch5FYv.js:2194)
at org.dynjs.gen.Function13.call(Unknown Source)
at org.dynjs.runtime.ExecutionContext.call(ExecutionContext.java:139)
at org.dynjs.gen.Function17.call(Unknown Source)
at org.dynjs.runtime.ExecutionContext.call(ExecutionContext.java:139)
at org.dynjs.gen.ThenBlock47.call(Unknown Source)
at org.dynjs.gen.Program0.execute(Unknown Source)
at org.dynjs.runtime.ExecutionContext.execute(ExecutionContext.java:122)
at org.dynjs.runtime.DynJS.execute(DynJS.java:90)
at org.dynjs.runtime.DynJS.execute(DynJS.java:80)
at org.dynjs.runtime.DynJS.execute(DynJS.java:76)
at org.dynjs.cli.Main.executeFile(Main.java:73)
at org.dynjs.cli.Main.run(Main.java:60)
at org.dynjs.cli.Main.main(Main.java:46)
===
=== ch15/15.1/15.1.3/15.1.3.2/S15.1.3.2_A1.12_T1 failed in non-strict mode ===
--- errors ---
Exception in thread "main" org.dynjs.exception.ThrowException: #1: If B = 11110xxx (n = 4) and (string.charAt(k + 4) and string.charAt(k + 5)) do not represent hexadecimal digits, throw URIError
at <global>.testFailed(/var/folders/vt/nrnb_cw95ps51fgmm9rq2mpw0000gn/T/test262-qxfD76.js:289)
at <global>.$ERROR(/var/folders/vt/nrnb_cw95ps51fgmm9rq2mpw0000gn/T/test262-qxfD76.js:305)
at <global>.<eval>(/var/folders/vt/nrnb_cw95ps51fgmm9rq2mpw0000gn/T/test262-qxfD76.js:2194)
at org.dynjs.gen.Function13.call(Unknown Source)
at org.dynjs.runtime.ExecutionContext.call(ExecutionContext.java:139)
at org.dynjs.gen.Function17.call(Unknown Source)
at org.dynjs.runtime.ExecutionContext.call(ExecutionContext.java:139)
at org.dynjs.gen.ThenBlock47.call(Unknown Source)
at org.dynjs.gen.Program0.execute(Unknown Source)
at org.dynjs.runtime.ExecutionContext.execute(ExecutionContext.java:122)
at org.dynjs.runtime.DynJS.execute(DynJS.java:90)
at org.dynjs.runtime.DynJS.execute(DynJS.java:80)
at org.dynjs.runtime.DynJS.execute(DynJS.java:76)
at org.dynjs.cli.Main.executeFile(Main.java:73)
at org.dynjs.cli.Main.run(Main.java:60)
at org.dynjs.cli.Main.main(Main.java:46)
===
=== ch15/15.1/15.1.3/15.1.3.2/S15.1.3.2_A1.12_T2 failed in non-strict mode ===
--- errors ---
Exception in thread "main" org.dynjs.exception.ThrowException: #1: If B = 11110xxx (n = 4) and (string.charAt(k + 7) and string.charAt(k + 8)) do not represent hexadecimal digits, throw URIError
at <global>.testFailed(/var/folders/vt/nrnb_cw95ps51fgmm9rq2mpw0000gn/T/test262-RGxvjF.js:289)
at <global>.$ERROR(/var/folders/vt/nrnb_cw95ps51fgmm9rq2mpw0000gn/T/test262-RGxvjF.js:305)
at <global>.<eval>(/var/folders/vt/nrnb_cw95ps51fgmm9rq2mpw0000gn/T/test262-RGxvjF.js:2194)
at org.dynjs.gen.Function13.call(Unknown Source)
at org.dynjs.runtime.ExecutionContext.call(ExecutionContext.java:139)
at org.dynjs.gen.Function17.call(Unknown Source)
at org.dynjs.runtime.ExecutionContext.call(ExecutionContext.java:139)
at org.dynjs.gen.ThenBlock49.call(Unknown Source)
at org.dynjs.gen.Program0.execute(Unknown Source)
at org.dynjs.runtime.ExecutionContext.execute(ExecutionContext.java:122)
at org.dynjs.runtime.DynJS.execute(DynJS.java:90)
at org.dynjs.runtime.DynJS.execute(DynJS.java:80)
at org.dynjs.runtime.DynJS.execute(DynJS.java:76)
at org.dynjs.cli.Main.executeFile(Main.java:73)
at org.dynjs.cli.Main.run(Main.java:60)
at org.dynjs.cli.Main.main(Main.java:46)
===
=== ch15/15.1/15.1.3/15.1.3.2/S15.1.3.2_A1.12_T3 failed in non-strict mode ===
--- errors ---
Exception in thread "main" org.dynjs.exception.ThrowException: #1: If B = 11110xxx (n = 4) and (string.charAt(k + 10) and string.charAt(k + 11)) do not represent hexadecimal digits, throw URIError
at <global>.testFailed(/var/folders/vt/nrnb_cw95ps51fgmm9rq2mpw0000gn/T/test262-9xxwyt.js:289)
at <global>.$ERROR(/var/folders/vt/nrnb_cw95ps51fgmm9rq2mpw0000gn/T/test262-9xxwyt.js:305)
at <global>.<eval>(/var/folders/vt/nrnb_cw95ps51fgmm9rq2mpw0000gn/T/test262-9xxwyt.js:2194)
at org.dynjs.gen.Function13.call(Unknown Source)
at org.dynjs.runtime.ExecutionContext.call(ExecutionContext.java:139)
at org.dynjs.gen.Function17.call(Unknown Source)
at org.dynjs.runtime.ExecutionContext.call(ExecutionContext.java:139)
at org.dynjs.gen.ThenBlock56.call(Unknown Source)
at org.dynjs.gen.Program0.execute(Unknown Source)
at org.dynjs.runtime.ExecutionContext.execute(ExecutionContext.java:122)
at org.dynjs.runtime.DynJS.execute(DynJS.java:90)
at org.dynjs.runtime.DynJS.execute(DynJS.java:80)
at org.dynjs.runtime.DynJS.execute(DynJS.java:76)
at org.dynjs.cli.Main.executeFile(Main.java:73)
at org.dynjs.cli.Main.run(Main.java:60)
at org.dynjs.cli.Main.main(Main.java:46)
===
=== ch15/15.1/15.1.3/15.1.3.2/S15.1.3.2_A1.13_T1 failed in non-strict mode ===
--- errors ---
Exception in thread "main" org.dynjs.exception.ThrowException: #00C0-00DF
at <global>.testFailed(/var/folders/vt/nrnb_cw95ps51fgmm9rq2mpw0000gn/T/test262-kiyjM3.js:289)
at <global>.$ERROR(/var/folders/vt/nrnb_cw95ps51fgmm9rq2mpw0000gn/T/test262-kiyjM3.js:305)
at <global>.<eval>(/var/folders/vt/nrnb_cw95ps51fgmm9rq2mpw0000gn/T/test262-kiyjM3.js:2221)
at org.dynjs.gen.Function13.call(Unknown Source)
at org.dynjs.runtime.ExecutionContext.call(ExecutionContext.java:139)
at org.dynjs.gen.Function17.call(Unknown Source)
at org.dynjs.runtime.ExecutionContext.call(ExecutionContext.java:139)
at org.dynjs.gen.ThenBlock99.call(Unknown Source)
at org.dynjs.gen.ThenBlock98.call(Unknown Source)
at org.dynjs.gen.Program0.execute(Unknown Source)
at org.dynjs.runtime.ExecutionContext.execute(ExecutionContext.java:122)
at org.dynjs.runtime.DynJS.execute(DynJS.java:90)
at org.dynjs.runtime.DynJS.execute(DynJS.java:80)
at org.dynjs.runtime.DynJS.execute(DynJS.java:76)
at org.dynjs.cli.Main.executeFile(Main.java:73)
at org.dynjs.cli.Main.run(Main.java:60)
at org.dynjs.cli.Main.main(Main.java:46)
===
=== ch15/15.1/15.1.3/15.1.3.2/S15.1.3.2_A1.13_T2 failed in non-strict mode ===
--- errors ---
Exception in thread "main" org.dynjs.exception.ThrowException: #00C0-00DF
at <global>.testFailed(/var/folders/vt/nrnb_cw95ps51fgmm9rq2mpw0000gn/T/test262-xoM1vW.js:289)
at <global>.$ERROR(/var/folders/vt/nrnb_cw95ps51fgmm9rq2mpw0000gn/T/test262-xoM1vW.js:305)
at <global>.<eval>(/var/folders/vt/nrnb_cw95ps51fgmm9rq2mpw0000gn/T/test262-xoM1vW.js:2221)
at org.dynjs.gen.Function13.call(Unknown Source)
at org.dynjs.runtime.ExecutionContext.call(ExecutionContext.java:139)
at org.dynjs.gen.Function17.call(Unknown Source)
at org.dynjs.runtime.ExecutionContext.call(ExecutionContext.java:139)
at org.dynjs.gen.ThenBlock70.call(Unknown Source)
at org.dynjs.gen.ThenBlock69.call(Unknown Source)
at org.dynjs.gen.Program0.execute(Unknown Source)
at org.dynjs.runtime.ExecutionContext.execute(ExecutionContext.java:122)
at org.dynjs.runtime.DynJS.execute(DynJS.java:90)
at org.dynjs.runtime.DynJS.execute(DynJS.java:80)
at org.dynjs.runtime.DynJS.execute(DynJS.java:76)
at org.dynjs.cli.Main.executeFile(Main.java:73)
at org.dynjs.cli.Main.run(Main.java:60)
at org.dynjs.cli.Main.main(Main.java:46)
===
=== ch15/15.1/15.1.3/15.1.3.2/S15.1.3.2_A1.14_T1 failed in non-strict mode ===
--- errors ---
Exception in thread "main" org.dynjs.exception.ThrowException: java.lang.NumberFormatException: For input string: "0x.0E0"
at <global>.<eval>(/var/folders/vt/nrnb_cw95ps51fgmm9rq2mpw0000gn/T/test262-vH91ek.js:2182)
at org.dynjs.runtime.ExecutionContext.execute(ExecutionContext.java:126)
at org.dynjs.runtime.DynJS.execute(DynJS.java:90)
at org.dynjs.runtime.DynJS.execute(DynJS.java:80)
at org.dynjs.runtime.DynJS.execute(DynJS.java:76)
at org.dynjs.cli.Main.executeFile(Main.java:73)
at org.dynjs.cli.Main.run(Main.java:60)
at org.dynjs.cli.Main.main(Main.java:46)
Caused by: java.lang.NumberFormatException: For input string: "0x.0E0"
at sun.misc.FloatingDecimal.parseHexString(FloatingDecimal.java:1891)
at sun.misc.FloatingDecimal.readJavaFormatString(FloatingDecimal.java:1063)
at java.lang.Double.valueOf(Double.java:504)
at org.dynjs.gen.Program0.execute(Unknown Source)
at org.dynjs.runtime.ExecutionContext.execute(ExecutionContext.java:122)
... 6 more
===
=== ch15/15.1/15.1.3/15.1.3.2/S15.1.3.2_A1.14_T2 failed in non-strict mode ===
--- errors ---
Exception in thread "main" org.dynjs.exception.ThrowException: java.lang.NumberFormatException: For input string: "0x.0E0"
at <global>.<eval>(/var/folders/vt/nrnb_cw95ps51fgmm9rq2mpw0000gn/T/test262-wQTswq.js:2182)
at org.dynjs.runtime.ExecutionContext.execute(ExecutionContext.java:126)
at org.dynjs.runtime.DynJS.execute(DynJS.java:90)
at org.dynjs.runtime.DynJS.execute(DynJS.java:80)
at org.dynjs.runtime.DynJS.execute(DynJS.java:76)
at org.dynjs.cli.Main.executeFile(Main.java:73)
at org.dynjs.cli.Main.run(Main.java:60)
at org.dynjs.cli.Main.main(Main.java:46)
Caused by: java.lang.NumberFormatException: For input string: "0x.0E0"
at sun.misc.FloatingDecimal.parseHexString(FloatingDecimal.java:1891)
at sun.misc.FloatingDecimal.readJavaFormatString(FloatingDecimal.java:1063)
at java.lang.Double.valueOf(Double.java:504)
at org.dynjs.gen.Program0.execute(Unknown Source)
at org.dynjs.runtime.ExecutionContext.execute(ExecutionContext.java:122)
... 6 more
===
=== ch15/15.1/15.1.3/15.1.3.2/S15.1.3.2_A1.14_T3 failed in non-strict mode ===
--- errors ---
Exception in thread "main" org.dynjs.exception.ThrowException: java.lang.NumberFormatException: For input string: "0x.0E0"
at <global>.<eval>(/var/folders/vt/nrnb_cw95ps51fgmm9rq2mpw0000gn/T/test262-cwtT2E.js:2182)
at org.dynjs.runtime.ExecutionContext.execute(ExecutionContext.java:126)
at org.dynjs.runtime.DynJS.execute(DynJS.java:90)
at org.dynjs.runtime.DynJS.execute(DynJS.java:80)
at org.dynjs.runtime.DynJS.execute(DynJS.java:76)
at org.dynjs.cli.Main.executeFile(Main.java:73)
at org.dynjs.cli.Main.run(Main.java:60)
at org.dynjs.cli.Main.main(Main.java:46)
Caused by: java.lang.NumberFormatException: For input string: "0x.0E0"
at sun.misc.FloatingDecimal.parseHexString(FloatingDecimal.java:1891)
at sun.misc.FloatingDecimal.readJavaFormatString(FloatingDecimal.java:1063)
at java.lang.Double.valueOf(Double.java:504)
at org.dynjs.gen.Program0.execute(Unknown Source)
at org.dynjs.runtime.ExecutionContext.execute(ExecutionContext.java:122)
... 6 more
===
=== ch15/15.1/15.1.3/15.1.3.2/S15.1.3.2_A1.14_T4 failed in non-strict mode ===
--- errors ---
Exception in thread "main" org.dynjs.exception.ThrowException: java.lang.NumberFormatException: For input string: "0x.0E0"
at <global>.<eval>(/var/folders/vt/nrnb_cw95ps51fgmm9rq2mpw0000gn/T/test262-xfrTAX.js:2182)
at org.dynjs.runtime.ExecutionContext.execute(ExecutionContext.java:126)
at org.dynjs.runtime.DynJS.execute(DynJS.java:90)
at org.dynjs.runtime.DynJS.execute(DynJS.java:80)
at org.dynjs.runtime.DynJS.execute(DynJS.java:76)
at org.dynjs.cli.Main.executeFile(Main.java:73)
at org.dynjs.cli.Main.run(Main.java:60)
at org.dynjs.cli.Main.main(Main.java:46)
Caused by: java.lang.NumberFormatException: For input string: "0x.0E0"
at sun.misc.FloatingDecimal.parseHexString(FloatingDecimal.java:1891)
at sun.misc.FloatingDecimal.readJavaFormatString(FloatingDecimal.java:1063)
at java.lang.Double.valueOf(Double.java:504)
at org.dynjs.gen.Program0.execute(Unknown Source)
at org.dynjs.runtime.ExecutionContext.execute(ExecutionContext.java:122)
... 6 more
===
=== ch15/15.1/15.1.3/15.1.3.2/S15.1.3.2_A1.15_T1 failed in non-strict mode ===
--- errors ---
Exception in thread "main" org.dynjs.exception.ThrowException: #00F0-00F7
at <global>.testFailed(/var/folders/vt/nrnb_cw95ps51fgmm9rq2mpw0000gn/T/test262-rFO07a.js:289)
at <global>.$ERROR(/var/folders/vt/nrnb_cw95ps51fgmm9rq2mpw0000gn/T/test262-rFO07a.js:305)
at <global>.<eval>(/var/folders/vt/nrnb_cw95ps51fgmm9rq2mpw0000gn/T/test262-rFO07a.js:2221)
at org.dynjs.gen.Function13.call(Unknown Source)
at org.dynjs.runtime.ExecutionContext.call(ExecutionContext.java:139)
at org.dynjs.gen.Function17.call(Unknown Source)
at org.dynjs.runtime.ExecutionContext.call(ExecutionContext.java:139)
at org.dynjs.gen.ThenBlock67.call(Unknown Source)
at org.dynjs.gen.ThenBlock66.call(Unknown Source)
at org.dynjs.gen.Program0.execute(Unknown Source)
at org.dynjs.runtime.ExecutionContext.execute(ExecutionContext.java:122)
at org.dynjs.runtime.DynJS.execute(DynJS.java:90)
at org.dynjs.runtime.DynJS.execute(DynJS.java:80)
at org.dynjs.runtime.DynJS.execute(DynJS.java:76)
at org.dynjs.cli.Main.executeFile(Main.java:73)
at org.dynjs.cli.Main.run(Main.java:60)
at org.dynjs.cli.Main.main(Main.java:46)
===
=== ch15/15.1/15.1.3/15.1.3.2/S15.1.3.2_A1.15_T2 failed in non-strict mode ===
--- errors ---
Exception in thread "main" org.dynjs.exception.ThrowException: #00F0-00F7
at <global>.testFailed(/var/folders/vt/nrnb_cw95ps51fgmm9rq2mpw0000gn/T/test262-4_TzT0.js:289)
at <global>.$ERROR(/var/folders/vt/nrnb_cw95ps51fgmm9rq2mpw0000gn/T/test262-4_TzT0.js:305)
at <global>.<eval>(/var/folders/vt/nrnb_cw95ps51fgmm9rq2mpw0000gn/T/test262-4_TzT0.js:2221)
at org.dynjs.gen.Function13.call(Unknown Source)
at org.dynjs.runtime.ExecutionContext.call(ExecutionContext.java:139)
at org.dynjs.gen.Function17.call(Unknown Source)
at org.dynjs.runtime.ExecutionContext.call(ExecutionContext.java:139)
at org.dynjs.gen.ThenBlock47.call(Unknown Source)
at org.dynjs.gen.ThenBlock46.call(Unknown Source)
at org.dynjs.gen.Program0.execute(Unknown Source)
at org.dynjs.runtime.ExecutionContext.execute(ExecutionContext.java:122)
at org.dynjs.runtime.DynJS.execute(DynJS.java:90)
at org.dynjs.runtime.DynJS.execute(DynJS.java:80)
at org.dynjs.runtime.DynJS.execute(DynJS.java:76)
at org.dynjs.cli.Main.executeFile(Main.java:73)
at org.dynjs.cli.Main.run(Main.java:60)
at org.dynjs.cli.Main.main(Main.java:46)
===
=== ch15/15.1/15.1.3/15.1.3.2/S15.1.3.2_A1.15_T3 failed in non-strict mode ===
--- errors ---
Exception in thread "main" org.dynjs.exception.ThrowException: #00F0-00F7
at <global>.testFailed(/var/folders/vt/nrnb_cw95ps51fgmm9rq2mpw0000gn/T/test262-75_Pds.js:289)
at <global>.$ERROR(/var/folders/vt/nrnb_cw95ps51fgmm9rq2mpw0000gn/T/test262-75_Pds.js:305)
at <global>.<eval>(/var/folders/vt/nrnb_cw95ps51fgmm9rq2mpw0000gn/T/test262-75_Pds.js:2221)
at org.dynjs.gen.Function13.call(Unknown Source)
at org.dynjs.runtime.ExecutionContext.call(ExecutionContext.java:139)
at org.dynjs.gen.Function17.call(Unknown Source)
at org.dynjs.runtime.ExecutionContext.call(ExecutionContext.java:139)
at org.dynjs.gen.ThenBlock67.call(Unknown Source)
at org.dynjs.gen.ThenBlock66.call(Unknown Source)
at org.dynjs.gen.Program0.execute(Unknown Source)
at org.dynjs.runtime.ExecutionContext.execute(ExecutionContext.java:122)
at org.dynjs.runtime.DynJS.execute(DynJS.java:90)
at org.dynjs.runtime.DynJS.execute(DynJS.java:80)
at org.dynjs.runtime.DynJS.execute(DynJS.java:76)
at org.dynjs.cli.Main.executeFile(Main.java:73)
at org.dynjs.cli.Main.run(Main.java:60)
at org.dynjs.cli.Main.main(Main.java:46)
===
=== ch15/15.1/15.1.3/15.1.3.2/S15.1.3.2_A1.15_T4 failed in non-strict mode ===
--- errors ---
Exception in thread "main" org.dynjs.exception.ThrowException: #00F0-00F7
at <global>.testFailed(/var/folders/vt/nrnb_cw95ps51fgmm9rq2mpw0000gn/T/test262-Pj9xOQ.js:289)
at <global>.$ERROR(/var/folders/vt/nrnb_cw95ps51fgmm9rq2mpw0000gn/T/test262-Pj9xOQ.js:305)
at <global>.<eval>(/var/folders/vt/nrnb_cw95ps51fgmm9rq2mpw0000gn/T/test262-Pj9xOQ.js:2221)
at org.dynjs.gen.Function13.call(Unknown Source)
at org.dynjs.runtime.ExecutionContext.call(ExecutionContext.java:139)
at org.dynjs.gen.Function17.call(Unknown Source)
at org.dynjs.runtime.ExecutionContext.call(ExecutionContext.java:139)
at org.dynjs.gen.ThenBlock54.call(Unknown Source)
at org.dynjs.gen.ThenBlock53.call(Unknown Source)
at org.dynjs.gen.Program0.execute(Unknown Source)
at org.dynjs.runtime.ExecutionContext.execute(ExecutionContext.java:122)
at org.dynjs.runtime.DynJS.execute(DynJS.java:90)
at org.dynjs.runtime.DynJS.execute(DynJS.java:80)
at org.dynjs.runtime.DynJS.execute(DynJS.java:76)
at org.dynjs.cli.Main.executeFile(Main.java:73)
at org.dynjs.cli.Main.run(Main.java:60)
at org.dynjs.cli.Main.main(Main.java:46)
===
=== ch15/15.1/15.1.3/15.1.3.2/S15.1.3.2_A1.15_T5 failed in non-strict mode ===
--- errors ---
Exception in thread "main" org.dynjs.exception.ThrowException: #00F0-00F7
at <global>.testFailed(/var/folders/vt/nrnb_cw95ps51fgmm9rq2mpw0000gn/T/test262-NFdIKX.js:289)
at <global>.$ERROR(/var/folders/vt/nrnb_cw95ps51fgmm9rq2mpw0000gn/T/test262-NFdIKX.js:305)
at <global>.<eval>(/var/folders/vt/nrnb_cw95ps51fgmm9rq2mpw0000gn/T/test262-NFdIKX.js:2221)
at org.dynjs.gen.Function13.call(Unknown Source)
at org.dynjs.runtime.ExecutionContext.call(ExecutionContext.java:139)
at org.dynjs.gen.Function17.call(Unknown Source)
at org.dynjs.runtime.ExecutionContext.call(ExecutionContext.java:139)
at org.dynjs.gen.ThenBlock53.call(Unknown Source)
at org.dynjs.gen.ThenBlock52.call(Unknown Source)
at org.dynjs.gen.Program0.execute(Unknown Source)
at org.dynjs.runtime.ExecutionContext.execute(ExecutionContext.java:122)
at org.dynjs.runtime.DynJS.execute(DynJS.java:90)
at org.dynjs.runtime.DynJS.execute(DynJS.java:80)
at org.dynjs.runtime.DynJS.execute(DynJS.java:76)
at org.dynjs.cli.Main.executeFile(Main.java:73)
at org.dynjs.cli.Main.run(Main.java:60)
at org.dynjs.cli.Main.main(Main.java:46)
===
=== ch15/15.1/15.1.3/15.1.3.2/S15.1.3.2_A1.15_T6 failed in non-strict mode ===
--- errors ---
Exception in thread "main" org.dynjs.exception.ThrowException: #00F0-00F7
at <global>.testFailed(/var/folders/vt/nrnb_cw95ps51fgmm9rq2mpw0000gn/T/test262-iJGjcs.js:289)
at <global>.$ERROR(/var/folders/vt/nrnb_cw95ps51fgmm9rq2mpw0000gn/T/test262-iJGjcs.js:305)
at <global>.<eval>(/var/folders/vt/nrnb_cw95ps51fgmm9rq2mpw0000gn/T/test262-iJGjcs.js:2221)
at org.dynjs.gen.Function13.call(Unknown Source)
at org.dynjs.runtime.ExecutionContext.call(ExecutionContext.java:139)
at org.dynjs.gen.Function17.call(Unknown Source)
at org.dynjs.runtime.ExecutionContext.call(ExecutionContext.java:139)
at org.dynjs.gen.ThenBlock53.call(Unknown Source)
at org.dynjs.gen.ThenBlock52.call(Unknown Source)
at org.dynjs.gen.Program0.execute(Unknown Source)
at org.dynjs.runtime.ExecutionContext.execute(ExecutionContext.java:122)
at org.dynjs.runtime.DynJS.execute(DynJS.java:90)
at org.dynjs.runtime.DynJS.execute(DynJS.java:80)
at org.dynjs.runtime.DynJS.execute(DynJS.java:76)
at org.dynjs.cli.Main.executeFile(Main.java:73)
at org.dynjs.cli.Main.run(Main.java:60)
at org.dynjs.cli.Main.main(Main.java:46)
===
=== ch15/15.1/15.1.3/15.1.3.2/S15.1.3.2_A1.1_T1 failed in non-strict mode ===
--- errors ---
Exception in thread "main" org.dynjs.exception.ThrowException: #1: If string.charAt(k) equal "%" and k + 2 >= string.length, throw URIError
at <global>.testFailed(/var/folders/vt/nrnb_cw95ps51fgmm9rq2mpw0000gn/T/test262-QICjzj.js:289)
at <global>.$ERROR(/var/folders/vt/nrnb_cw95ps51fgmm9rq2mpw0000gn/T/test262-QICjzj.js:305)
at <global>.<eval>(/var/folders/vt/nrnb_cw95ps51fgmm9rq2mpw0000gn/T/test262-QICjzj.js:2220)
at org.dynjs.gen.Function13.call(Unknown Source)
at org.dynjs.runtime.ExecutionContext.call(ExecutionContext.java:139)
at org.dynjs.gen.Function17.call(Unknown Source)
at org.dynjs.runtime.ExecutionContext.call(ExecutionContext.java:139)
at org.dynjs.gen.ThenBlock32.call(Unknown Source)
at org.dynjs.gen.Program0.execute(Unknown Source)
at org.dynjs.runtime.ExecutionContext.execute(ExecutionContext.java:122)
at org.dynjs.runtime.DynJS.execute(DynJS.java:90)
at org.dynjs.runtime.DynJS.execute(DynJS.java:80)
at org.dynjs.runtime.DynJS.execute(DynJS.java:76)
at org.dynjs.cli.Main.executeFile(Main.java:73)
at org.dynjs.cli.Main.run(Main.java:60)
at org.dynjs.cli.Main.main(Main.java:46)
===
=== ch15/15.1/15.1.3/15.1.3.2/S15.1.3.2_A1.2_T1 failed in non-strict mode ===
--- errors ---
Exception in thread "main" org.dynjs.exception.ThrowException: #1: If string.charAt(k+1) does not represent hexadecimal digits, throw URIError
at <global>.testFailed(/var/folders/vt/nrnb_cw95ps51fgmm9rq2mpw0000gn/T/test262-6w2Gfd.js:289)
at <global>.$ERROR(/var/folders/vt/nrnb_cw95ps51fgmm9rq2mpw0000gn/T/test262-6w2Gfd.js:305)
at <global>.<eval>(/var/folders/vt/nrnb_cw95ps51fgmm9rq2mpw0000gn/T/test262-6w2Gfd.js:2194)
at org.dynjs.gen.Function13.call(Unknown Source)
at org.dynjs.runtime.ExecutionContext.call(ExecutionContext.java:139)
at org.dynjs.gen.Function17.call(Unknown Source)
at org.dynjs.runtime.ExecutionContext.call(ExecutionContext.java:139)
at org.dynjs.gen.ThenBlock45.call(Unknown Source)
at org.dynjs.gen.Program0.execute(Unknown Source)
at org.dynjs.runtime.ExecutionContext.execute(ExecutionContext.java:122)
at org.dynjs.runtime.DynJS.execute(DynJS.java:90)
at org.dynjs.runtime.DynJS.execute(DynJS.java:80)
at org.dynjs.runtime.DynJS.execute(DynJS.java:76)
at org.dynjs.cli.Main.executeFile(Main.java:73)
at org.dynjs.cli.Main.run(Main.java:60)
at org.dynjs.cli.Main.main(Main.java:46)
===
=== ch15/15.1/15.1.3/15.1.3.2/S15.1.3.2_A1.2_T2 failed in non-strict mode ===
--- errors ---
Exception in thread "main" org.dynjs.exception.ThrowException: #1: If string.charAt(k+2) does not represent hexadecimal digits, throw URIError
at <global>.testFailed(/var/folders/vt/nrnb_cw95ps51fgmm9rq2mpw0000gn/T/test262-feCjIB.js:289)
at <global>.$ERROR(/var/folders/vt/nrnb_cw95ps51fgmm9rq2mpw0000gn/T/test262-feCjIB.js:305)
at <global>.<eval>(/var/folders/vt/nrnb_cw95ps51fgmm9rq2mpw0000gn/T/test262-feCjIB.js:2194)
at org.dynjs.gen.Function13.call(Unknown Source)
at org.dynjs.runtime.ExecutionContext.call(ExecutionContext.java:139)
at org.dynjs.gen.Function17.call(Unknown Source)
at org.dynjs.runtime.ExecutionContext.call(ExecutionContext.java:139)
at org.dynjs.gen.ThenBlock45.call(Unknown Source)
at org.dynjs.gen.Program0.execute(Unknown Source)
at org.dynjs.runtime.ExecutionContext.execute(ExecutionContext.java:122)
at org.dynjs.runtime.DynJS.execute(DynJS.java:90)
at org.dynjs.runtime.DynJS.execute(DynJS.java:80)
at org.dynjs.runtime.DynJS.execute(DynJS.java:76)
at org.dynjs.cli.Main.executeFile(Main.java:73)
at org.dynjs.cli.Main.run(Main.java:60)
at org.dynjs.cli.Main.main(Main.java:46)
===
=== ch15/15.1/15.1.3/15.1.3.2/S15.1.3.2_A1.3_T1 failed in non-strict mode ===
--- errors ---
Exception in thread "main" org.dynjs.exception.ThrowException: #0080-00BF
at <global>.testFailed(/var/folders/vt/nrnb_cw95ps51fgmm9rq2mpw0000gn/T/test262-NCDD7d.js:289)
at <global>.$ERROR(/var/folders/vt/nrnb_cw95ps51fgmm9rq2mpw0000gn/T/test262-NCDD7d.js:305)
at <global>.<eval>(/var/folders/vt/nrnb_cw95ps51fgmm9rq2mpw0000gn/T/test262-NCDD7d.js:2214)
at org.dynjs.gen.Function13.call(Unknown Source)
at org.dynjs.runtime.ExecutionContext.call(ExecutionContext.java:139)
at org.dynjs.gen.Function17.call(Unknown Source)
at org.dynjs.runtime.ExecutionContext.call(ExecutionContext.java:139)
at org.dynjs.gen.ThenBlock41.call(Unknown Source)
at org.dynjs.gen.ThenBlock40.call(Unknown Source)
at org.dynjs.gen.Program0.execute(Unknown Source)
at org.dynjs.runtime.ExecutionContext.execute(ExecutionContext.java:122)
at org.dynjs.runtime.DynJS.execute(DynJS.java:90)
at org.dynjs.runtime.DynJS.execute(DynJS.java:80)
at org.dynjs.runtime.DynJS.execute(DynJS.java:76)
at org.dynjs.cli.Main.executeFile(Main.java:73)
at org.dynjs.cli.Main.run(Main.java:60)
at org.dynjs.cli.Main.main(Main.java:46)
===
=== ch15/15.1/15.1.3/15.1.3.2/S15.1.3.2_A1.3_T2 failed in non-strict mode ===
--- errors ---
Exception in thread "main" org.dynjs.exception.ThrowException: #00F8-00FF
at <global>.testFailed(/var/folders/vt/nrnb_cw95ps51fgmm9rq2mpw0000gn/T/test262-fO4BP8.js:289)
at <global>.$ERROR(/var/folders/vt/nrnb_cw95ps51fgmm9rq2mpw0000gn/T/test262-fO4BP8.js:305)
at <global>.<eval>(/var/folders/vt/nrnb_cw95ps51fgmm9rq2mpw0000gn/T/test262-fO4BP8.js:2214)
at org.dynjs.gen.Function13.call(Unknown Source)
at org.dynjs.runtime.ExecutionContext.call(ExecutionContext.java:139)
at org.dynjs.gen.Function17.call(Unknown Source)
at org.dynjs.runtime.ExecutionContext.call(ExecutionContext.java:139)
at org.dynjs.gen.ThenBlock38.call(Unknown Source)
at org.dynjs.gen.ThenBlock37.call(Unknown Source)
at org.dynjs.gen.Program0.execute(Unknown Source)
at org.dynjs.runtime.ExecutionContext.execute(ExecutionContext.java:122)
at org.dynjs.runtime.DynJS.execute(DynJS.java:90)
at org.dynjs.runtime.DynJS.execute(DynJS.java:80)
at org.dynjs.runtime.DynJS.execute(DynJS.java:76)
at org.dynjs.cli.Main.executeFile(Main.java:73)
at org.dynjs.cli.Main.run(Main.java:60)
at org.dynjs.cli.Main.main(Main.java:46)
===
=== ch15/15.1/15.1.3/15.1.3.2/S15.1.3.2_A1.4_T1 failed in non-strict mode ===
--- errors ---
Exception in thread "main" org.dynjs.exception.ThrowException: #00C0-00DF
at <global>.testFailed(/var/folders/vt/nrnb_cw95ps51fgmm9rq2mpw0000gn/T/test262-3BtFjD.js:289)
at <global>.$ERROR(/var/folders/vt/nrnb_cw95ps51fgmm9rq2mpw0000gn/T/test262-3BtFjD.js:305)
at <global>.<eval>(/var/folders/vt/nrnb_cw95ps51fgmm9rq2mpw0000gn/T/test262-3BtFjD.js:2222)
at org.dynjs.gen.Function13.call(Unknown Source)
at org.dynjs.runtime.ExecutionContext.call(ExecutionContext.java:139)
at org.dynjs.gen.Function17.call(Unknown Source)
at org.dynjs.runtime.ExecutionContext.call(ExecutionContext.java:139)
at org.dynjs.gen.ThenBlock40.call(Unknown Source)
at org.dynjs.gen.ThenBlock39.call(Unknown Source)
at org.dynjs.gen.Program0.execute(Unknown Source)
at org.dynjs.runtime.ExecutionContext.execute(ExecutionContext.java:122)
at org.dynjs.runtime.DynJS.execute(DynJS.java:90)
at org.dynjs.runtime.DynJS.execute(DynJS.java:80)
at org.dynjs.runtime.DynJS.execute(DynJS.java:76)
at org.dynjs.cli.Main.executeFile(Main.java:73)
at org.dynjs.cli.Main.run(Main.java:60)
at org.dynjs.cli.Main.main(Main.java:46)
===
=== ch15/15.1/15.1.3/15.1.3.2/S15.1.3.2_A1.5_T1 failed in non-strict mode ===
--- errors ---
Exception in thread "main" org.dynjs.exception.ThrowException: java.lang.NumberFormatException: For input string: "0x.0E0"
at <global>.<eval>(/var/folders/vt/nrnb_cw95ps51fgmm9rq2mpw0000gn/T/test262-EPuBXo.js:2182)
at org.dynjs.runtime.ExecutionContext.execute(ExecutionContext.java:126)
at org.dynjs.runtime.DynJS.execute(DynJS.java:90)
at org.dynjs.runtime.DynJS.execute(DynJS.java:80)
at org.dynjs.runtime.DynJS.execute(DynJS.java:76)
at org.dynjs.cli.Main.executeFile(Main.java:73)
at org.dynjs.cli.Main.run(Main.java:60)
at org.dynjs.cli.Main.main(Main.java:46)
Caused by: java.lang.NumberFormatException: For input string: "0x.0E0"
at sun.misc.FloatingDecimal.parseHexString(FloatingDecimal.java:1891)
at sun.misc.FloatingDecimal.readJavaFormatString(FloatingDecimal.java:1063)
at java.lang.Double.valueOf(Double.java:504)
at org.dynjs.gen.Program0.execute(Unknown Source)
at org.dynjs.runtime.ExecutionContext.execute(ExecutionContext.java:122)
... 6 more
===
=== ch15/15.1/15.1.3/15.1.3.2/S15.1.3.2_A1.6_T1 failed in non-strict mode ===
--- errors ---
Exception in thread "main" org.dynjs.exception.ThrowException: #00F0-00F7
at <global>.testFailed(/var/folders/vt/nrnb_cw95ps51fgmm9rq2mpw0000gn/T/test262-0zOzYl.js:289)
at <global>.$ERROR(/var/folders/vt/nrnb_cw95ps51fgmm9rq2mpw0000gn/T/test262-0zOzYl.js:305)
at <global>.<eval>(/var/folders/vt/nrnb_cw95ps51fgmm9rq2mpw0000gn/T/test262-0zOzYl.js:2222)
at org.dynjs.gen.Function13.call(Unknown Source)
at org.dynjs.runtime.ExecutionContext.call(ExecutionContext.java:139)
at org.dynjs.gen.Function17.call(Unknown Source)
at org.dynjs.runtime.ExecutionContext.call(ExecutionContext.java:139)
at org.dynjs.gen.ThenBlock35.call(Unknown Source)
at org.dynjs.gen.ThenBlock34.call(Unknown Source)
at org.dynjs.gen.Program0.execute(Unknown Source)
at org.dynjs.runtime.ExecutionContext.execute(ExecutionContext.java:122)
at org.dynjs.runtime.DynJS.execute(DynJS.java:90)
at org.dynjs.runtime.DynJS.execute(DynJS.java:80)
at org.dynjs.runtime.DynJS.execute(DynJS.java:76)
at org.dynjs.cli.Main.executeFile(Main.java:73)
at org.dynjs.cli.Main.run(Main.java:60)
at org.dynjs.cli.Main.main(Main.java:46)
===
=== ch15/15.1/15.1.3/15.1.3.2/S15.1.3.2_A1.7_T1 failed in non-strict mode ===
--- errors ---
Exception in thread "main" org.dynjs.exception.ThrowException: #00C0-00DF
at <global>.testFailed(/var/folders/vt/nrnb_cw95ps51fgmm9rq2mpw0000gn/T/test262-hE7_w3.js:289)
at <global>.$ERROR(/var/folders/vt/nrnb_cw95ps51fgmm9rq2mpw0000gn/T/test262-hE7_w3.js:305)
at <global>.<eval>(/var/folders/vt/nrnb_cw95ps51fgmm9rq2mpw0000gn/T/test262-hE7_w3.js:2214)
at org.dynjs.gen.Function13.call(Unknown Source)
at org.dynjs.runtime.ExecutionContext.call(ExecutionContext.java:139)
at org.dynjs.gen.Function17.call(Unknown Source)
at org.dynjs.runtime.ExecutionContext.call(ExecutionContext.java:139)
at org.dynjs.gen.ThenBlock38.call(Unknown Source)
at org.dynjs.gen.ThenBlock37.call(Unknown Source)
at org.dynjs.gen.Program0.execute(Unknown Source)
at org.dynjs.runtime.ExecutionContext.execute(ExecutionContext.java:122)
at org.dynjs.runtime.DynJS.execute(DynJS.java:90)
at org.dynjs.runtime.DynJS.execute(DynJS.java:80)
at org.dynjs.runtime.DynJS.execute(DynJS.java:76)
at org.dynjs.cli.Main.executeFile(Main.java:73)
at org.dynjs.cli.Main.run(Main.java:60)
at org.dynjs.cli.Main.main(Main.java:46)
===
=== ch15/15.1/15.1.3/15.1.3.2/S15.1.3.2_A1.8_T1 failed in non-strict mode ===
--- errors ---
Exception in thread "main" org.dynjs.exception.ThrowException: java.lang.NumberFormatException: For input string: "0x.0E0"
at <global>.<eval>(/var/folders/vt/nrnb_cw95ps51fgmm9rq2mpw0000gn/T/test262-0aWFp1.js:2182)
at org.dynjs.runtime.ExecutionContext.execute(ExecutionContext.java:126)
at org.dynjs.runtime.DynJS.execute(DynJS.java:90)
at org.dynjs.runtime.DynJS.execute(DynJS.java:80)
at org.dynjs.runtime.DynJS.execute(DynJS.java:76)
at org.dynjs.cli.Main.executeFile(Main.java:73)
at org.dynjs.cli.Main.run(Main.java:60)
at org.dynjs.cli.Main.main(Main.java:46)
Caused by: java.lang.NumberFormatException: For input string: "0x.0E0"
at sun.misc.FloatingDecimal.parseHexString(FloatingDecimal.java:1891)
at sun.misc.FloatingDecimal.readJavaFormatString(FloatingDecimal.java:1063)
at java.lang.Double.valueOf(Double.java:504)
at org.dynjs.gen.Program0.execute(Unknown Source)
at org.dynjs.runtime.ExecutionContext.execute(ExecutionContext.java:122)
... 6 more
===
=== ch15/15.1/15.1.3/15.1.3.2/S15.1.3.2_A1.8_T2 failed in non-strict mode ===
--- errors ---
Exception in thread "main" org.dynjs.exception.ThrowException: java.lang.NumberFormatException: For input string: "0x.0E0"
at <global>.<eval>(/var/folders/vt/nrnb_cw95ps51fgmm9rq2mpw0000gn/T/test262-7ivDAN.js:2182)
at org.dynjs.runtime.ExecutionContext.execute(ExecutionContext.java:126)
at org.dynjs.runtime.DynJS.execute(DynJS.java:90)
at org.dynjs.runtime.DynJS.execute(DynJS.java:80)
at org.dynjs.runtime.DynJS.execute(DynJS.java:76)
at org.dynjs.cli.Main.executeFile(Main.java:73)
at org.dynjs.cli.Main.run(Main.java:60)
at org.dynjs.cli.Main.main(Main.java:46)
Caused by: java.lang.NumberFormatException: For input string: "0x.0E0"
at sun.misc.FloatingDecimal.parseHexString(FloatingDecimal.java:1891)
at sun.misc.FloatingDecimal.readJavaFormatString(FloatingDecimal.java:1063)
at java.lang.Double.valueOf(Double.java:504)
at org.dynjs.gen.Program0.execute(Unknown Source)
at org.dynjs.runtime.ExecutionContext.execute(ExecutionContext.java:122)
... 6 more
===
=== ch15/15.1/15.1.3/15.1.3.2/S15.1.3.2_A1.9_T1 failed in non-strict mode ===
--- errors ---
Exception in thread "main" org.dynjs.exception.ThrowException: #00F0-00F7
at <global>.testFailed(/var/folders/vt/nrnb_cw95ps51fgmm9rq2mpw0000gn/T/test262-_IUihV.js:289)
at <global>.$ERROR(/var/folders/vt/nrnb_cw95ps51fgmm9rq2mpw0000gn/T/test262-_IUihV.js:305)
at <global>.<eval>(/var/folders/vt/nrnb_cw95ps51fgmm9rq2mpw0000gn/T/test262-_IUihV.js:2214)
at org.dynjs.gen.Function13.call(Unknown Source)
at org.dynjs.runtime.ExecutionContext.call(ExecutionContext.java:139)
at org.dynjs.gen.Function17.call(Unknown Source)
at org.dynjs.runtime.ExecutionContext.call(ExecutionContext.java:139)
at org.dynjs.gen.ThenBlock33.call(Unknown Source)
at org.dynjs.gen.ThenBlock32.call(Unknown Source)
at org.dynjs.gen.Program0.execute(Unknown Source)
at org.dynjs.runtime.ExecutionContext.execute(ExecutionContext.java:122)
at org.dynjs.runtime.DynJS.execute(DynJS.java:90)
at org.dynjs.runtime.DynJS.execute(DynJS.java:80)
at org.dynjs.runtime.DynJS.execute(DynJS.java:76)
at org.dynjs.cli.Main.executeFile(Main.java:73)
at org.dynjs.cli.Main.run(Main.java:60)
at org.dynjs.cli.Main.main(Main.java:46)
===
=== ch15/15.1/15.1.3/15.1.3.2/S15.1.3.2_A1.9_T2 failed in non-strict mode ===
--- errors ---
Exception in thread "main" org.dynjs.exception.ThrowException: #00F0-00F7
at <global>.testFailed(/var/folders/vt/nrnb_cw95ps51fgmm9rq2mpw0000gn/T/test262-pwPeR0.js:289)
at <global>.$ERROR(/var/folders/vt/nrnb_cw95ps51fgmm9rq2mpw0000gn/T/test262-pwPeR0.js:305)
at <global>.<eval>(/var/folders/vt/nrnb_cw95ps51fgmm9rq2mpw0000gn/T/test262-pwPeR0.js:2214)
at org.dynjs.gen.Function13.call(Unknown Source)
at org.dynjs.runtime.ExecutionContext.call(ExecutionContext.java:139)
at org.dynjs.gen.Function17.call(Unknown Source)
at org.dynjs.runtime.ExecutionContext.call(ExecutionContext.java:139)
at org.dynjs.gen.ThenBlock33.call(Unknown Source)
at org.dynjs.gen.ThenBlock32.call(Unknown Source)
at org.dynjs.gen.Program0.execute(Unknown Source)
at org.dynjs.runtime.ExecutionContext.execute(ExecutionContext.java:122)
at org.dynjs.runtime.DynJS.execute(DynJS.java:90)
at org.dynjs.runtime.DynJS.execute(DynJS.java:80)
at org.dynjs.runtime.DynJS.execute(DynJS.java:76)
at org.dynjs.cli.Main.executeFile(Main.java:73)
at org.dynjs.cli.Main.run(Main.java:60)
at org.dynjs.cli.Main.main(Main.java:46)
===
=== ch15/15.1/15.1.3/15.1.3.2/S15.1.3.2_A1.9_T3 failed in non-strict mode ===
--- errors ---
Exception in thread "main" org.dynjs.exception.ThrowException: #00F0-00F7
at <global>.testFailed(/var/folders/vt/nrnb_cw95ps51fgmm9rq2mpw0000gn/T/test262-2666n0.js:289)
at <global>.$ERROR(/var/folders/vt/nrnb_cw95ps51fgmm9rq2mpw0000gn/T/test262-2666n0.js:305)
at <global>.<eval>(/var/folders/vt/nrnb_cw95ps51fgmm9rq2mpw0000gn/T/test262-2666n0.js:2214)
at org.dynjs.gen.Function13.call(Unknown Source)
at org.dynjs.runtime.ExecutionContext.call(ExecutionContext.java:139)
at org.dynjs.gen.Function17.call(Unknown Source)
at org.dynjs.runtime.ExecutionContext.call(ExecutionContext.java:139)
at org.dynjs.gen.ThenBlock33.call(Unknown Source)
at org.dynjs.gen.ThenBlock32.call(Unknown Source)
at org.dynjs.gen.Program0.execute(Unknown Source)
at org.dynjs.runtime.ExecutionContext.execute(ExecutionContext.java:122)
at org.dynjs.runtime.DynJS.execute(DynJS.java:90)
at org.dynjs.runtime.DynJS.execute(DynJS.java:80)
at org.dynjs.runtime.DynJS.execute(DynJS.java:76)
at org.dynjs.cli.Main.executeFile(Main.java:73)
at org.dynjs.cli.Main.run(Main.java:60)
at org.dynjs.cli.Main.main(Main.java:46)
===
=== ch15/15.1/15.1.3/15.1.3.2/S15.1.3.2_A2.1_T1 failed in non-strict mode ===
--- errors ---
Exception in thread "main" org.dynjs.exception.ThrowException: #0000
at <global>.testFailed(/var/folders/vt/nrnb_cw95ps51fgmm9rq2mpw0000gn/T/test262-Q7T0E1.js:289)
at <global>.$ERROR(/var/folders/vt/nrnb_cw95ps51fgmm9rq2mpw0000gn/T/test262-Q7T0E1.js:305)
at <global>.<eval>(/var/folders/vt/nrnb_cw95ps51fgmm9rq2mpw0000gn/T/test262-Q7T0E1.js:2190)
at org.dynjs.gen.Function13.call(Unknown Source)
at org.dynjs.runtime.ExecutionContext.call(ExecutionContext.java:139)
at org.dynjs.gen.Function17.call(Unknown Source)
at org.dynjs.runtime.ExecutionContext.call(ExecutionContext.java:139)
at org.dynjs.gen.CatchBlock25.call(Unknown Source)
at org.dynjs.runtime.ExecutionContext.executeCatch(ExecutionContext.java:235)
at org.dynjs.gen.ThenBlock21.call(Unknown Source)
at org.dynjs.gen.ForBlock20.call(Unknown Source)
at org.dynjs.gen.Program0.execute(Unknown Source)
at org.dynjs.runtime.ExecutionContext.execute(ExecutionContext.java:122)
at org.dynjs.runtime.DynJS.execute(DynJS.java:90)
at org.dynjs.runtime.DynJS.execute(DynJS.java:80)
at org.dynjs.runtime.DynJS.execute(DynJS.java:76)
at org.dynjs.cli.Main.executeFile(Main.java:73)
at org.dynjs.cli.Main.run(Main.java:60)
at org.dynjs.cli.Main.main(Main.java:46)
===
=== ch15/15.1/15.1.3/15.1.3.2/S15.1.3.2_A2.2_T1 failed in non-strict mode ===
--- errors ---
Exception in thread "main" org.dynjs.exception.ThrowException: #0001-007F
at <global>.testFailed(/var/folders/vt/nrnb_cw95ps51fgmm9rq2mpw0000gn/T/test262-QaHKoD.js:289)
at <global>.$ERROR(/var/folders/vt/nrnb_cw95ps51fgmm9rq2mpw0000gn/T/test262-QaHKoD.js:305)
at <global>.<eval>(/var/folders/vt/nrnb_cw95ps51fgmm9rq2mpw0000gn/T/test262-QaHKoD.js:2215)
at org.dynjs.gen.Function13.call(Unknown Source)
at org.dynjs.runtime.ExecutionContext.call(ExecutionContext.java:139)
at org.dynjs.gen.Function17.call(Unknown Source)
at org.dynjs.runtime.ExecutionContext.call(ExecutionContext.java:139)
at org.dynjs.gen.ThenBlock41.call(Unknown Source)
at org.dynjs.gen.ThenBlock40.call(Unknown Source)
at org.dynjs.gen.Program0.execute(Unknown Source)
at org.dynjs.runtime.ExecutionContext.execute(ExecutionContext.java:122)
at org.dynjs.runtime.DynJS.execute(DynJS.java:90)
at org.dynjs.runtime.DynJS.execute(DynJS.java:80)
at org.dynjs.runtime.DynJS.execute(DynJS.java:76)
at org.dynjs.cli.Main.executeFile(Main.java:73)
at org.dynjs.cli.Main.run(Main.java:60)
at org.dynjs.cli.Main.main(Main.java:46)
===
=== ch15/15.1/15.1.3/15.1.3.2/S15.1.3.2_A2.3_T1 failed in non-strict mode ===
--- errors ---
Exception in thread "main" org.dynjs.exception.ThrowException: #0080-07FF
at <global>.testFailed(/var/folders/vt/nrnb_cw95ps51fgmm9rq2mpw0000gn/T/test262-1nYzU0.js:289)
at <global>.$ERROR(/var/folders/vt/nrnb_cw95ps51fgmm9rq2mpw0000gn/T/test262-1nYzU0.js:305)
at <global>.<eval>(/var/folders/vt/nrnb_cw95ps51fgmm9rq2mpw0000gn/T/test262-1nYzU0.js:2218)
at org.dynjs.gen.Function13.call(Unknown Source)
at org.dynjs.runtime.ExecutionContext.call(ExecutionContext.java:139)
at org.dynjs.gen.Function17.call(Unknown Source)
at org.dynjs.runtime.ExecutionContext.call(ExecutionContext.java:139)
at org.dynjs.gen.ThenBlock70.call(Unknown Source)
at org.dynjs.gen.ThenBlock69.call(Unknown Source)
at org.dynjs.gen.Program0.execute(Unknown Source)
at org.dynjs.runtime.ExecutionContext.execute(ExecutionContext.java:122)
at org.dynjs.runtime.DynJS.execute(DynJS.java:90)
at org.dynjs.runtime.DynJS.execute(DynJS.java:80)
at org.dynjs.runtime.DynJS.execute(DynJS.java:76)
at org.dynjs.cli.Main.executeFile(Main.java:73)
at org.dynjs.cli.Main.run(Main.java:60)
at org.dynjs.cli.Main.main(Main.java:46)
===
=== ch15/15.1/15.1.3/15.1.3.2/S15.1.3.2_A2.4_T1 failed in non-strict mode ===
--- errors ---
Exception in thread "main" org.dynjs.exception.ThrowException: java.lang.NumberFormatException: For input string: "0x.0E0"
at <global>.<eval>(/var/folders/vt/nrnb_cw95ps51fgmm9rq2mpw0000gn/T/test262-3JIQWB.js:2182)
at org.dynjs.runtime.ExecutionContext.execute(ExecutionContext.java:126)
at org.dynjs.runtime.DynJS.execute(DynJS.java:90)
at org.dynjs.runtime.DynJS.execute(DynJS.java:80)
at org.dynjs.runtime.DynJS.execute(DynJS.java:76)
at org.dynjs.cli.Main.executeFile(Main.java:73)
at org.dynjs.cli.Main.run(Main.java:60)
at org.dynjs.cli.Main.main(Main.java:46)
Caused by: java.lang.NumberFormatException: For input string: "0x.0E0"
at sun.misc.FloatingDecimal.parseHexString(FloatingDecimal.java:1891)
at sun.misc.FloatingDecimal.readJavaFormatString(FloatingDecimal.java:1063)
at java.lang.Double.valueOf(Double.java:504)
at org.dynjs.gen.Program0.execute(Unknown Source)
at org.dynjs.runtime.ExecutionContext.execute(ExecutionContext.java:122)
... 6 more
===
=== ch15/15.1/15.1.3/15.1.3.2/S15.1.3.2_A2.5_T1 failed in non-strict mode ===
--- errors ---
Exception in thread "main" org.dynjs.exception.ThrowException: #20000-FFFF
at <global>.testFailed(/var/folders/vt/nrnb_cw95ps51fgmm9rq2mpw0000gn/T/test262-4UxRPd.js:289)
at <global>.$ERROR(/var/folders/vt/nrnb_cw95ps51fgmm9rq2mpw0000gn/T/test262-4UxRPd.js:305)
at <global>.<eval>(/var/folders/vt/nrnb_cw95ps51fgmm9rq2mpw0000gn/T/test262-4UxRPd.js:2228)
at org.dynjs.gen.Function13.call(Unknown Source)
at org.dynjs.runtime.ExecutionContext.call(ExecutionContext.java:139)
at org.dynjs.gen.Function17.call(Unknown Source)
at org.dynjs.runtime.ExecutionContext.call(ExecutionContext.java:139)
at org.dynjs.gen.ThenBlock3010.call(Unknown Source)
at org.dynjs.gen.ThenBlock3009.call(Unknown Source)
at org.dynjs.gen.Program0.execute(Unknown Source)
at org.dynjs.runtime.ExecutionContext.execute(ExecutionContext.java:122)
at org.dynjs.runtime.DynJS.execute(DynJS.java:90)
at org.dynjs.runtime.DynJS.execute(DynJS.java:80)
at org.dynjs.runtime.DynJS.execute(DynJS.java:76)
at org.dynjs.cli.Main.executeFile(Main.java:73)
at org.dynjs.cli.Main.run(Main.java:60)
at org.dynjs.cli.Main.main(Main.java:46)
===
=== ch15/15.1/15.1.3/15.1.3.2/S15.1.3.2_A3_T1 failed in non-strict mode ===
--- errors ---
Exception in thread "main" org.dynjs.exception.ThrowException: ReferenceError: decodeURIComponent is not defined
at <global>.<eval>(/var/folders/vt/nrnb_cw95ps51fgmm9rq2mpw0000gn/T/test262-6AynRk.js:2178)
at org.dynjs.runtime.Reference.getValue(Reference.java:47)
at org.dynjs.runtime.Types.getValue(Types.java:347)
at org.dynjs.gen.Program0.execute(Unknown Source)
at org.dynjs.runtime.ExecutionContext.execute(ExecutionContext.java:122)
at org.dynjs.runtime.DynJS.execute(DynJS.java:90)
at org.dynjs.runtime.DynJS.execute(DynJS.java:80)
at org.dynjs.runtime.DynJS.execute(DynJS.java:76)
at org.dynjs.cli.Main.executeFile(Main.java:73)
at org.dynjs.cli.Main.run(Main.java:60)
at org.dynjs.cli.Main.main(Main.java:46)
===
=== ch15/15.1/15.1.3/15.1.3.2/S15.1.3.2_A3_T2 failed in non-strict mode ===
--- errors ---
Exception in thread "main" org.dynjs.exception.ThrowException: ReferenceError: decodeURIComponent is not defined
at <global>.<eval>(/var/folders/vt/nrnb_cw95ps51fgmm9rq2mpw0000gn/T/test262-FmPG_V.js:2178)
at org.dynjs.runtime.Reference.getValue(Reference.java:47)
at org.dynjs.runtime.Types.getValue(Types.java:347)
at org.dynjs.gen.Program0.execute(Unknown Source)
at org.dynjs.runtime.ExecutionContext.execute(ExecutionContext.java:122)
at org.dynjs.runtime.DynJS.execute(DynJS.java:90)
at org.dynjs.runtime.DynJS.execute(DynJS.java:80)
at org.dynjs.runtime.DynJS.execute(DynJS.java:76)
at org.dynjs.cli.Main.executeFile(Main.java:73)
at org.dynjs.cli.Main.run(Main.java:60)
at org.dynjs.cli.Main.main(Main.java:46)
===
=== ch15/15.1/15.1.3/15.1.3.2/S15.1.3.2_A3_T3 failed in non-strict mode ===
--- errors ---
Exception in thread "main" org.dynjs.exception.ThrowException: ReferenceError: decodeURIComponent is not defined
at <global>.<eval>(/var/folders/vt/nrnb_cw95ps51fgmm9rq2mpw0000gn/T/test262-rbHx_G.js:2178)
at org.dynjs.runtime.Reference.getValue(Reference.java:47)
at org.dynjs.runtime.Types.getValue(Types.java:347)
at org.dynjs.gen.Program0.execute(Unknown Source)
at org.dynjs.runtime.ExecutionContext.execute(ExecutionContext.java:122)
at org.dynjs.runtime.DynJS.execute(DynJS.java:90)
at org.dynjs.runtime.DynJS.execute(DynJS.java:80)
at org.dynjs.runtime.DynJS.execute(DynJS.java:76)
at org.dynjs.cli.Main.executeFile(Main.java:73)
at org.dynjs.cli.Main.run(Main.java:60)
at org.dynjs.cli.Main.main(Main.java:46)
===
=== ch15/15.1/15.1.3/15.1.3.2/S15.1.3.2_A4_T1 failed in non-strict mode ===
--- errors ---
Exception in thread "main" org.dynjs.exception.ThrowException: ReferenceError: decodeURIComponent is not defined
at <global>.<eval>(/var/folders/vt/nrnb_cw95ps51fgmm9rq2mpw0000gn/T/test262-oDI9Nq.js:2178)
at org.dynjs.runtime.Reference.getValue(Reference.java:47)
at org.dynjs.runtime.Types.getValue(Types.java:347)
at org.dynjs.gen.Program0.execute(Unknown Source)
at org.dynjs.runtime.ExecutionContext.execute(ExecutionContext.java:122)
at org.dynjs.runtime.DynJS.execute(DynJS.java:90)
at org.dynjs.runtime.DynJS.execute(DynJS.java:80)
at org.dynjs.runtime.DynJS.execute(DynJS.java:76)
at org.dynjs.cli.Main.executeFile(Main.java:73)
at org.dynjs.cli.Main.run(Main.java:60)
at org.dynjs.cli.Main.main(Main.java:46)
===
=== ch15/15.1/15.1.3/15.1.3.2/S15.1.3.2_A4_T2 failed in non-strict mode ===
--- errors ---
Exception in thread "main" org.dynjs.exception.ThrowException: ReferenceError: decodeURIComponent is not defined
at <global>.<eval>(/var/folders/vt/nrnb_cw95ps51fgmm9rq2mpw0000gn/T/test262-zyD1uI.js:2178)
at org.dynjs.runtime.Reference.getValue(Reference.java:47)
at org.dynjs.runtime.Types.getValue(Types.java:347)
at org.dynjs.gen.Program0.execute(Unknown Source)
at org.dynjs.runtime.ExecutionContext.execute(ExecutionContext.java:122)
at org.dynjs.runtime.DynJS.execute(DynJS.java:90)
at org.dynjs.runtime.DynJS.execute(DynJS.java:80)
at org.dynjs.runtime.DynJS.execute(DynJS.java:76)
at org.dynjs.cli.Main.executeFile(Main.java:73)
at org.dynjs.cli.Main.run(Main.java:60)
at org.dynjs.cli.Main.main(Main.java:46)
===
=== ch15/15.1/15.1.3/15.1.3.2/S15.1.3.2_A4_T3 failed in non-strict mode ===
--- errors ---
Exception in thread "main" org.dynjs.exception.ThrowException: ReferenceError: decodeURIComponent is not defined
at <global>.<eval>(/var/folders/vt/nrnb_cw95ps51fgmm9rq2mpw0000gn/T/test262-zQhBJG.js:2178)
at org.dynjs.runtime.Reference.getValue(Reference.java:47)
at org.dynjs.runtime.Types.getValue(Types.java:347)
at org.dynjs.gen.Program0.execute(Unknown Source)
at org.dynjs.runtime.ExecutionContext.execute(ExecutionContext.java:122)
at org.dynjs.runtime.DynJS.execute(DynJS.java:90)
at org.dynjs.runtime.DynJS.execute(DynJS.java:80)
at org.dynjs.runtime.DynJS.execute(DynJS.java:76)
at org.dynjs.cli.Main.executeFile(Main.java:73)
at org.dynjs.cli.Main.run(Main.java:60)
at org.dynjs.cli.Main.main(Main.java:46)
===
=== ch15/15.1/15.1.3/15.1.3.2/S15.1.3.2_A4_T4 failed in non-strict mode ===
--- errors ---
Exception in thread "main" org.dynjs.exception.ThrowException: ReferenceError: decodeURIComponent is not defined
at <global>.<eval>(/var/folders/vt/nrnb_cw95ps51fgmm9rq2mpw0000gn/T/test262-z6SF45.js:2178)
at org.dynjs.runtime.Reference.getValue(Reference.java:47)
at org.dynjs.runtime.Types.getValue(Types.java:347)
at org.dynjs.gen.Program0.execute(Unknown Source)
at org.dynjs.runtime.ExecutionContext.execute(ExecutionContext.java:122)
at org.dynjs.runtime.DynJS.execute(DynJS.java:90)
at org.dynjs.runtime.DynJS.execute(DynJS.java:80)
at org.dynjs.runtime.DynJS.execute(DynJS.java:76)
at org.dynjs.cli.Main.executeFile(Main.java:73)
at org.dynjs.cli.Main.run(Main.java:60)
at org.dynjs.cli.Main.main(Main.java:46)
===
=== ch15/15.1/15.1.3/15.1.3.2/S15.1.3.2_A5.1 failed in non-strict mode ===
--- errors ---
Exception in thread "main" org.dynjs.exception.ThrowException: ReferenceError: decodeURIComponent is not defined
at <global>.<eval>(/var/folders/vt/nrnb_cw95ps51fgmm9rq2mpw0000gn/T/test262-WhkrgQ.js:2178)
at org.dynjs.runtime.Reference.getValue(Reference.java:47)
at org.dynjs.runtime.Types.getValue(Types.java:347)
at org.dynjs.gen.Program0.execute(Unknown Source)
at org.dynjs.runtime.ExecutionContext.execute(ExecutionContext.java:122)
at org.dynjs.runtime.DynJS.execute(DynJS.java:90)
at org.dynjs.runtime.DynJS.execute(DynJS.java:80)
at org.dynjs.runtime.DynJS.execute(DynJS.java:76)
at org.dynjs.cli.Main.executeFile(Main.java:73)
at org.dynjs.cli.Main.run(Main.java:60)
at org.dynjs.cli.Main.main(Main.java:46)
===
=== ch15/15.1/15.1.3/15.1.3.2/S15.1.3.2_A5.2 failed in non-strict mode ===
--- errors ---
Exception in thread "main" org.dynjs.exception.ThrowException: ReferenceError: decodeURIComponent is not defined
at <global>.<eval>(/var/folders/vt/nrnb_cw95ps51fgmm9rq2mpw0000gn/T/test262-QkYYKM.js:2178)
at org.dynjs.runtime.Reference.getValue(Reference.java:47)
at org.dynjs.runtime.Types.getValue(Types.java:347)
at org.dynjs.gen.Program0.execute(Unknown Source)
at org.dynjs.runtime.ExecutionContext.execute(ExecutionContext.java:122)
at org.dynjs.runtime.DynJS.execute(DynJS.java:90)
at org.dynjs.runtime.DynJS.execute(DynJS.java:80)
at org.dynjs.runtime.DynJS.execute(DynJS.java:76)
at org.dynjs.cli.Main.executeFile(Main.java:73)
at org.dynjs.cli.Main.run(Main.java:60)
at org.dynjs.cli.Main.main(Main.java:46)
===
=== ch15/15.1/15.1.3/15.1.3.2/S15.1.3.2_A5.3 failed in non-strict mode ===
--- errors ---
Exception in thread "main" org.dynjs.exception.ThrowException: ReferenceError: decodeURIComponent is not defined
at <global>.<eval>(/var/folders/vt/nrnb_cw95ps51fgmm9rq2mpw0000gn/T/test262-MX7zuo.js:2178)
at org.dynjs.runtime.Reference.getValue(Reference.java:47)
at org.dynjs.runtime.Types.getValue(Types.java:347)
at org.dynjs.gen.Program0.execute(Unknown Source)
at org.dynjs.runtime.ExecutionContext.execute(ExecutionContext.java:122)
at org.dynjs.runtime.DynJS.execute(DynJS.java:90)
at org.dynjs.runtime.DynJS.execute(DynJS.java:80)
at org.dynjs.runtime.DynJS.execute(DynJS.java:76)
at org.dynjs.cli.Main.executeFile(Main.java:73)
at org.dynjs.cli.Main.run(Main.java:60)
at org.dynjs.cli.Main.main(Main.java:46)
===
=== ch15/15.1/15.1.3/15.1.3.2/S15.1.3.2_A5.4 failed in non-strict mode ===
--- errors ---
Exception in thread "main" org.dynjs.exception.ThrowException: ReferenceError: decodeURIComponent is not defined
at <global>.<eval>(/var/folders/vt/nrnb_cw95ps51fgmm9rq2mpw0000gn/T/test262-TrE4MC.js:2178)
at org.dynjs.runtime.Reference.getValue(Reference.java:47)
at org.dynjs.runtime.Types.getValue(Types.java:347)
at org.dynjs.gen.Program0.execute(Unknown Source)
at org.dynjs.runtime.ExecutionContext.execute(ExecutionContext.java:122)
at org.dynjs.runtime.DynJS.execute(DynJS.java:90)
at org.dynjs.runtime.DynJS.execute(DynJS.java:80)
at org.dynjs.runtime.DynJS.execute(DynJS.java:76)
at org.dynjs.cli.Main.executeFile(Main.java:73)
at org.dynjs.cli.Main.run(Main.java:60)
at org.dynjs.cli.Main.main(Main.java:46)
===
ch15/15.1/15.1.3/15.1.3.2/S15.1.3.2_A5.5 passed in non-strict mode
=== ch15/15.1/15.1.3/15.1.3.2/S15.1.3.2_A5.6 failed in non-strict mode ===
--- errors ---
Exception in thread "main" org.dynjs.exception.ThrowException: ReferenceError: decodeURIComponent is not defined
at <global>.<eval>(/var/folders/vt/nrnb_cw95ps51fgmm9rq2mpw0000gn/T/test262-ZOmKPz.js:2178)
at org.dynjs.runtime.Reference.getValue(Reference.java:47)
at org.dynjs.runtime.Types.getValue(Types.java:347)
at org.dynjs.gen.Program0.execute(Unknown Source)
at org.dynjs.runtime.ExecutionContext.execute(ExecutionContext.java:122)
at org.dynjs.runtime.DynJS.execute(DynJS.java:90)
at org.dynjs.runtime.DynJS.execute(DynJS.java:80)
at org.dynjs.runtime.DynJS.execute(DynJS.java:76)
at org.dynjs.cli.Main.executeFile(Main.java:73)
at org.dynjs.cli.Main.run(Main.java:60)
at org.dynjs.cli.Main.main(Main.java:46)
===
=== ch15/15.1/15.1.3/15.1.3.2/S15.1.3.2_A5.7 failed in non-strict mode ===
--- errors ---
Exception in thread "main" org.dynjs.exception.ThrowException: #1.2: new decodeURIComponent() throw TypeError. Actual: ReferenceError: decodeURIComponent is not defined
at <global>.testFailed(/var/folders/vt/nrnb_cw95ps51fgmm9rq2mpw0000gn/T/test262-gEthb1.js:289)
at <global>.$ERROR(/var/folders/vt/nrnb_cw95ps51fgmm9rq2mpw0000gn/T/test262-gEthb1.js:305)
at <global>.<eval>(/var/folders/vt/nrnb_cw95ps51fgmm9rq2mpw0000gn/T/test262-gEthb1.js:2184)
at org.dynjs.gen.Function13.call(Unknown Source)
at org.dynjs.runtime.ExecutionContext.call(ExecutionContext.java:139)
at org.dynjs.gen.Function17.call(Unknown Source)
at org.dynjs.runtime.ExecutionContext.call(ExecutionContext.java:139)
at org.dynjs.gen.ThenBlock22.call(Unknown Source)
at org.dynjs.gen.CatchBlock21.call(Unknown Source)
at org.dynjs.runtime.ExecutionContext.executeCatch(ExecutionContext.java:235)
at org.dynjs.gen.Program0.execute(Unknown Source)
at org.dynjs.runtime.ExecutionContext.execute(ExecutionContext.java:122)
at org.dynjs.runtime.DynJS.execute(DynJS.java:90)
at org.dynjs.runtime.DynJS.execute(DynJS.java:80)
at org.dynjs.runtime.DynJS.execute(DynJS.java:76)
at org.dynjs.cli.Main.executeFile(Main.java:73)
at org.dynjs.cli.Main.run(Main.java:60)
at org.dynjs.cli.Main.main(Main.java:46)
===
=== ch15/15.1/15.1.3/15.1.3.2/S15.1.3.2_A6_T1 failed in non-strict mode ===
--- errors ---
Exception in thread "main" org.dynjs.exception.ThrowException: ReferenceError: decodeURIComponent is not defined
at <global>.<eval>(/var/folders/vt/nrnb_cw95ps51fgmm9rq2mpw0000gn/T/test262-Zrsijh.js:2179)
at org.dynjs.runtime.Reference.getValue(Reference.java:47)
at org.dynjs.runtime.Types.getValue(Types.java:347)
at org.dynjs.gen.Program0.execute(Unknown Source)
at org.dynjs.runtime.ExecutionContext.execute(ExecutionContext.java:122)
at org.dynjs.runtime.DynJS.execute(DynJS.java:90)
at org.dynjs.runtime.DynJS.execute(DynJS.java:80)
at org.dynjs.runtime.DynJS.execute(DynJS.java:76)
at org.dynjs.cli.Main.executeFile(Main.java:73)
at org.dynjs.cli.Main.run(Main.java:60)
at org.dynjs.cli.Main.main(Main.java:46)
===
=== ch15/15.1/15.1.3/15.1.3.3/S15.1.3.3_A1.1_T1 failed in non-strict mode ===
--- errors ---
Exception in thread "main" org.dynjs.exception.ThrowException: #DC00-DFFF
at <global>.testFailed(/var/folders/vt/nrnb_cw95ps51fgmm9rq2mpw0000gn/T/test262-H2uRzR.js:289)
at <global>.$ERROR(/var/folders/vt/nrnb_cw95ps51fgmm9rq2mpw0000gn/T/test262-H2uRzR.js:305)
at <global>.<eval>(/var/folders/vt/nrnb_cw95ps51fgmm9rq2mpw0000gn/T/test262-H2uRzR.js:2214)
at org.dynjs.gen.Function13.call(Unknown Source)
at org.dynjs.runtime.ExecutionContext.call(ExecutionContext.java:139)
at org.dynjs.gen.Function17.call(Unknown Source)
at org.dynjs.runtime.ExecutionContext.call(ExecutionContext.java:139)
at org.dynjs.gen.ThenBlock48.call(Unknown Source)
at org.dynjs.gen.ThenBlock47.call(Unknown Source)
at org.dynjs.gen.Program0.execute(Unknown Source)
at org.dynjs.runtime.ExecutionContext.execute(ExecutionContext.java:122)
at org.dynjs.runtime.DynJS.execute(DynJS.java:90)
at org.dynjs.runtime.DynJS.execute(DynJS.java:80)
at org.dynjs.runtime.DynJS.execute(DynJS.java:76)
at org.dynjs.cli.Main.executeFile(Main.java:73)
at org.dynjs.cli.Main.run(Main.java:60)
at org.dynjs.cli.Main.main(Main.java:46)
===
=== ch15/15.1/15.1.3/15.1.3.3/S15.1.3.3_A1.1_T2 failed in non-strict mode ===
--- errors ---
Exception in thread "main" org.dynjs.exception.ThrowException: #DC00-DFFF
at <global>.testFailed(/var/folders/vt/nrnb_cw95ps51fgmm9rq2mpw0000gn/T/test262-caNdAR.js:289)
at <global>.$ERROR(/var/folders/vt/nrnb_cw95ps51fgmm9rq2mpw0000gn/T/test262-caNdAR.js:305)
at <global>.<eval>(/var/folders/vt/nrnb_cw95ps51fgmm9rq2mpw0000gn/T/test262-caNdAR.js:2214)
at org.dynjs.gen.Function13.call(Unknown Source)
at org.dynjs.runtime.ExecutionContext.call(ExecutionContext.java:139)
at org.dynjs.gen.Function17.call(Unknown Source)
at org.dynjs.runtime.ExecutionContext.call(ExecutionContext.java:139)
at org.dynjs.gen.ThenBlock48.call(Unknown Source)
at org.dynjs.gen.ThenBlock47.call(Unknown Source)
at org.dynjs.gen.Program0.execute(Unknown Source)
at org.dynjs.runtime.ExecutionContext.execute(ExecutionContext.java:122)
at org.dynjs.runtime.DynJS.execute(DynJS.java:90)
at org.dynjs.runtime.DynJS.execute(DynJS.java:80)
at org.dynjs.runtime.DynJS.execute(DynJS.java:76)
at org.dynjs.cli.Main.executeFile(Main.java:73)
at org.dynjs.cli.Main.run(Main.java:60)
at org.dynjs.cli.Main.main(Main.java:46)
===
=== ch15/15.1/15.1.3/15.1.3.3/S15.1.3.3_A1.2_T1 failed in non-strict mode ===
--- errors ---
Exception in thread "main" org.dynjs.exception.ThrowException: #D800-DBFF
at <global>.testFailed(/var/folders/vt/nrnb_cw95ps51fgmm9rq2mpw0000gn/T/test262-JyApCd.js:289)
at <global>.$ERROR(/var/folders/vt/nrnb_cw95ps51fgmm9rq2mpw0000gn/T/test262-JyApCd.js:305)
at <global>.<eval>(/var/folders/vt/nrnb_cw95ps51fgmm9rq2mpw0000gn/T/test262-JyApCd.js:2214)
at org.dynjs.gen.Function13.call(Unknown Source)
at org.dynjs.runtime.ExecutionContext.call(ExecutionContext.java:139)
at org.dynjs.gen.Function17.call(Unknown Source)
at org.dynjs.runtime.ExecutionContext.call(ExecutionContext.java:139)
at org.dynjs.gen.ThenBlock61.call(Unknown Source)
at org.dynjs.gen.ThenBlock60.call(Unknown Source)
at org.dynjs.gen.Program0.execute(Unknown Source)
at org.dynjs.runtime.ExecutionContext.execute(ExecutionContext.java:122)
at org.dynjs.runtime.DynJS.execute(DynJS.java:90)
at org.dynjs.runtime.DynJS.execute(DynJS.java:80)
at org.dynjs.runtime.DynJS.execute(DynJS.java:76)
at org.dynjs.cli.Main.executeFile(Main.java:73)
at org.dynjs.cli.Main.run(Main.java:60)
at org.dynjs.cli.Main.main(Main.java:46)
===
=== ch15/15.1/15.1.3/15.1.3.3/S15.1.3.3_A1.2_T2 failed in non-strict mode ===
--- errors ---
Exception in thread "main" org.dynjs.exception.ThrowException: #D800-DBFF
at <global>.testFailed(/var/folders/vt/nrnb_cw95ps51fgmm9rq2mpw0000gn/T/test262-AxUSx4.js:289)
at <global>.$ERROR(/var/folders/vt/nrnb_cw95ps51fgmm9rq2mpw0000gn/T/test262-AxUSx4.js:305)
at <global>.<eval>(/var/folders/vt/nrnb_cw95ps51fgmm9rq2mpw0000gn/T/test262-AxUSx4.js:2214)
at org.dynjs.gen.Function13.call(Unknown Source)
at org.dynjs.runtime.ExecutionContext.call(ExecutionContext.java:139)
at org.dynjs.gen.Function17.call(Unknown Source)
at org.dynjs.runtime.ExecutionContext.call(ExecutionContext.java:139)
at org.dynjs.gen.ThenBlock61.call(Unknown Source)
at org.dynjs.gen.ThenBlock60.call(Unknown Source)
at org.dynjs.gen.Program0.execute(Unknown Source)
at org.dynjs.runtime.ExecutionContext.execute(ExecutionContext.java:122)
at org.dynjs.runtime.DynJS.execute(DynJS.java:90)
at org.dynjs.runtime.DynJS.execute(DynJS.java:80)
at org.dynjs.runtime.DynJS.execute(DynJS.java:76)
at org.dynjs.cli.Main.executeFile(Main.java:73)
at org.dynjs.cli.Main.run(Main.java:60)
at org.dynjs.cli.Main.main(Main.java:46)
===
=== ch15/15.1/15.1.3/15.1.3.3/S15.1.3.3_A1.3_T1 failed in non-strict mode ===
--- errors ---
Exception in thread "main" org.dynjs.exception.ThrowException: java.lang.NumberFormatException: For input string: "0xDBF.0E"
at <global>.<eval>(/var/folders/vt/nrnb_cw95ps51fgmm9rq2mpw0000gn/T/test262-iooP8F.js:2177)
at org.dynjs.runtime.ExecutionContext.execute(ExecutionContext.java:126)
at org.dynjs.runtime.DynJS.execute(DynJS.java:90)
at org.dynjs.runtime.DynJS.execute(DynJS.java:80)
at org.dynjs.runtime.DynJS.execute(DynJS.java:76)
at org.dynjs.cli.Main.executeFile(Main.java:73)
at org.dynjs.cli.Main.run(Main.java:60)
at org.dynjs.cli.Main.main(Main.java:46)
Caused by: java.lang.NumberFormatException: For input string: "0xDBF.0E"
at sun.misc.FloatingDecimal.parseHexString(FloatingDecimal.java:1891)
at sun.misc.FloatingDecimal.readJavaFormatString(FloatingDecimal.java:1063)
at java.lang.Double.valueOf(Double.java:504)
at org.dynjs.gen.Program0.execute(Unknown Source)
at org.dynjs.runtime.ExecutionContext.execute(ExecutionContext.java:122)
... 6 more
===
=== ch15/15.1/15.1.3/15.1.3.3/S15.1.3.3_A2.1_T1 failed in non-strict mode ===
--- errors ---
Exception in thread "main" org.dynjs.exception.ThrowException: #0020
at <global>.testFailed(/var/folders/vt/nrnb_cw95ps51fgmm9rq2mpw0000gn/T/test262-MVoZea.js:289)
at <global>.$ERROR(/var/folders/vt/nrnb_cw95ps51fgmm9rq2mpw0000gn/T/test262-MVoZea.js:305)
at <global>.<eval>(/var/folders/vt/nrnb_cw95ps51fgmm9rq2mpw0000gn/T/test262-MVoZea.js:2225)
at org.dynjs.gen.Function13.call(Unknown Source)
at org.dynjs.runtime.ExecutionContext.call(ExecutionContext.java:139)
at org.dynjs.gen.Function17.call(Unknown Source)
at org.dynjs.runtime.ExecutionContext.call(ExecutionContext.java:139)
at org.dynjs.gen.ElseBlock53.call(Unknown Source)
at org.dynjs.gen.ThenBlock52.call(Unknown Source)
at org.dynjs.gen.Program0.execute(Unknown Source)
at org.dynjs.runtime.ExecutionContext.execute(ExecutionContext.java:122)
at org.dynjs.runtime.DynJS.execute(DynJS.java:90)
at org.dynjs.runtime.DynJS.execute(DynJS.java:80)
at org.dynjs.runtime.DynJS.execute(DynJS.java:76)
at org.dynjs.cli.Main.executeFile(Main.java:73)
at org.dynjs.cli.Main.run(Main.java:60)
at org.dynjs.cli.Main.main(Main.java:46)
===
ch15/15.1/15.1.3/15.1.3.3/S15.1.3.3_A2.2_T1 passed in non-strict mode
=== ch15/15.1/15.1.3/15.1.3.3/S15.1.3.3_A2.3_T1 failed in non-strict mode ===
--- errors ---
Exception in thread "main" org.dynjs.exception.ThrowException: java.lang.NumberFormatException: For input string: "0x00.0E0"
at <global>.<eval>(/var/folders/vt/nrnb_cw95ps51fgmm9rq2mpw0000gn/T/test262-hJzqx0.js:2185)
at org.dynjs.runtime.ExecutionContext.execute(ExecutionContext.java:126)
at org.dynjs.runtime.DynJS.execute(DynJS.java:90)
at org.dynjs.runtime.DynJS.execute(DynJS.java:80)
at org.dynjs.runtime.DynJS.execute(DynJS.java:76)
at org.dynjs.cli.Main.executeFile(Main.java:73)
at org.dynjs.cli.Main.run(Main.java:60)
at org.dynjs.cli.Main.main(Main.java:46)
Caused by: java.lang.NumberFormatException: For input string: "0x00.0E0"
at sun.misc.FloatingDecimal.parseHexString(FloatingDecimal.java:1891)
at sun.misc.FloatingDecimal.readJavaFormatString(FloatingDecimal.java:1063)
at java.lang.Double.valueOf(Double.java:504)
at org.dynjs.gen.ForBlock20.call(Unknown Source)
at org.dynjs.gen.Program0.execute(Unknown Source)
at org.dynjs.runtime.ExecutionContext.execute(ExecutionContext.java:122)
... 6 more
===
ch15/15.1/15.1.3/15.1.3.3/S15.1.3.3_A2.4_T1 passed in non-strict mode
ch15/15.1/15.1.3/15.1.3.3/S15.1.3.3_A2.4_T2 passed in non-strict mode
=== ch15/15.1/15.1.3/15.1.3.3/S15.1.3.3_A2.5_T1 failed in non-strict mode ===
--- errors ---
Exception in thread "main" org.dynjs.exception.ThrowException: java.lang.NumberFormatException: For input string: "0x.0E000"
at <global>.<eval>(/var/folders/vt/nrnb_cw95ps51fgmm9rq2mpw0000gn/T/test262-vVUbUR.js:2181)
at org.dynjs.runtime.ExecutionContext.execute(ExecutionContext.java:126)
at org.dynjs.runtime.DynJS.execute(DynJS.java:90)
at org.dynjs.runtime.DynJS.execute(DynJS.java:80)
at org.dynjs.runtime.DynJS.execute(DynJS.java:76)
at org.dynjs.cli.Main.executeFile(Main.java:73)
at org.dynjs.cli.Main.run(Main.java:60)
at org.dynjs.cli.Main.main(Main.java:46)
Caused by: java.lang.NumberFormatException: For input string: "0x.0E000"
at sun.misc.FloatingDecimal.parseHexString(FloatingDecimal.java:1891)
at sun.misc.FloatingDecimal.readJavaFormatString(FloatingDecimal.java:1063)
at java.lang.Double.valueOf(Double.java:504)
at org.dynjs.gen.Program0.execute(Unknown Source)
at org.dynjs.runtime.ExecutionContext.execute(ExecutionContext.java:122)
... 6 more
===
=== ch15/15.1/15.1.3/15.1.3.3/S15.1.3.3_A3.1_T1 failed in non-strict mode ===
--- errors ---
Exception in thread "main" org.dynjs.exception.ThrowException: #1: unescapedURISet containing;
at <global>.testFailed(/var/folders/vt/nrnb_cw95ps51fgmm9rq2mpw0000gn/T/test262-qFlxkh.js:289)
at <global>.$ERROR(/var/folders/vt/nrnb_cw95ps51fgmm9rq2mpw0000gn/T/test262-qFlxkh.js:305)
at <global>.<eval>(/var/folders/vt/nrnb_cw95ps51fgmm9rq2mpw0000gn/T/test262-qFlxkh.js:2181)
at org.dynjs.gen.Function13.call(Unknown Source)
at org.dynjs.runtime.ExecutionContext.call(ExecutionContext.java:139)
at org.dynjs.gen.Function17.call(Unknown Source)
at org.dynjs.runtime.ExecutionContext.call(ExecutionContext.java:139)
at org.dynjs.gen.ThenBlock21.call(Unknown Source)
at org.dynjs.gen.ForBlock20.call(Unknown Source)
at org.dynjs.gen.Program0.execute(Unknown Source)
at org.dynjs.runtime.ExecutionContext.execute(ExecutionContext.java:122)
at org.dynjs.runtime.DynJS.execute(DynJS.java:90)
at org.dynjs.runtime.DynJS.execute(DynJS.java:80)
at org.dynjs.runtime.DynJS.execute(DynJS.java:76)
at org.dynjs.cli.Main.executeFile(Main.java:73)
at org.dynjs.cli.Main.run(Main.java:60)
at org.dynjs.cli.Main.main(Main.java:46)
===
ch15/15.1/15.1.3/15.1.3.3/S15.1.3.3_A3.2_T1 passed in non-strict mode
ch15/15.1/15.1.3/15.1.3.3/S15.1.3.3_A3.2_T2 passed in non-strict mode
=== ch15/15.1/15.1.3/15.1.3.3/S15.1.3.3_A3.2_T3 failed in non-strict mode ===
--- errors ---
Exception in thread "main" org.dynjs.exception.ThrowException: #4: unescapedURISet containing!
at <global>.testFailed(/var/folders/vt/nrnb_cw95ps51fgmm9rq2mpw0000gn/T/test262-0gJWTO.js:289)
at <global>.$ERROR(/var/folders/vt/nrnb_cw95ps51fgmm9rq2mpw0000gn/T/test262-0gJWTO.js:305)
at <global>.<eval>(/var/folders/vt/nrnb_cw95ps51fgmm9rq2mpw0000gn/T/test262-0gJWTO.js:2181)
at org.dynjs.gen.Function13.call(Unknown Source)
at org.dynjs.runtime.ExecutionContext.call(ExecutionContext.java:139)
at org.dynjs.gen.Function17.call(Unknown Source)
at org.dynjs.runtime.ExecutionContext.call(ExecutionContext.java:139)
at org.dynjs.gen.ThenBlock31.call(Unknown Source)
at org.dynjs.gen.ForBlock30.call(Unknown Source)
at org.dynjs.gen.Program0.execute(Unknown Source)
at org.dynjs.runtime.ExecutionContext.execute(ExecutionContext.java:122)
at org.dynjs.runtime.DynJS.execute(DynJS.java:90)
at org.dynjs.runtime.DynJS.execute(DynJS.java:80)
at org.dynjs.runtime.DynJS.execute(DynJS.java:76)
at org.dynjs.cli.Main.executeFile(Main.java:73)
at org.dynjs.cli.Main.run(Main.java:60)
at org.dynjs.cli.Main.main(Main.java:46)
===
=== ch15/15.1/15.1.3/15.1.3.3/S15.1.3.3_A3.3_T1 failed in non-strict mode ===
--- errors ---
Exception in thread "main" org.dynjs.exception.ThrowException: #1: unescapedURISet containing "#"
at <global>.testFailed(/var/folders/vt/nrnb_cw95ps51fgmm9rq2mpw0000gn/T/test262-mQMoWM.js:289)
at <global>.$ERROR(/var/folders/vt/nrnb_cw95ps51fgmm9rq2mpw0000gn/T/test262-mQMoWM.js:305)
at <global>.<eval>(/var/folders/vt/nrnb_cw95ps51fgmm9rq2mpw0000gn/T/test262-mQMoWM.js:2178)
at org.dynjs.gen.Function13.call(Unknown Source)
at org.dynjs.runtime.ExecutionContext.call(ExecutionContext.java:139)
at org.dynjs.gen.Function17.call(Unknown Source)
at org.dynjs.runtime.ExecutionContext.call(ExecutionContext.java:139)
at org.dynjs.gen.ThenBlock20.call(Unknown Source)
at org.dynjs.gen.Program0.execute(Unknown Source)
at org.dynjs.runtime.ExecutionContext.execute(ExecutionContext.java:122)
at org.dynjs.runtime.DynJS.execute(DynJS.java:90)
at org.dynjs.runtime.DynJS.execute(DynJS.java:80)
at org.dynjs.runtime.DynJS.execute(DynJS.java:76)
at org.dynjs.cli.Main.executeFile(Main.java:73)
at org.dynjs.cli.Main.run(Main.java:60)
at org.dynjs.cli.Main.main(Main.java:46)
===
=== ch15/15.1/15.1.3/15.1.3.3/S15.1.3.3_A4_T1 failed in non-strict mode ===
--- errors ---
Exception in thread "main" org.dynjs.exception.ThrowException: #1: http://unipro.ru/0123456789
at <global>.testFailed(/var/folders/vt/nrnb_cw95ps51fgmm9rq2mpw0000gn/T/test262-CHD4Ga.js:289)
at <global>.$ERROR(/var/folders/vt/nrnb_cw95ps51fgmm9rq2mpw0000gn/T/test262-CHD4Ga.js:305)
at <global>.<eval>(/var/folders/vt/nrnb_cw95ps51fgmm9rq2mpw0000gn/T/test262-CHD4Ga.js:2179)
at org.dynjs.gen.Function13.call(Unknown Source)
at org.dynjs.runtime.ExecutionContext.call(ExecutionContext.java:139)
at org.dynjs.gen.Function17.call(Unknown Source)
at org.dynjs.runtime.ExecutionContext.call(ExecutionContext.java:139)
at org.dynjs.gen.ThenBlock20.call(Unknown Source)
at org.dynjs.gen.Program0.execute(Unknown Source)
at org.dynjs.runtime.ExecutionContext.execute(ExecutionContext.java:122)
at org.dynjs.runtime.DynJS.execute(DynJS.java:90)
at org.dynjs.runtime.DynJS.execute(DynJS.java:80)
at org.dynjs.runtime.DynJS.execute(DynJS.java:76)
at org.dynjs.cli.Main.executeFile(Main.java:73)
at org.dynjs.cli.Main.run(Main.java:60)
at org.dynjs.cli.Main.main(Main.java:46)
===
=== ch15/15.1/15.1.3/15.1.3.3/S15.1.3.3_A4_T2 failed in non-strict mode ===
--- errors ---
Exception in thread "main" org.dynjs.exception.ThrowException: #1: http://ru.wikipedia.org/wiki/Юникод
at <global>.testFailed(/var/folders/vt/nrnb_cw95ps51fgmm9rq2mpw0000gn/T/test262-ebEUfv.js:289)
at <global>.$ERROR(/var/folders/vt/nrnb_cw95ps51fgmm9rq2mpw0000gn/T/test262-ebEUfv.js:305)
at <global>.<eval>(/var/folders/vt/nrnb_cw95ps51fgmm9rq2mpw0000gn/T/test262-ebEUfv.js:2179)
at org.dynjs.gen.Function13.call(Unknown Source)
at org.dynjs.runtime.ExecutionContext.call(ExecutionContext.java:139)
at org.dynjs.gen.Function17.call(Unknown Source)
at org.dynjs.runtime.ExecutionContext.call(ExecutionContext.java:139)
at org.dynjs.gen.ThenBlock20.call(Unknown Source)
at org.dynjs.gen.Program0.execute(Unknown Source)
at org.dynjs.runtime.ExecutionContext.execute(ExecutionContext.java:122)
at org.dynjs.runtime.DynJS.execute(DynJS.java:90)
at org.dynjs.runtime.DynJS.execute(DynJS.java:80)
at org.dynjs.runtime.DynJS.execute(DynJS.java:76)
at org.dynjs.cli.Main.executeFile(Main.java:73)
at org.dynjs.cli.Main.run(Main.java:60)
at org.dynjs.cli.Main.main(Main.java:46)
===
=== ch15/15.1/15.1.3/15.1.3.3/S15.1.3.3_A4_T3 failed in non-strict mode ===
--- errors ---
Exception in thread "main" org.dynjs.exception.ThrowException: #1: http://unipro.ru/\nabout
at <global>.testFailed(/var/folders/vt/nrnb_cw95ps51fgmm9rq2mpw0000gn/T/test262-xcJxfF.js:289)
at <global>.$ERROR(/var/folders/vt/nrnb_cw95ps51fgmm9rq2mpw0000gn/T/test262-xcJxfF.js:305)
at <global>.<eval>(/var/folders/vt/nrnb_cw95ps51fgmm9rq2mpw0000gn/T/test262-xcJxfF.js:2179)
at org.dynjs.gen.Function13.call(Unknown Source)
at org.dynjs.runtime.ExecutionContext.call(ExecutionContext.java:139)
at org.dynjs.gen.Function17.call(Unknown Source)
at org.dynjs.runtime.ExecutionContext.call(ExecutionContext.java:139)
at org.dynjs.gen.ThenBlock20.call(Unknown Source)
at org.dynjs.gen.Program0.execute(Unknown Source)
at org.dynjs.runtime.ExecutionContext.execute(ExecutionContext.java:122)
at org.dynjs.runtime.DynJS.execute(DynJS.java:90)
at org.dynjs.runtime.DynJS.execute(DynJS.java:80)
at org.dynjs.runtime.DynJS.execute(DynJS.java:76)
at org.dynjs.cli.Main.executeFile(Main.java:73)
at org.dynjs.cli.Main.run(Main.java:60)
at org.dynjs.cli.Main.main(Main.java:46)
===
=== ch15/15.1/15.1.3/15.1.3.3/S15.1.3.3_A4_T4 failed in non-strict mode ===
--- errors ---
Exception in thread "main" org.dynjs.exception.ThrowException: #2: http://unipro.ru
at <global>.testFailed(/var/folders/vt/nrnb_cw95ps51fgmm9rq2mpw0000gn/T/test262-gM3a53.js:289)
at <global>.$ERROR(/var/folders/vt/nrnb_cw95ps51fgmm9rq2mpw0000gn/T/test262-gM3a53.js:305)
at <global>.<eval>(/var/folders/vt/nrnb_cw95ps51fgmm9rq2mpw0000gn/T/test262-gM3a53.js:2184)
at org.dynjs.gen.Function13.call(Unknown Source)
at org.dynjs.runtime.ExecutionContext.call(ExecutionContext.java:139)
at org.dynjs.gen.Function17.call(Unknown Source)
at org.dynjs.runtime.ExecutionContext.call(ExecutionContext.java:139)
at org.dynjs.gen.ThenBlock20.call(Unknown Source)
at org.dynjs.gen.Program0.execute(Unknown Source)
at org.dynjs.runtime.ExecutionContext.execute(ExecutionContext.java:122)
at org.dynjs.runtime.DynJS.execute(DynJS.java:90)
at org.dynjs.runtime.DynJS.execute(DynJS.java:80)
at org.dynjs.runtime.DynJS.execute(DynJS.java:76)
at org.dynjs.cli.Main.executeFile(Main.java:73)
at org.dynjs.cli.Main.run(Main.java:60)
at org.dynjs.cli.Main.main(Main.java:46)
===
ch15/15.1/15.1.3/15.1.3.3/S15.1.3.3_A5.1 passed in non-strict mode
ch15/15.1/15.1.3/15.1.3.3/S15.1.3.3_A5.2 passed in non-strict mode
ch15/15.1/15.1.3/15.1.3.3/S15.1.3.3_A5.3 passed in non-strict mode
ch15/15.1/15.1.3/15.1.3.3/S15.1.3.3_A5.4 passed in non-strict mode
ch15/15.1/15.1.3/15.1.3.3/S15.1.3.3_A5.5 passed in non-strict mode
ch15/15.1/15.1.3/15.1.3.3/S15.1.3.3_A5.6 passed in non-strict mode
=== ch15/15.1/15.1.3/15.1.3.3/S15.1.3.3_A5.7 failed in non-strict mode ===
--- errors ---
Exception in thread "main" org.dynjs.exception.ThrowException: #1.2: new encodeURI() throw TypeError. Actual: Test262 Error: #1.1: new encodeURI() throw TypeError. Actual: [object Object]
at <global>.testFailed(/var/folders/vt/nrnb_cw95ps51fgmm9rq2mpw0000gn/T/test262-nePRIn.js:289)
at <global>.$ERROR(/var/folders/vt/nrnb_cw95ps51fgmm9rq2mpw0000gn/T/test262-nePRIn.js:305)
at <global>.<eval>(/var/folders/vt/nrnb_cw95ps51fgmm9rq2mpw0000gn/T/test262-nePRIn.js:2184)
at org.dynjs.gen.Function13.call(Unknown Source)
at org.dynjs.runtime.ExecutionContext.call(ExecutionContext.java:139)
at org.dynjs.gen.Function17.call(Unknown Source)
at org.dynjs.runtime.ExecutionContext.call(ExecutionContext.java:139)
at org.dynjs.gen.ThenBlock23.call(Unknown Source)
at org.dynjs.gen.CatchBlock22.call(Unknown Source)
at org.dynjs.runtime.ExecutionContext.executeCatch(ExecutionContext.java:235)
at org.dynjs.gen.Program0.execute(Unknown Source)
at org.dynjs.runtime.ExecutionContext.execute(ExecutionContext.java:122)
at org.dynjs.runtime.DynJS.execute(DynJS.java:90)
at org.dynjs.runtime.DynJS.execute(DynJS.java:80)
at org.dynjs.runtime.DynJS.execute(DynJS.java:76)
at org.dynjs.cli.Main.executeFile(Main.java:73)
at org.dynjs.cli.Main.run(Main.java:60)
at org.dynjs.cli.Main.main(Main.java:46)
===
=== ch15/15.1/15.1.3/15.1.3.3/S15.1.3.3_A6_T1 failed in non-strict mode ===
--- errors ---
Exception in thread "main" org.dynjs.exception.ThrowException: #1: var object = {valueOf: function() {return "^"}}; encodeURI(object) === %5Bobject%20Object%5D. Actual: %5Bobject+Object%5D
at <global>.testFailed(/var/folders/vt/nrnb_cw95ps51fgmm9rq2mpw0000gn/T/test262-Dpgtb4.js:289)
at <global>.$ERROR(/var/folders/vt/nrnb_cw95ps51fgmm9rq2mpw0000gn/T/test262-Dpgtb4.js:305)
at <global>.<eval>(/var/folders/vt/nrnb_cw95ps51fgmm9rq2mpw0000gn/T/test262-Dpgtb4.js:2180)
at org.dynjs.gen.Function13.call(Unknown Source)
at org.dynjs.runtime.ExecutionContext.call(ExecutionContext.java:139)
at org.dynjs.gen.Function17.call(Unknown Source)
at org.dynjs.runtime.ExecutionContext.call(ExecutionContext.java:139)
at org.dynjs.gen.ThenBlock20.call(Unknown Source)
at org.dynjs.gen.Program0.execute(Unknown Source)
at org.dynjs.runtime.ExecutionContext.execute(ExecutionContext.java:122)
at org.dynjs.runtime.DynJS.execute(DynJS.java:90)
at org.dynjs.runtime.DynJS.execute(DynJS.java:80)
at org.dynjs.runtime.DynJS.execute(DynJS.java:76)
at org.dynjs.cli.Main.executeFile(Main.java:73)
at org.dynjs.cli.Main.run(Main.java:60)
at org.dynjs.cli.Main.main(Main.java:46)
===
=== ch15/15.1/15.1.3/15.1.3.4/S15.1.3.4_A1.1_T1 failed in non-strict mode ===
--- errors ---
Exception in thread "main" org.dynjs.exception.ThrowException: #DC00-DFFF
at <global>.testFailed(/var/folders/vt/nrnb_cw95ps51fgmm9rq2mpw0000gn/T/test262-RrkMPv.js:289)
at <global>.$ERROR(/var/folders/vt/nrnb_cw95ps51fgmm9rq2mpw0000gn/T/test262-RrkMPv.js:305)
at <global>.<eval>(/var/folders/vt/nrnb_cw95ps51fgmm9rq2mpw0000gn/T/test262-RrkMPv.js:2214)
at org.dynjs.gen.Function13.call(Unknown Source)
at org.dynjs.runtime.ExecutionContext.call(ExecutionContext.java:139)
at org.dynjs.gen.Function17.call(Unknown Source)
at org.dynjs.runtime.ExecutionContext.call(ExecutionContext.java:139)
at org.dynjs.gen.ThenBlock62.call(Unknown Source)
at org.dynjs.gen.ThenBlock61.call(Unknown Source)
at org.dynjs.gen.Program0.execute(Unknown Source)
at org.dynjs.runtime.ExecutionContext.execute(ExecutionContext.java:122)
at org.dynjs.runtime.DynJS.execute(DynJS.java:90)
at org.dynjs.runtime.DynJS.execute(DynJS.java:80)
at org.dynjs.runtime.DynJS.execute(DynJS.java:76)
at org.dynjs.cli.Main.executeFile(Main.java:73)
at org.dynjs.cli.Main.run(Main.java:60)
at org.dynjs.cli.Main.main(Main.java:46)
===
=== ch15/15.1/15.1.3/15.1.3.4/S15.1.3.4_A1.1_T2 failed in non-strict mode ===
--- errors ---
Exception in thread "main" org.dynjs.exception.ThrowException: #DC00-DFFF
at <global>.testFailed(/var/folders/vt/nrnb_cw95ps51fgmm9rq2mpw0000gn/T/test262-llvM7M.js:289)
at <global>.$ERROR(/var/folders/vt/nrnb_cw95ps51fgmm9rq2mpw0000gn/T/test262-llvM7M.js:305)
at <global>.<eval>(/var/folders/vt/nrnb_cw95ps51fgmm9rq2mpw0000gn/T/test262-llvM7M.js:2214)
at org.dynjs.gen.Function13.call(Unknown Source)
at org.dynjs.runtime.ExecutionContext.call(ExecutionContext.java:139)
at org.dynjs.gen.Function17.call(Unknown Source)
at org.dynjs.runtime.ExecutionContext.call(ExecutionContext.java:139)
at org.dynjs.gen.ThenBlock50.call(Unknown Source)
at org.dynjs.gen.ThenBlock49.call(Unknown Source)
at org.dynjs.gen.Program0.execute(Unknown Source)
at org.dynjs.runtime.ExecutionContext.execute(ExecutionContext.java:122)
at org.dynjs.runtime.DynJS.execute(DynJS.java:90)
at org.dynjs.runtime.DynJS.execute(DynJS.java:80)
at org.dynjs.runtime.DynJS.execute(DynJS.java:76)
at org.dynjs.cli.Main.executeFile(Main.java:73)
at org.dynjs.cli.Main.run(Main.java:60)
at org.dynjs.cli.Main.main(Main.java:46)
===
=== ch15/15.1/15.1.3/15.1.3.4/S15.1.3.4_A1.2_T1 failed in non-strict mode ===
--- errors ---
Exception in thread "main" org.dynjs.exception.ThrowException: #D800-DBFF
at <global>.testFailed(/var/folders/vt/nrnb_cw95ps51fgmm9rq2mpw0000gn/T/test262-lCtZWk.js:289)
at <global>.$ERROR(/var/folders/vt/nrnb_cw95ps51fgmm9rq2mpw0000gn/T/test262-lCtZWk.js:305)
at <global>.<eval>(/var/folders/vt/nrnb_cw95ps51fgmm9rq2mpw0000gn/T/test262-lCtZWk.js:2214)
at org.dynjs.gen.Function13.call(Unknown Source)
at org.dynjs.runtime.ExecutionContext.call(ExecutionContext.java:139)
at org.dynjs.gen.Function17.call(Unknown Source)
at org.dynjs.runtime.ExecutionContext.call(ExecutionContext.java:139)
at org.dynjs.gen.ThenBlock65.call(Unknown Source)
at org.dynjs.gen.ThenBlock64.call(Unknown Source)
at org.dynjs.gen.Program0.execute(Unknown Source)
at org.dynjs.runtime.ExecutionContext.execute(ExecutionContext.java:122)
at org.dynjs.runtime.DynJS.execute(DynJS.java:90)
at org.dynjs.runtime.DynJS.execute(DynJS.java:80)
at org.dynjs.runtime.DynJS.execute(DynJS.java:76)
at org.dynjs.cli.Main.executeFile(Main.java:73)
at org.dynjs.cli.Main.run(Main.java:60)
at org.dynjs.cli.Main.main(Main.java:46)
===
=== ch15/15.1/15.1.3/15.1.3.4/S15.1.3.4_A1.2_T2 failed in non-strict mode ===
--- errors ---
Exception in thread "main" org.dynjs.exception.ThrowException: #D800-DBFF
at <global>.testFailed(/var/folders/vt/nrnb_cw95ps51fgmm9rq2mpw0000gn/T/test262-gPjT5A.js:289)
at <global>.$ERROR(/var/folders/vt/nrnb_cw95ps51fgmm9rq2mpw0000gn/T/test262-gPjT5A.js:305)
at <global>.<eval>(/var/folders/vt/nrnb_cw95ps51fgmm9rq2mpw0000gn/T/test262-gPjT5A.js:2214)
at org.dynjs.gen.Function13.call(Unknown Source)
at org.dynjs.runtime.ExecutionContext.call(ExecutionContext.java:139)
at org.dynjs.gen.Function17.call(Unknown Source)
at org.dynjs.runtime.ExecutionContext.call(ExecutionContext.java:139)
at org.dynjs.gen.ThenBlock63.call(Unknown Source)
at org.dynjs.gen.ThenBlock62.call(Unknown Source)
at org.dynjs.gen.Program0.execute(Unknown Source)
at org.dynjs.runtime.ExecutionContext.execute(ExecutionContext.java:122)
at org.dynjs.runtime.DynJS.execute(DynJS.java:90)
at org.dynjs.runtime.DynJS.execute(DynJS.java:80)
at org.dynjs.runtime.DynJS.execute(DynJS.java:76)
at org.dynjs.cli.Main.executeFile(Main.java:73)
at org.dynjs.cli.Main.run(Main.java:60)
at org.dynjs.cli.Main.main(Main.java:46)
===
=== ch15/15.1/15.1.3/15.1.3.4/S15.1.3.4_A1.3_T1 failed in non-strict mode ===
--- errors ---
Exception in thread "main" org.dynjs.exception.ThrowException: java.lang.NumberFormatException: For input string: "0xDBF.0E"
at <global>.<eval>(/var/folders/vt/nrnb_cw95ps51fgmm9rq2mpw0000gn/T/test262-HzT6ib.js:2177)
at org.dynjs.runtime.ExecutionContext.execute(ExecutionContext.java:126)
at org.dynjs.runtime.DynJS.execute(DynJS.java:90)
at org.dynjs.runtime.DynJS.execute(DynJS.java:80)
at org.dynjs.runtime.DynJS.execute(DynJS.java:76)
at org.dynjs.cli.Main.executeFile(Main.java:73)
at org.dynjs.cli.Main.run(Main.java:60)
at org.dynjs.cli.Main.main(Main.java:46)
Caused by: java.lang.NumberFormatException: For input string: "0xDBF.0E"
at sun.misc.FloatingDecimal.parseHexString(FloatingDecimal.java:1891)
at sun.misc.FloatingDecimal.readJavaFormatString(FloatingDecimal.java:1063)
at java.lang.Double.valueOf(Double.java:504)
at org.dynjs.gen.Program0.execute(Unknown Source)
at org.dynjs.runtime.ExecutionContext.execute(ExecutionContext.java:122)
... 6 more
===
=== ch15/15.1/15.1.3/15.1.3.4/S15.1.3.4_A2.1_T1 failed in non-strict mode ===
--- errors ---
Exception in thread "main" org.dynjs.exception.ThrowException: #0001-0020
at <global>.testFailed(/var/folders/vt/nrnb_cw95ps51fgmm9rq2mpw0000gn/T/test262-JxYvBU.js:289)
at <global>.$ERROR(/var/folders/vt/nrnb_cw95ps51fgmm9rq2mpw0000gn/T/test262-JxYvBU.js:305)
at <global>.<eval>(/var/folders/vt/nrnb_cw95ps51fgmm9rq2mpw0000gn/T/test262-JxYvBU.js:2200)
at org.dynjs.gen.Function13.call(Unknown Source)
at org.dynjs.runtime.ExecutionContext.call(ExecutionContext.java:139)
at org.dynjs.gen.Function17.call(Unknown Source)
at org.dynjs.runtime.ExecutionContext.call(ExecutionContext.java:139)
at org.dynjs.gen.ThenBlock28.call(Unknown Source)
at org.dynjs.gen.ThenBlock27.call(Unknown Source)
at org.dynjs.gen.ElseBlock25.call(Unknown Source)
at org.dynjs.gen.ForBlock20.call(Unknown Source)
at org.dynjs.gen.Program0.execute(Unknown Source)
at org.dynjs.runtime.ExecutionContext.execute(ExecutionContext.java:122)
at org.dynjs.runtime.DynJS.execute(DynJS.java:90)
at org.dynjs.runtime.DynJS.execute(DynJS.java:80)
at org.dynjs.runtime.DynJS.execute(DynJS.java:76)
at org.dynjs.cli.Main.executeFile(Main.java:73)
at org.dynjs.cli.Main.run(Main.java:60)
at org.dynjs.cli.Main.main(Main.java:46)
===
=== ch15/15.1/15.1.3/15.1.3.4/S15.1.3.4_A2.2_T1 failed in non-strict mode ===
--- errors ---
Exception in thread "main" org.dynjs.exception.ThrowException: #0080-07FF
at <global>.testFailed(/var/folders/vt/nrnb_cw95ps51fgmm9rq2mpw0000gn/T/test262-fPjPh0.js:289)
at <global>.$ERROR(/var/folders/vt/nrnb_cw95ps51fgmm9rq2mpw0000gn/T/test262-fPjPh0.js:305)
at <global>.<eval>(/var/folders/vt/nrnb_cw95ps51fgmm9rq2mpw0000gn/T/test262-fPjPh0.js:2214)
at org.dynjs.gen.Function13.call(Unknown Source)
at org.dynjs.runtime.ExecutionContext.call(ExecutionContext.java:139)
at org.dynjs.gen.Function17.call(Unknown Source)
at org.dynjs.runtime.ExecutionContext.call(ExecutionContext.java:139)
at org.dynjs.gen.ThenBlock77.call(Unknown Source)
at org.dynjs.gen.ThenBlock76.call(Unknown Source)
at org.dynjs.gen.Program0.execute(Unknown Source)
at org.dynjs.runtime.ExecutionContext.execute(ExecutionContext.java:122)
at org.dynjs.runtime.DynJS.execute(DynJS.java:90)
at org.dynjs.runtime.DynJS.execute(DynJS.java:80)
at org.dynjs.runtime.DynJS.execute(DynJS.java:76)
at org.dynjs.cli.Main.executeFile(Main.java:73)
at org.dynjs.cli.Main.run(Main.java:60)
at org.dynjs.cli.Main.main(Main.java:46)
===
=== ch15/15.1/15.1.3/15.1.3.4/S15.1.3.4_A2.3_T1 failed in non-strict mode ===
--- errors ---
Exception in thread "main" org.dynjs.exception.ThrowException: java.lang.NumberFormatException: For input string: "0x00.0E0"
at <global>.<eval>(/var/folders/vt/nrnb_cw95ps51fgmm9rq2mpw0000gn/T/test262-TOgykd.js:2185)
at org.dynjs.runtime.ExecutionContext.execute(ExecutionContext.java:126)
at org.dynjs.runtime.DynJS.execute(DynJS.java:90)
at org.dynjs.runtime.DynJS.execute(DynJS.java:80)
at org.dynjs.runtime.DynJS.execute(DynJS.java:76)
at org.dynjs.cli.Main.executeFile(Main.java:73)
at org.dynjs.cli.Main.run(Main.java:60)
at org.dynjs.cli.Main.main(Main.java:46)
Caused by: java.lang.NumberFormatException: For input string: "0x00.0E0"
at sun.misc.FloatingDecimal.parseHexString(FloatingDecimal.java:1891)
at sun.misc.FloatingDecimal.readJavaFormatString(FloatingDecimal.java:1063)
at java.lang.Double.valueOf(Double.java:504)
at org.dynjs.gen.ForBlock20.call(Unknown Source)
at org.dynjs.gen.Program0.execute(Unknown Source)
at org.dynjs.runtime.ExecutionContext.execute(ExecutionContext.java:122)
... 6 more
===
=== ch15/15.1/15.1.3/15.1.3.4/S15.1.3.4_A2.4_T1 failed in non-strict mode ===
--- errors ---
Exception in thread "main" org.dynjs.exception.ThrowException: #D800-DBFF
at <global>.testFailed(/var/folders/vt/nrnb_cw95ps51fgmm9rq2mpw0000gn/T/test262-xN5wJA.js:289)
at <global>.$ERROR(/var/folders/vt/nrnb_cw95ps51fgmm9rq2mpw0000gn/T/test262-xN5wJA.js:305)
at <global>.<eval>(/var/folders/vt/nrnb_cw95ps51fgmm9rq2mpw0000gn/T/test262-xN5wJA.js:2224)
at org.dynjs.gen.Function13.call(Unknown Source)
at org.dynjs.runtime.ExecutionContext.call(ExecutionContext.java:139)
at org.dynjs.gen.Function17.call(Unknown Source)
at org.dynjs.runtime.ExecutionContext.call(ExecutionContext.java:139)
at org.dynjs.gen.ThenBlock124.call(Unknown Source)
at org.dynjs.gen.ThenBlock123.call(Unknown Source)
at org.dynjs.gen.Program0.execute(Unknown Source)
at org.dynjs.runtime.ExecutionContext.execute(ExecutionContext.java:122)
at org.dynjs.runtime.DynJS.execute(DynJS.java:90)
at org.dynjs.runtime.DynJS.execute(DynJS.java:80)
at org.dynjs.runtime.DynJS.execute(DynJS.java:76)
at org.dynjs.cli.Main.executeFile(Main.java:73)
at org.dynjs.cli.Main.run(Main.java:60)
at org.dynjs.cli.Main.main(Main.java:46)
===
=== ch15/15.1/15.1.3/15.1.3.4/S15.1.3.4_A2.4_T2 failed in non-strict mode ===
--- errors ---
Exception in thread "main" org.dynjs.exception.ThrowException: #DC00-DFFF
at <global>.testFailed(/var/folders/vt/nrnb_cw95ps51fgmm9rq2mpw0000gn/T/test262-g_AA2f.js:289)
at <global>.$ERROR(/var/folders/vt/nrnb_cw95ps51fgmm9rq2mpw0000gn/T/test262-g_AA2f.js:305)
at <global>.<eval>(/var/folders/vt/nrnb_cw95ps51fgmm9rq2mpw0000gn/T/test262-g_AA2f.js:2224)
at org.dynjs.gen.Function13.call(Unknown Source)
at org.dynjs.runtime.ExecutionContext.call(ExecutionContext.java:139)
at org.dynjs.gen.Function17.call(Unknown Source)
at org.dynjs.runtime.ExecutionContext.call(ExecutionContext.java:139)
at org.dynjs.gen.ThenBlock124.call(Unknown Source)
at org.dynjs.gen.ThenBlock123.call(Unknown Source)
at org.dynjs.gen.Program0.execute(Unknown Source)
at org.dynjs.runtime.ExecutionContext.execute(ExecutionContext.java:122)
at org.dynjs.runtime.DynJS.execute(DynJS.java:90)
at org.dynjs.runtime.DynJS.execute(DynJS.java:80)
at org.dynjs.runtime.DynJS.execute(DynJS.java:76)
at org.dynjs.cli.Main.executeFile(Main.java:73)
at org.dynjs.cli.Main.run(Main.java:60)
at org.dynjs.cli.Main.main(Main.java:46)
===
=== ch15/15.1/15.1.3/15.1.3.4/S15.1.3.4_A2.5_T1 failed in non-strict mode ===
--- errors ---
Exception in thread "main" org.dynjs.exception.ThrowException: java.lang.NumberFormatException: For input string: "0x.0E000"
at <global>.<eval>(/var/folders/vt/nrnb_cw95ps51fgmm9rq2mpw0000gn/T/test262-LvW1Gl.js:2181)
at org.dynjs.runtime.ExecutionContext.execute(ExecutionContext.java:126)
at org.dynjs.runtime.DynJS.execute(DynJS.java:90)
at org.dynjs.runtime.DynJS.execute(DynJS.java:80)
at org.dynjs.runtime.DynJS.execute(DynJS.java:76)
at org.dynjs.cli.Main.executeFile(Main.java:73)
at org.dynjs.cli.Main.run(Main.java:60)
at org.dynjs.cli.Main.main(Main.java:46)
Caused by: java.lang.NumberFormatException: For input string: "0x.0E000"
at sun.misc.FloatingDecimal.parseHexString(FloatingDecimal.java:1891)
at sun.misc.FloatingDecimal.readJavaFormatString(FloatingDecimal.java:1063)
at java.lang.Double.valueOf(Double.java:504)
at org.dynjs.gen.Program0.execute(Unknown Source)
at org.dynjs.runtime.ExecutionContext.execute(ExecutionContext.java:122)
... 6 more
===
=== ch15/15.1/15.1.3/15.1.3.4/S15.1.3.4_A3.1_T1 failed in non-strict mode ===
--- errors ---
Exception in thread "main" org.dynjs.exception.ThrowException: ReferenceError: encodeURIComponent is not defined
at <global>.<eval>(/var/folders/vt/nrnb_cw95ps51fgmm9rq2mpw0000gn/T/test262-I80ucq.js:2181)
at org.dynjs.runtime.Reference.getValue(Reference.java:47)
at org.dynjs.runtime.Types.getValue(Types.java:347)
at org.dynjs.gen.ForBlock20.call(Unknown Source)
at org.dynjs.gen.Program0.execute(Unknown Source)
at org.dynjs.runtime.ExecutionContext.execute(ExecutionContext.java:122)
at org.dynjs.runtime.DynJS.execute(DynJS.java:90)
at org.dynjs.runtime.DynJS.execute(DynJS.java:80)
at org.dynjs.runtime.DynJS.execute(DynJS.java:76)
at org.dynjs.cli.Main.executeFile(Main.java:73)
at org.dynjs.cli.Main.run(Main.java:60)
at org.dynjs.cli.Main.main(Main.java:46)
===
=== ch15/15.1/15.1.3/15.1.3.4/S15.1.3.4_A3.2_T1 failed in non-strict mode ===
--- errors ---
Exception in thread "main" org.dynjs.exception.ThrowException: ReferenceError: encodeURIComponent is not defined
at <global>.<eval>(/var/folders/vt/nrnb_cw95ps51fgmm9rq2mpw0000gn/T/test262-_ThR0Z.js:2180)
at org.dynjs.runtime.Reference.getValue(Reference.java:47)
at org.dynjs.runtime.Types.getValue(Types.java:347)
at org.dynjs.gen.ForBlock20.call(Unknown Source)
at org.dynjs.gen.Program0.execute(Unknown Source)
at org.dynjs.runtime.ExecutionContext.execute(ExecutionContext.java:122)
at org.dynjs.runtime.DynJS.execute(DynJS.java:90)
at org.dynjs.runtime.DynJS.execute(DynJS.java:80)
at org.dynjs.runtime.DynJS.execute(DynJS.java:76)
at org.dynjs.cli.Main.executeFile(Main.java:73)
at org.dynjs.cli.Main.run(Main.java:60)
at org.dynjs.cli.Main.main(Main.java:46)
===
=== ch15/15.1/15.1.3/15.1.3.4/S15.1.3.4_A3.2_T2 failed in non-strict mode ===
--- errors ---
Exception in thread "main" org.dynjs.exception.ThrowException: ReferenceError: encodeURIComponent is not defined
at <global>.<eval>(/var/folders/vt/nrnb_cw95ps51fgmm9rq2mpw0000gn/T/test262-7V_TQQ.js:2180)
at org.dynjs.runtime.Reference.getValue(Reference.java:47)
at org.dynjs.runtime.Types.getValue(Types.java:347)
at org.dynjs.gen.ForBlock20.call(Unknown Source)
at org.dynjs.gen.Program0.execute(Unknown Source)
at org.dynjs.runtime.ExecutionContext.execute(ExecutionContext.java:122)
at org.dynjs.runtime.DynJS.execute(DynJS.java:90)
at org.dynjs.runtime.DynJS.execute(DynJS.java:80)
at org.dynjs.runtime.DynJS.execute(DynJS.java:76)
at org.dynjs.cli.Main.executeFile(Main.java:73)
at org.dynjs.cli.Main.run(Main.java:60)
at org.dynjs.cli.Main.main(Main.java:46)
===
=== ch15/15.1/15.1.3/15.1.3.4/S15.1.3.4_A3.2_T3 failed in non-strict mode ===
--- errors ---
Exception in thread "main" org.dynjs.exception.ThrowException: ReferenceError: encodeURIComponent is not defined
at <global>.<eval>(/var/folders/vt/nrnb_cw95ps51fgmm9rq2mpw0000gn/T/test262-8H_Cle.js:2180)
at org.dynjs.runtime.Reference.getValue(Reference.java:47)
at org.dynjs.runtime.Types.getValue(Types.java:347)
at org.dynjs.gen.ForBlock20.call(Unknown Source)
at org.dynjs.gen.Program0.execute(Unknown Source)
at org.dynjs.runtime.ExecutionContext.execute(ExecutionContext.java:122)
at org.dynjs.runtime.DynJS.execute(DynJS.java:90)
at org.dynjs.runtime.DynJS.execute(DynJS.java:80)
at org.dynjs.runtime.DynJS.execute(DynJS.java:76)
at org.dynjs.cli.Main.executeFile(Main.java:73)
at org.dynjs.cli.Main.run(Main.java:60)
at org.dynjs.cli.Main.main(Main.java:46)
===
=== ch15/15.1/15.1.3/15.1.3.4/S15.1.3.4_A3.3_T1 failed in non-strict mode ===
--- errors ---
Exception in thread "main" org.dynjs.exception.ThrowException: ReferenceError: encodeURIComponent is not defined
at <global>.<eval>(/var/folders/vt/nrnb_cw95ps51fgmm9rq2mpw0000gn/T/test262-rxvra_.js:2177)
at org.dynjs.runtime.Reference.getValue(Reference.java:47)
at org.dynjs.runtime.Types.getValue(Types.java:347)
at org.dynjs.gen.Program0.execute(Unknown Source)
at org.dynjs.runtime.ExecutionContext.execute(ExecutionContext.java:122)
at org.dynjs.runtime.DynJS.execute(DynJS.java:90)
at org.dynjs.runtime.DynJS.execute(DynJS.java:80)
at org.dynjs.runtime.DynJS.execute(DynJS.java:76)
at org.dynjs.cli.Main.executeFile(Main.java:73)
at org.dynjs.cli.Main.run(Main.java:60)
at org.dynjs.cli.Main.main(Main.java:46)
===
=== ch15/15.1/15.1.3/15.1.3.4/S15.1.3.4_A4_T1 failed in non-strict mode ===
--- errors ---
Exception in thread "main" org.dynjs.exception.ThrowException: ReferenceError: encodeURIComponent is not defined
at <global>.<eval>(/var/folders/vt/nrnb_cw95ps51fgmm9rq2mpw0000gn/T/test262-3HuPLC.js:2178)
at org.dynjs.runtime.Reference.getValue(Reference.java:47)
at org.dynjs.runtime.Types.getValue(Types.java:347)
at org.dynjs.gen.Program0.execute(Unknown Source)
at org.dynjs.runtime.ExecutionContext.execute(ExecutionContext.java:122)
at org.dynjs.runtime.DynJS.execute(DynJS.java:90)
at org.dynjs.runtime.DynJS.execute(DynJS.java:80)
at org.dynjs.runtime.DynJS.execute(DynJS.java:76)
at org.dynjs.cli.Main.executeFile(Main.java:73)
at org.dynjs.cli.Main.run(Main.java:60)
at org.dynjs.cli.Main.main(Main.java:46)
===
=== ch15/15.1/15.1.3/15.1.3.4/S15.1.3.4_A4_T2 failed in non-strict mode ===
--- errors ---
Exception in thread "main" org.dynjs.exception.ThrowException: ReferenceError: encodeURIComponent is not defined
at <global>.<eval>(/var/folders/vt/nrnb_cw95ps51fgmm9rq2mpw0000gn/T/test262-eftkeU.js:2178)
at org.dynjs.runtime.Reference.getValue(Reference.java:47)
at org.dynjs.runtime.Types.getValue(Types.java:347)
at org.dynjs.gen.Program0.execute(Unknown Source)
at org.dynjs.runtime.ExecutionContext.execute(ExecutionContext.java:122)
at org.dynjs.runtime.DynJS.execute(DynJS.java:90)
at org.dynjs.runtime.DynJS.execute(DynJS.java:80)
at org.dynjs.runtime.DynJS.execute(DynJS.java:76)
at org.dynjs.cli.Main.executeFile(Main.java:73)
at org.dynjs.cli.Main.run(Main.java:60)
at org.dynjs.cli.Main.main(Main.java:46)
===
=== ch15/15.1/15.1.3/15.1.3.4/S15.1.3.4_A4_T3 failed in non-strict mode ===
--- errors ---
Exception in thread "main" org.dynjs.exception.ThrowException: ReferenceError: encodeURIComponent is not defined
at <global>.<eval>(/var/folders/vt/nrnb_cw95ps51fgmm9rq2mpw0000gn/T/test262-QXCqlV.js:2178)
at org.dynjs.runtime.Reference.getValue(Reference.java:47)
at org.dynjs.runtime.Types.getValue(Types.java:347)
at org.dynjs.gen.Program0.execute(Unknown Source)
at org.dynjs.runtime.ExecutionContext.execute(ExecutionContext.java:122)
at org.dynjs.runtime.DynJS.execute(DynJS.java:90)
at org.dynjs.runtime.DynJS.execute(DynJS.java:80)
at org.dynjs.runtime.DynJS.execute(DynJS.java:76)
at org.dynjs.cli.Main.executeFile(Main.java:73)
at org.dynjs.cli.Main.run(Main.java:60)
at org.dynjs.cli.Main.main(Main.java:46)
===
=== ch15/15.1/15.1.3/15.1.3.4/S15.1.3.4_A4_T4 failed in non-strict mode ===
--- errors ---
Exception in thread "main" org.dynjs.exception.ThrowException: ReferenceError: encodeURIComponent is not defined
at <global>.<eval>(/var/folders/vt/nrnb_cw95ps51fgmm9rq2mpw0000gn/T/test262-_XGIRU.js:2178)
at org.dynjs.runtime.Reference.getValue(Reference.java:47)
at org.dynjs.runtime.Types.getValue(Types.java:347)
at org.dynjs.gen.Program0.execute(Unknown Source)
at org.dynjs.runtime.ExecutionContext.execute(ExecutionContext.java:122)
at org.dynjs.runtime.DynJS.execute(DynJS.java:90)
at org.dynjs.runtime.DynJS.execute(DynJS.java:80)
at org.dynjs.runtime.DynJS.execute(DynJS.java:76)
at org.dynjs.cli.Main.executeFile(Main.java:73)
at org.dynjs.cli.Main.run(Main.java:60)
at org.dynjs.cli.Main.main(Main.java:46)
===
=== ch15/15.1/15.1.3/15.1.3.4/S15.1.3.4_A5.1 failed in non-strict mode ===
--- errors ---
Exception in thread "main" org.dynjs.exception.ThrowException: ReferenceError: encodeURIComponent is not defined
at <global>.<eval>(/var/folders/vt/nrnb_cw95ps51fgmm9rq2mpw0000gn/T/test262-XZSEvN.js:2178)
at org.dynjs.runtime.Reference.getValue(Reference.java:47)
at org.dynjs.runtime.Types.getValue(Types.java:347)
at org.dynjs.gen.Program0.execute(Unknown Source)
at org.dynjs.runtime.ExecutionContext.execute(ExecutionContext.java:122)
at org.dynjs.runtime.DynJS.execute(DynJS.java:90)
at org.dynjs.runtime.DynJS.execute(DynJS.java:80)
at org.dynjs.runtime.DynJS.execute(DynJS.java:76)
at org.dynjs.cli.Main.executeFile(Main.java:73)
at org.dynjs.cli.Main.run(Main.java:60)
at org.dynjs.cli.Main.main(Main.java:46)
===
=== ch15/15.1/15.1.3/15.1.3.4/S15.1.3.4_A5.2 failed in non-strict mode ===
--- errors ---
Exception in thread "main" org.dynjs.exception.ThrowException: ReferenceError: encodeURIComponent is not defined
at <global>.<eval>(/var/folders/vt/nrnb_cw95ps51fgmm9rq2mpw0000gn/T/test262-QsqE51.js:2178)
at org.dynjs.runtime.Reference.getValue(Reference.java:47)
at org.dynjs.runtime.Types.getValue(Types.java:347)
at org.dynjs.gen.Program0.execute(Unknown Source)
at org.dynjs.runtime.ExecutionContext.execute(ExecutionContext.java:122)
at org.dynjs.runtime.DynJS.execute(DynJS.java:90)
at org.dynjs.runtime.DynJS.execute(DynJS.java:80)
at org.dynjs.runtime.DynJS.execute(DynJS.java:76)
at org.dynjs.cli.Main.executeFile(Main.java:73)
at org.dynjs.cli.Main.run(Main.java:60)
at org.dynjs.cli.Main.main(Main.java:46)
===
=== ch15/15.1/15.1.3/15.1.3.4/S15.1.3.4_A5.3 failed in non-strict mode ===
--- errors ---
Exception in thread "main" org.dynjs.exception.ThrowException: ReferenceError: encodeURIComponent is not defined
at <global>.<eval>(/var/folders/vt/nrnb_cw95ps51fgmm9rq2mpw0000gn/T/test262-lVdLBO.js:2178)
at org.dynjs.runtime.Reference.getValue(Reference.java:47)
at org.dynjs.runtime.Types.getValue(Types.java:347)
at org.dynjs.gen.Program0.execute(Unknown Source)
at org.dynjs.runtime.ExecutionContext.execute(ExecutionContext.java:122)
at org.dynjs.runtime.DynJS.execute(DynJS.java:90)
at org.dynjs.runtime.DynJS.execute(DynJS.java:80)
at org.dynjs.runtime.DynJS.execute(DynJS.java:76)
at org.dynjs.cli.Main.executeFile(Main.java:73)
at org.dynjs.cli.Main.run(Main.java:60)
at org.dynjs.cli.Main.main(Main.java:46)
===
=== ch15/15.1/15.1.3/15.1.3.4/S15.1.3.4_A5.4 failed in non-strict mode ===
--- errors ---
Exception in thread "main" org.dynjs.exception.ThrowException: ReferenceError: encodeURIComponent is not defined
at <global>.<eval>(/var/folders/vt/nrnb_cw95ps51fgmm9rq2mpw0000gn/T/test262-kOd1uI.js:2178)
at org.dynjs.runtime.Reference.getValue(Reference.java:47)
at org.dynjs.runtime.Types.getValue(Types.java:347)
at org.dynjs.gen.Program0.execute(Unknown Source)
at org.dynjs.runtime.ExecutionContext.execute(ExecutionContext.java:122)
at org.dynjs.runtime.DynJS.execute(DynJS.java:90)
at org.dynjs.runtime.DynJS.execute(DynJS.java:80)
at org.dynjs.runtime.DynJS.execute(DynJS.java:76)
at org.dynjs.cli.Main.executeFile(Main.java:73)
at org.dynjs.cli.Main.run(Main.java:60)
at org.dynjs.cli.Main.main(Main.java:46)
===
ch15/15.1/15.1.3/15.1.3.4/S15.1.3.4_A5.5 passed in non-strict mode
=== ch15/15.1/15.1.3/15.1.3.4/S15.1.3.4_A5.6 failed in non-strict mode ===
--- errors ---
Exception in thread "main" org.dynjs.exception.ThrowException: ReferenceError: encodeURIComponent is not defined
at <global>.<eval>(/var/folders/vt/nrnb_cw95ps51fgmm9rq2mpw0000gn/T/test262-5G8OuI.js:2178)
at org.dynjs.runtime.Reference.getValue(Reference.java:47)
at org.dynjs.runtime.Types.getValue(Types.java:347)
at org.dynjs.gen.Program0.execute(Unknown Source)
at org.dynjs.runtime.ExecutionContext.execute(ExecutionContext.java:122)
at org.dynjs.runtime.DynJS.execute(DynJS.java:90)
at org.dynjs.runtime.DynJS.execute(DynJS.java:80)
at org.dynjs.runtime.DynJS.execute(DynJS.java:76)
at org.dynjs.cli.Main.executeFile(Main.java:73)
at org.dynjs.cli.Main.run(Main.java:60)
at org.dynjs.cli.Main.main(Main.java:46)
===
=== ch15/15.1/15.1.3/15.1.3.4/S15.1.3.4_A5.7 failed in non-strict mode ===
--- errors ---
Exception in thread "main" org.dynjs.exception.ThrowException: #1.2: new encodeURIComponent() throw TypeError. Actual: ReferenceError: encodeURIComponent is not defined
at <global>.testFailed(/var/folders/vt/nrnb_cw95ps51fgmm9rq2mpw0000gn/T/test262-BFxAg4.js:289)
at <global>.$ERROR(/var/folders/vt/nrnb_cw95ps51fgmm9rq2mpw0000gn/T/test262-BFxAg4.js:305)
at <global>.<eval>(/var/folders/vt/nrnb_cw95ps51fgmm9rq2mpw0000gn/T/test262-BFxAg4.js:2184)
at org.dynjs.gen.Function13.call(Unknown Source)
at org.dynjs.runtime.ExecutionContext.call(ExecutionContext.java:139)
at org.dynjs.gen.Function17.call(Unknown Source)
at org.dynjs.runtime.ExecutionContext.call(ExecutionContext.java:139)
at org.dynjs.gen.ThenBlock22.call(Unknown Source)
at org.dynjs.gen.CatchBlock21.call(Unknown Source)
at org.dynjs.runtime.ExecutionContext.executeCatch(ExecutionContext.java:235)
at org.dynjs.gen.Program0.execute(Unknown Source)
at org.dynjs.runtime.ExecutionContext.execute(ExecutionContext.java:122)
at org.dynjs.runtime.DynJS.execute(DynJS.java:90)
at org.dynjs.runtime.DynJS.execute(DynJS.java:80)
at org.dynjs.runtime.DynJS.execute(DynJS.java:76)
at org.dynjs.cli.Main.executeFile(Main.java:73)
at org.dynjs.cli.Main.run(Main.java:60)
at org.dynjs.cli.Main.main(Main.java:46)
===
=== ch15/15.1/15.1.3/15.1.3.4/S15.1.3.4_A6_T1 failed in non-strict mode ===
--- errors ---
Exception in thread "main" org.dynjs.exception.ThrowException: ReferenceError: encodeURIComponent is not defined
at <global>.<eval>(/var/folders/vt/nrnb_cw95ps51fgmm9rq2mpw0000gn/T/test262-E9BuEo.js:2179)
at org.dynjs.runtime.Reference.getValue(Reference.java:47)
at org.dynjs.runtime.Types.getValue(Types.java:347)
at org.dynjs.gen.Program0.execute(Unknown Source)
at org.dynjs.runtime.ExecutionContext.execute(ExecutionContext.java:122)
at org.dynjs.runtime.DynJS.execute(DynJS.java:90)
at org.dynjs.runtime.DynJS.execute(DynJS.java:80)
at org.dynjs.runtime.DynJS.execute(DynJS.java:76)
at org.dynjs.cli.Main.executeFile(Main.java:73)
at org.dynjs.cli.Main.run(Main.java:60)
at org.dynjs.cli.Main.main(Main.java:46)
===
ch15/15.10/15.10.1/S15.10.1_A1_T1 passed in non-strict mode
ch15/15.10/15.10.1/S15.10.1_A1_T10 passed in non-strict mode
ch15/15.10/15.10.1/S15.10.1_A1_T11 passed in non-strict mode
ch15/15.10/15.10.1/S15.10.1_A1_T12 passed in non-strict mode
=== ch15/15.10/15.10.1/S15.10.1_A1_T13 failed in non-strict mode ===
--- errors ---
Exception in thread "main" org.dynjs.exception.ThrowException: #1.2: new RegExp("x{1}{1,}") throw SyntaxError. Actual: Test262 Error: #1.1: new RegExp("x{1}{1,}") throw SyntaxError. Actual: /x{1}{1,}/
at <global>.testFailed(/var/folders/vt/nrnb_cw95ps51fgmm9rq2mpw0000gn/T/test262-QPPwVw.js:289)
at <global>.$ERROR(/var/folders/vt/nrnb_cw95ps51fgmm9rq2mpw0000gn/T/test262-QPPwVw.js:305)
at <global>.<eval>(/var/folders/vt/nrnb_cw95ps51fgmm9rq2mpw0000gn/T/test262-QPPwVw.js:2182)
at org.dynjs.gen.Function13.call(Unknown Source)
at org.dynjs.runtime.ExecutionContext.call(ExecutionContext.java:139)
at org.dynjs.gen.Function17.call(Unknown Source)
at org.dynjs.runtime.ExecutionContext.call(ExecutionContext.java:139)
at org.dynjs.gen.ThenBlock23.call(Unknown Source)
at org.dynjs.gen.CatchBlock22.call(Unknown Source)
at org.dynjs.runtime.ExecutionContext.executeCatch(ExecutionContext.java:235)
at org.dynjs.gen.Program0.execute(Unknown Source)
at org.dynjs.runtime.ExecutionContext.execute(ExecutionContext.java:122)
at org.dynjs.runtime.DynJS.execute(DynJS.java:90)
at org.dynjs.runtime.DynJS.execute(DynJS.java:80)
at org.dynjs.runtime.DynJS.execute(DynJS.java:76)
at org.dynjs.cli.Main.executeFile(Main.java:73)
at org.dynjs.cli.Main.run(Main.java:60)
at org.dynjs.cli.Main.main(Main.java:46)
===
=== ch15/15.10/15.10.1/S15.10.1_A1_T14 failed in non-strict mode ===
--- errors ---
Exception in thread "main" org.dynjs.exception.ThrowException: #1.2: new RegExp("x{1,2}{1}") throw SyntaxError. Actual: Test262 Error: #1.1: new RegExp("x{1,2}{1}") throw SyntaxError. Actual: /x{1,2}{1}/
at <global>.testFailed(/var/folders/vt/nrnb_cw95ps51fgmm9rq2mpw0000gn/T/test262-ELT6yZ.js:289)
at <global>.$ERROR(/var/folders/vt/nrnb_cw95ps51fgmm9rq2mpw0000gn/T/test262-ELT6yZ.js:305)
at <global>.<eval>(/var/folders/vt/nrnb_cw95ps51fgmm9rq2mpw0000gn/T/test262-ELT6yZ.js:2182)
at org.dynjs.gen.Function13.call(Unknown Source)
at org.dynjs.runtime.ExecutionContext.call(ExecutionContext.java:139)
at org.dynjs.gen.Function17.call(Unknown Source)
at org.dynjs.runtime.ExecutionContext.call(ExecutionContext.java:139)
at org.dynjs.gen.ThenBlock23.call(Unknown Source)
at org.dynjs.gen.CatchBlock22.call(Unknown Source)
at org.dynjs.runtime.ExecutionContext.executeCatch(ExecutionContext.java:235)
at org.dynjs.gen.Program0.execute(Unknown Source)
at org.dynjs.runtime.ExecutionContext.execute(ExecutionContext.java:122)
at org.dynjs.runtime.DynJS.execute(DynJS.java:90)
at org.dynjs.runtime.DynJS.execute(DynJS.java:80)
at org.dynjs.runtime.DynJS.execute(DynJS.java:76)
at org.dynjs.cli.Main.executeFile(Main.java:73)
at org.dynjs.cli.Main.run(Main.java:60)
at org.dynjs.cli.Main.main(Main.java:46)
===
=== ch15/15.10/15.10.1/S15.10.1_A1_T15 failed in non-strict mode ===
--- errors ---
Exception in thread "main" org.dynjs.exception.ThrowException: #1.2: new RegExp("x{1,}{1}") throw SyntaxError. Actual: Test262 Error: #1.1: new RegExp("x{1,}{1}") throw SyntaxError. Actual: /x{1,}{1}/
at <global>.testFailed(/var/folders/vt/nrnb_cw95ps51fgmm9rq2mpw0000gn/T/test262-FgHewa.js:289)
at <global>.$ERROR(/var/folders/vt/nrnb_cw95ps51fgmm9rq2mpw0000gn/T/test262-FgHewa.js:305)
at <global>.<eval>(/var/folders/vt/nrnb_cw95ps51fgmm9rq2mpw0000gn/T/test262-FgHewa.js:2182)
at org.dynjs.gen.Function13.call(Unknown Source)
at org.dynjs.runtime.ExecutionContext.call(ExecutionContext.java:139)
at org.dynjs.gen.Function17.call(Unknown Source)
at org.dynjs.runtime.ExecutionContext.call(ExecutionContext.java:139)
at org.dynjs.gen.ThenBlock23.call(Unknown Source)
at org.dynjs.gen.CatchBlock22.call(Unknown Source)
at org.dynjs.runtime.ExecutionContext.executeCatch(ExecutionContext.java:235)
at org.dynjs.gen.Program0.execute(Unknown Source)
at org.dynjs.runtime.ExecutionContext.execute(ExecutionContext.java:122)
at org.dynjs.runtime.DynJS.execute(DynJS.java:90)
at org.dynjs.runtime.DynJS.execute(DynJS.java:80)
at org.dynjs.runtime.DynJS.execute(DynJS.java:76)
at org.dynjs.cli.Main.executeFile(Main.java:73)
at org.dynjs.cli.Main.run(Main.java:60)
at org.dynjs.cli.Main.main(Main.java:46)
===
=== ch15/15.10/15.10.1/S15.10.1_A1_T16 failed in non-strict mode ===
--- errors ---
Exception in thread "main" org.dynjs.exception.ThrowException: #1.2: new RegExp("x{0,1}{1,}") throw SyntaxError. Actual: Test262 Error: #1.1: new RegExp("x{0,1}{1,}") throw SyntaxError. Actual: /x{0,1}{1,}/
at <global>.testFailed(/var/folders/vt/nrnb_cw95ps51fgmm9rq2mpw0000gn/T/test262-h0_RS_.js:289)
at <global>.$ERROR(/var/folders/vt/nrnb_cw95ps51fgmm9rq2mpw0000gn/T/test262-h0_RS_.js:305)
at <global>.<eval>(/var/folders/vt/nrnb_cw95ps51fgmm9rq2mpw0000gn/T/test262-h0_RS_.js:2182)
at org.dynjs.gen.Function13.call(Unknown Source)
at org.dynjs.runtime.ExecutionContext.call(ExecutionContext.java:139)
at org.dynjs.gen.Function17.call(Unknown Source)
at org.dynjs.runtime.ExecutionContext.call(ExecutionContext.java:139)
at org.dynjs.gen.ThenBlock23.call(Unknown Source)
at org.dynjs.gen.CatchBlock22.call(Unknown Source)
at org.dynjs.runtime.ExecutionContext.executeCatch(ExecutionContext.java:235)
at org.dynjs.gen.Program0.execute(Unknown Source)
at org.dynjs.runtime.ExecutionContext.execute(ExecutionContext.java:122)
at org.dynjs.runtime.DynJS.execute(DynJS.java:90)
at org.dynjs.runtime.DynJS.execute(DynJS.java:80)
at org.dynjs.runtime.DynJS.execute(DynJS.java:76)
at org.dynjs.cli.Main.executeFile(Main.java:73)
at org.dynjs.cli.Main.run(Main.java:60)
at org.dynjs.cli.Main.main(Main.java:46)
===
ch15/15.10/15.10.1/S15.10.1_A1_T2 passed in non-strict mode
=== ch15/15.10/15.10.1/S15.10.1_A1_T3 failed in non-strict mode ===
--- errors ---
Exception in thread "main" org.dynjs.exception.ThrowException: #1.2: new RegExp("a++") throw SyntaxError. Actual: Test262 Error: #1.1: new RegExp("a++") throw SyntaxError. Actual: /a++/
at <global>.testFailed(/var/folders/vt/nrnb_cw95ps51fgmm9rq2mpw0000gn/T/test262-cWAlFp.js:289)
at <global>.$ERROR(/var/folders/vt/nrnb_cw95ps51fgmm9rq2mpw0000gn/T/test262-cWAlFp.js:305)
at <global>.<eval>(/var/folders/vt/nrnb_cw95ps51fgmm9rq2mpw0000gn/T/test262-cWAlFp.js:2182)
at org.dynjs.gen.Function13.call(Unknown Source)
at org.dynjs.runtime.ExecutionContext.call(ExecutionContext.java:139)
at org.dynjs.gen.Function17.call(Unknown Source)
at org.dynjs.runtime.ExecutionContext.call(ExecutionContext.java:139)
at org.dynjs.gen.ThenBlock23.call(Unknown Source)
at org.dynjs.gen.CatchBlock22.call(Unknown Source)
at org.dynjs.runtime.ExecutionContext.executeCatch(ExecutionContext.java:235)
at org.dynjs.gen.Program0.execute(Unknown Source)
at org.dynjs.runtime.ExecutionContext.execute(ExecutionContext.java:122)
at org.dynjs.runtime.DynJS.execute(DynJS.java:90)
at org.dynjs.runtime.DynJS.execute(DynJS.java:80)
at org.dynjs.runtime.DynJS.execute(DynJS.java:76)
at org.dynjs.cli.Main.executeFile(Main.java:73)
at org.dynjs.cli.Main.run(Main.java:60)
at org.dynjs.cli.Main.main(Main.java:46)
===
ch15/15.10/15.10.1/S15.10.1_A1_T4 passed in non-strict mode
ch15/15.10/15.10.1/S15.10.1_A1_T5 passed in non-strict mode
ch15/15.10/15.10.1/S15.10.1_A1_T6 passed in non-strict mode
ch15/15.10/15.10.1/S15.10.1_A1_T7 passed in non-strict mode
ch15/15.10/15.10.1/S15.10.1_A1_T8 passed in non-strict mode
ch15/15.10/15.10.1/S15.10.1_A1_T9 passed in non-strict mode
ch15/15.10/15.10.2/15.10.2.15-3-1 passed in non-strict mode
ch15/15.10/15.10.2/15.10.2.15-3-2 passed in non-strict mode
ch15/15.10/15.10.2/15.10.2.15-6-1 passed in non-strict mode
ch15/15.10/15.10.2/15.10.2.2-1 passed in non-strict mode
ch15/15.10/15.10.2/15.10.2.5-3-1 passed in non-strict mode
ch15/15.10/15.10.2/S15.10.2_A1_T1 passed in non-strict mode
ch15/15.10/15.10.2/15.10.2.10/S15.10.2.10_A1.1_T1 passed in non-strict mode
ch15/15.10/15.10.2/15.10.2.10/S15.10.2.10_A1.2_T1 passed in non-strict mode
ch15/15.10/15.10.2/15.10.2.10/S15.10.2.10_A1.3_T1 passed in non-strict mode
ch15/15.10/15.10.2/15.10.2.10/S15.10.2.10_A1.4_T1 passed in non-strict mode
ch15/15.10/15.10.2/15.10.2.10/S15.10.2.10_A1.5_T1 passed in non-strict mode
ch15/15.10/15.10.2/15.10.2.10/S15.10.2.10_A2.1_T1 passed in non-strict mode
=== ch15/15.10/15.10.2/15.10.2.10/S15.10.2.10_A2.1_T2 failed in non-strict mode ===
--- errors ---
Exception in thread "main" org.dynjs.exception.ThrowException: #1: CharacterEscape :: c a - z
at <global>.testFailed(/var/folders/vt/nrnb_cw95ps51fgmm9rq2mpw0000gn/T/test262-FVTbew.js:289)
at <global>.$ERROR(/var/folders/vt/nrnb_cw95ps51fgmm9rq2mpw0000gn/T/test262-FVTbew.js:305)
at <global>.<eval>(/var/folders/vt/nrnb_cw95ps51fgmm9rq2mpw0000gn/T/test262-FVTbew.js:2188)
at org.dynjs.gen.Function13.call(Unknown Source)
at org.dynjs.runtime.ExecutionContext.call(ExecutionContext.java:139)
at org.dynjs.gen.Function17.call(Unknown Source)
at org.dynjs.runtime.ExecutionContext.call(ExecutionContext.java:139)
at org.dynjs.gen.ThenBlock22.call(Unknown Source)
at org.dynjs.gen.Program0.execute(Unknown Source)
at org.dynjs.runtime.ExecutionContext.execute(ExecutionContext.java:122)
at org.dynjs.runtime.DynJS.execute(DynJS.java:90)
at org.dynjs.runtime.DynJS.execute(DynJS.java:80)
at org.dynjs.runtime.DynJS.execute(DynJS.java:76)
at org.dynjs.cli.Main.executeFile(Main.java:73)
at org.dynjs.cli.Main.run(Main.java:60)
at org.dynjs.cli.Main.main(Main.java:46)
===
ch15/15.10/15.10.2/15.10.2.10/S15.10.2.10_A2.1_T3 passed in non-strict mode
ch15/15.10/15.10.2/15.10.2.10/S15.10.2.10_A3.1_T1 passed in non-strict mode
ch15/15.10/15.10.2/15.10.2.10/S15.10.2.10_A3.1_T2 passed in non-strict mode
ch15/15.10/15.10.2/15.10.2.10/S15.10.2.10_A4.1_T1 passed in non-strict mode
ch15/15.10/15.10.2/15.10.2.10/S15.10.2.10_A4.1_T2 passed in non-strict mode
ch15/15.10/15.10.2/15.10.2.10/S15.10.2.10_A4.1_T3 passed in non-strict mode
=== ch15/15.10/15.10.2/15.10.2.10/S15.10.2.10_A5.1_T1 failed in non-strict mode ===
--- errors ---
Exception in thread "main" org.dynjs.exception.ThrowException: SyntaxError: Illegal Unicode escape sequence near index 2
\undefined
^
at <global>.<native function: BuiltinRegExp>(org/dynjs/runtime/builtins/types/BuiltinRegExp.java:0)
at <global>.<eval>(/var/folders/vt/nrnb_cw95ps51fgmm9rq2mpw0000gn/T/test262-jRVrAE.js:2182)
at org.dynjs.runtime.builtins.types.regexp.DynRegExp.setPatternAndFlags(DynRegExp.java:113)
at org.dynjs.runtime.builtins.types.BuiltinRegExp.call(BuiltinRegExp.java:52)
at org.dynjs.runtime.AbstractNativeFunction.call(AbstractNativeFunction.java:62)
at org.dynjs.runtime.ExecutionContext.call(ExecutionContext.java:139)
at org.dynjs.runtime.ExecutionContext.construct(ExecutionContext.java:177)
at org.dynjs.gen.DoBlock20.call(Unknown Source)
at org.dynjs.gen.Program0.execute(Unknown Source)
at org.dynjs.runtime.ExecutionContext.execute(ExecutionContext.java:122)
at org.dynjs.runtime.DynJS.execute(DynJS.java:90)
at org.dynjs.runtime.DynJS.execute(DynJS.java:80)
at org.dynjs.runtime.DynJS.execute(DynJS.java:76)
at org.dynjs.cli.Main.executeFile(Main.java:73)
at org.dynjs.cli.Main.run(Main.java:60)
at org.dynjs.cli.Main.main(Main.java:46)
===
=== ch15/15.10/15.10.2/15.10.2.11/S15.10.2.11_A1_T1 failed in non-strict mode ===
--- errors ---
Exception in thread "main" org.dynjs.exception.ThrowException: SyntaxError: Illegal octal escape sequence near index 2
\0
^
at <global>.<native function: BuiltinRegExp>(org/dynjs/runtime/builtins/types/BuiltinRegExp.java:0)
at <global>.<eval>(/var/folders/vt/nrnb_cw95ps51fgmm9rq2mpw0000gn/T/test262-eWIiEY.js:2178)
at org.dynjs.runtime.builtins.types.regexp.DynRegExp.setPatternAndFlags(DynRegExp.java:113)
at org.dynjs.runtime.builtins.types.BuiltinRegExp.call(BuiltinRegExp.java:52)
at org.dynjs.runtime.AbstractNativeFunction.call(AbstractNativeFunction.java:62)
at org.dynjs.runtime.ExecutionContext.call(ExecutionContext.java:139)
at org.dynjs.runtime.ExecutionContext.construct(ExecutionContext.java:177)
at org.dynjs.runtime.builtins.types.BuiltinRegExp.newRegExp(BuiltinRegExp.java:65)
at org.dynjs.gen.Program0.execute(Unknown Source)
at org.dynjs.runtime.ExecutionContext.execute(ExecutionContext.java:122)
at org.dynjs.runtime.DynJS.execute(DynJS.java:90)
at org.dynjs.runtime.DynJS.execute(DynJS.java:80)
at org.dynjs.runtime.DynJS.execute(DynJS.java:76)
at org.dynjs.cli.Main.executeFile(Main.java:73)
at org.dynjs.cli.Main.run(Main.java:60)
at org.dynjs.cli.Main.main(Main.java:46)
===
ch15/15.10/15.10.2/15.10.2.11/S15.10.2.11_A1_T4 passed in non-strict mode
=== ch15/15.10/15.10.2/15.10.2.11/S15.10.2.11_A1_T5 failed in non-strict mode ===
--- errors ---
Exception in thread "main" org.dynjs.exception.ThrowException: #1: var arr = (/\1(A)/.exec("AA")); arr[0] === "A". Actual. null
at <global>.testFailed(/var/folders/vt/nrnb_cw95ps51fgmm9rq2mpw0000gn/T/test262-iCAyMo.js:289)
at <global>.$ERROR(/var/folders/vt/nrnb_cw95ps51fgmm9rq2mpw0000gn/T/test262-iCAyMo.js:305)
at <global>.<eval>(/var/folders/vt/nrnb_cw95ps51fgmm9rq2mpw0000gn/T/test262-iCAyMo.js:2181)
at org.dynjs.gen.Function13.call(Unknown Source)
at org.dynjs.runtime.ExecutionContext.call(ExecutionContext.java:139)
at org.dynjs.gen.Function17.call(Unknown Source)
at org.dynjs.runtime.ExecutionContext.call(ExecutionContext.java:139)
at org.dynjs.gen.ThenBlock20.call(Unknown Source)
at org.dynjs.gen.Program0.execute(Unknown Source)
at org.dynjs.runtime.ExecutionContext.execute(ExecutionContext.java:122)
at org.dynjs.runtime.DynJS.execute(DynJS.java:90)
at org.dynjs.runtime.DynJS.execute(DynJS.java:80)
at org.dynjs.runtime.DynJS.execute(DynJS.java:76)
at org.dynjs.cli.Main.executeFile(Main.java:73)
at org.dynjs.cli.Main.run(Main.java:60)
at org.dynjs.cli.Main.main(Main.java:46)
===
ch15/15.10/15.10.2/15.10.2.11/S15.10.2.11_A1_T6 passed in non-strict mode
=== ch15/15.10/15.10.2/15.10.2.11/S15.10.2.11_A1_T7 failed in non-strict mode ===
--- errors ---
Exception in thread "main" org.dynjs.exception.ThrowException: #1: var arr = /\1(A)(B)\2/.exec("ABB"); arr[0] === "ABB". Actual. null
at <global>.testFailed(/var/folders/vt/nrnb_cw95ps51fgmm9rq2mpw0000gn/T/test262-YF9WMo.js:289)
at <global>.$ERROR(/var/folders/vt/nrnb_cw95ps51fgmm9rq2mpw0000gn/T/test262-YF9WMo.js:305)
at <global>.<eval>(/var/folders/vt/nrnb_cw95ps51fgmm9rq2mpw0000gn/T/test262-YF9WMo.js:2181)
at org.dynjs.gen.Function13.call(Unknown Source)
at org.dynjs.runtime.ExecutionContext.call(ExecutionContext.java:139)
at org.dynjs.gen.Function17.call(Unknown Source)
at org.dynjs.runtime.ExecutionContext.call(ExecutionContext.java:139)
at org.dynjs.gen.ThenBlock20.call(Unknown Source)
at org.dynjs.gen.Program0.execute(Unknown Source)
at org.dynjs.runtime.ExecutionContext.execute(ExecutionContext.java:122)
at org.dynjs.runtime.DynJS.execute(DynJS.java:90)
at org.dynjs.runtime.DynJS.execute(DynJS.java:80)
at org.dynjs.runtime.DynJS.execute(DynJS.java:76)
at org.dynjs.cli.Main.executeFile(Main.java:73)
at org.dynjs.cli.Main.run(Main.java:60)
at org.dynjs.cli.Main.main(Main.java:46)
===
ch15/15.10/15.10.2/15.10.2.11/S15.10.2.11_A1_T8 passed in non-strict mode
ch15/15.10/15.10.2/15.10.2.11/S15.10.2.11_A1_T9 passed in non-strict mode
=== ch15/15.10/15.10.2/15.10.2.12/S15.10.2.12_A1_T1 failed in non-strict mode ===
--- errors ---
Exception in thread "main" java.lang.RuntimeException: Method code too large!
at org.objectweb.asm.MethodWriter.getSize(MethodWriter.java:1856)
at org.objectweb.asm.ClassWriter.toByteArray(ClassWriter.java:792)
at me.qmx.jitescript.JiteClass.toBytes(JiteClass.java:164)
at org.dynjs.compiler.AbstractCompiler.defineClass(AbstractCompiler.java:47)
at org.dynjs.compiler.ProgramCompiler.compile(ProgramCompiler.java:58)
at org.dynjs.compiler.JSCompiler.compileProgram(JSCompiler.java:31)
at org.dynjs.runtime.DynJS.compile(DynJS.java:155)
at org.dynjs.runtime.DynJS.execute(DynJS.java:89)
at org.dynjs.runtime.DynJS.execute(DynJS.java:80)
at org.dynjs.runtime.DynJS.execute(DynJS.java:76)
at org.dynjs.cli.Main.executeFile(Main.java:73)
at org.dynjs.cli.Main.run(Main.java:60)
at org.dynjs.cli.Main.main(Main.java:46)
===
=== ch15/15.10/15.10.2/15.10.2.12/S15.10.2.12_A1_T2 failed in non-strict mode ===
--- errors ---
Exception in thread "main" org.dynjs.exception.ThrowException: #3: var arr = /\s/.exec("\u2028"); arr[0] === "\u2028". Actual. null
at <global>.testFailed(/var/folders/vt/nrnb_cw95ps51fgmm9rq2mpw0000gn/T/test262-R4TSTo.js:289)
at <global>.$ERROR(/var/folders/vt/nrnb_cw95ps51fgmm9rq2mpw0000gn/T/test262-R4TSTo.js:305)
at <global>.<eval>(/var/folders/vt/nrnb_cw95ps51fgmm9rq2mpw0000gn/T/test262-R4TSTo.js:2192)
at org.dynjs.gen.Function13.call(Unknown Source)
at org.dynjs.runtime.ExecutionContext.call(ExecutionContext.java:139)
at org.dynjs.gen.Function17.call(Unknown Source)
at org.dynjs.runtime.ExecutionContext.call(ExecutionContext.java:139)
at org.dynjs.gen.ThenBlock20.call(Unknown Source)
at org.dynjs.gen.Program0.execute(Unknown Source)
at org.dynjs.runtime.ExecutionContext.execute(ExecutionContext.java:122)
at org.dynjs.runtime.DynJS.execute(DynJS.java:90)
at org.dynjs.runtime.DynJS.execute(DynJS.java:80)
at org.dynjs.runtime.DynJS.execute(DynJS.java:76)
at org.dynjs.cli.Main.executeFile(Main.java:73)
at org.dynjs.cli.Main.run(Main.java:60)
at org.dynjs.cli.Main.main(Main.java:46)
===
ch15/15.10/15.10.2/15.10.2.12/S15.10.2.12_A1_T3 passed in non-strict mode
ch15/15.10/15.10.2/15.10.2.12/S15.10.2.12_A1_T4 passed in non-strict mode
=== ch15/15.10/15.10.2/15.10.2.12/S15.10.2.12_A1_T5 failed in non-strict mode ===
--- errors ---
Exception in thread "main" org.dynjs.exception.ThrowException: #2: non-S
at <global>.testFailed(/var/folders/vt/nrnb_cw95ps51fgmm9rq2mpw0000gn/T/test262-Up0yuO.js:289)
at <global>.$ERROR(/var/folders/vt/nrnb_cw95ps51fgmm9rq2mpw0000gn/T/test262-Up0yuO.js:305)
at <global>.<eval>(/var/folders/vt/nrnb_cw95ps51fgmm9rq2mpw0000gn/T/test262-Up0yuO.js:2192)
at org.dynjs.gen.Function13.call(Unknown Source)
at org.dynjs.runtime.ExecutionContext.call(ExecutionContext.java:139)
at org.dynjs.gen.Function17.call(Unknown Source)
at org.dynjs.runtime.ExecutionContext.call(ExecutionContext.java:139)
at org.dynjs.gen.ThenBlock21.call(Unknown Source)
at org.dynjs.gen.Program0.execute(Unknown Source)
at org.dynjs.runtime.ExecutionContext.execute(ExecutionContext.java:122)
at org.dynjs.runtime.DynJS.execute(DynJS.java:90)
at org.dynjs.runtime.DynJS.execute(DynJS.java:80)
at org.dynjs.runtime.DynJS.execute(DynJS.java:76)
at org.dynjs.cli.Main.executeFile(Main.java:73)
at org.dynjs.cli.Main.run(Main.java:60)
at org.dynjs.cli.Main.main(Main.java:46)
===
=== ch15/15.10/15.10.2/15.10.2.12/S15.10.2.12_A2_T1 failed in non-strict mode ===
--- errors ---