Skip to content

Instantly share code, notes, and snippets.

@jiska jiska/config.log
Last active Oct 22, 2019

Embed
What would you like to do?
This file contains any messages produced by compilers while
running configure, to aid debugging if configure makes a mistake.
It was created by configure, which was
generated by GNU Autoconf 2.69. Invocation command line was
$ ./configure --with-config-file-path=/Users/jiska/.anyenv/envs/phpenv/versions/7.3.5/etc --with-config-file-scan-dir=/Users/jiska/.anyenv/envs/phpenv/versions/7.3.5/etc/conf.d --prefix=/Users/jiska/.anyenv/envs/phpenv/versions/7.3.5 --libexecdir=/Users/jiska/.anyenv/envs/phpenv/versions/7.3.5/libexec --datadir=/Users/jiska/.anyenv/envs/phpenv/versions/7.3.5/share/php --mandir=/Users/jiska/.anyenv/envs/phpenv/versions/7.3.5/share/man --without-pear --with-gd --enable-sockets --with-jpeg-dir=/usr --enable-exif --enable-zip --with-zlib --with-zlib-dir=/usr --with-bz2 --enable-intl --with-kerberos --enable-soap --enable-xmlreader --with-xsl --enable-ftp --enable-cgi --with-curl=/usr --with-tidy --with-xmlrpc --enable-sysvsem --enable-sysvshm --enable-shmop --with-mysqli=mysqlnd --with-pdo-mysql=mysqlnd --with-pdo-sqlite --enable-pcntl --enable-mbstring --disable-debug --enable-fpm --enable-bcmath --enable-phpdbg --with-libedit --with-png-dir=/usr/X11 --with-openssl=/usr/local/opt/openssl --with-libxml-dir=/usr/local/opt/libxml2 --with-icu-dir=/usr/local/opt/icu4c
## --------- ##
## Platform. ##
## --------- ##
hostname = jiska-MBP.local
uname -m = x86_64
uname -r = 19.0.0
uname -s = Darwin
uname -v = Darwin Kernel Version 19.0.0: Wed Sep 25 20:18:50 PDT 2019; root:xnu-6153.11.26~2/RELEASE_X86_64
/usr/bin/uname -p = i386
/bin/uname -X = unknown
/bin/arch = unknown
/usr/bin/arch -k = unknown
/usr/convex/getsysinfo = unknown
/usr/bin/hostinfo = Mach kernel version:
Darwin Kernel Version 19.0.0: Wed Sep 25 20:18:50 PDT 2019; root:xnu-6153.11.26~2/RELEASE_X86_64
Kernel configured for up to 4 processors.
2 processors are physically available.
4 processors are logically available.
Processor type: x86_64h (Intel x86-64h Haswell)
Processors active: 0 1 2 3
Primary memory available: 8.00 gigabytes
Default processor set: 413 tasks, 1853 threads, 4 processors
Load average: 1.62, Mach factor: 2.46
/bin/machine = unknown
/usr/bin/oslevel = unknown
/bin/universe = unknown
PATH: /Users/jiska/.anyenv/envs/phpenv/libexec
PATH: /Users/jiska/.anyenv/envs/phpenv/plugins/php-build/bin
PATH: /Users/jiska/.anyenv/envs/rbenv/shims
PATH: /Users/jiska/.anyenv/envs/rbenv/bin
PATH: /Users/jiska/.anyenv/envs/phpenv/shims
PATH: /Users/jiska/.anyenv/envs/phpenv/bin
PATH: /Users/jiska/.anyenv/envs/nodenv/shims
PATH: /Users/jiska/.anyenv/envs/nodenv/bin
PATH: /Users/jiska/.anyenv/envs/goenv/shims
PATH: /Users/jiska/.anyenv/envs/goenv/bin
PATH: /usr/local/Cellar/zplug/2.4.2/bin
PATH: /Users/jiska/.composer/vendor/bin
PATH: /usr/local/bin
PATH: /usr/local/sbin
PATH: /usr/local/opt/coreutils/libexec/gnubin
PATH: /usr/local/opt/gnu-sed/libexec/gnubin
PATH: /usr/local/opt/findutils/libexec/gnubin
PATH: /usr/local/opt/mysql-client/bin
PATH: /usr/bin
PATH: /bin
PATH: /usr/sbin
PATH: /sbin
PATH: /Library/Apple/usr/bin
PATH: /Library/Apple/bin
## ----------- ##
## Core tests. ##
## ----------- ##
configure:3250: checking for grep that handles long lines and -e
configure:3308: result: /usr/bin/grep
configure:3313: checking for egrep
configure:3375: result: /usr/bin/grep -E
configure:3380: checking for a sed that does not truncate output
configure:3434: result: /usr/local/bin/gsed
configure:3544: checking build system type
configure:3558: result: x86_64-apple-darwin19.0.0
configure:3578: checking host system type
configure:3591: result: x86_64-apple-darwin19.0.0
configure:3611: checking target system type
configure:3624: result: x86_64-apple-darwin19.0.0
configure:3784: checking for cc
configure:3800: found /usr/bin/cc
configure:3811: result: cc
configure:3842: checking for C compiler version
configure:3851: cc --version >&5
Apple clang version 11.0.0 (clang-1100.0.33.8)
Target: x86_64-apple-darwin19.0.0
Thread model: posix
InstalledDir: /Applications/Xcode.app/Contents/Developer/Toolchains/XcodeDefault.xctoolchain/usr/bin
configure:3862: $? = 0
configure:3851: cc -v >&5
Apple clang version 11.0.0 (clang-1100.0.33.8)
Target: x86_64-apple-darwin19.0.0
Thread model: posix
InstalledDir: /Applications/Xcode.app/Contents/Developer/Toolchains/XcodeDefault.xctoolchain/usr/bin
configure:3862: $? = 0
configure:3851: cc -V >&5
clang: error: unsupported option '-V -Wno-framework-include-private-from-public'
clang: error: no input files
configure:3862: $? = 1
configure:3851: cc -qversion >&5
clang: error: unknown argument '-qversion', did you mean '--version'?
clang: error: no input files
configure:3862: $? = 1
configure:3882: checking whether the C compiler works
configure:3904: cc conftest.c >&5
configure:3908: $? = 0
configure:3956: result: yes
configure:3959: checking for C compiler default output file name
configure:3961: result: a.out
configure:3967: checking for suffix of executables
configure:3974: cc -o conftest conftest.c >&5
configure:3978: $? = 0
configure:4000: result:
configure:4022: checking whether we are cross compiling
configure:4030: cc -o conftest conftest.c >&5
configure:4034: $? = 0
configure:4041: ./conftest
configure:4045: $? = 0
configure:4060: result: no
configure:4065: checking for suffix of object files
configure:4087: cc -c conftest.c >&5
configure:4091: $? = 0
configure:4112: result: o
configure:4116: checking whether we are using the GNU C compiler
configure:4135: cc -c conftest.c >&5
configure:4135: $? = 0
configure:4144: result: yes
configure:4153: checking whether cc accepts -g
configure:4173: cc -c -g conftest.c >&5
configure:4173: $? = 0
configure:4214: result: yes
configure:4231: checking for cc option to accept ISO C89
configure:4294: cc -c -g -O2 conftest.c >&5
configure:4294: $? = 0
configure:4307: result: none needed
configure:4333: checking how to run the C preprocessor
configure:4364: cc -E conftest.c
configure:4364: $? = 0
configure:4378: cc -E conftest.c
conftest.c:9:10: fatal error: 'ac_nonexistent.h' file not found
#include <ac_nonexistent.h>
^~~~~~~~~~~~~~~~~~
1 error generated.
configure:4378: $? = 1
configure: failed program was:
| /* confdefs.h */
| #define PACKAGE_NAME ""
| #define PACKAGE_TARNAME ""
| #define PACKAGE_VERSION ""
| #define PACKAGE_STRING ""
| #define PACKAGE_BUGREPORT ""
| #define PACKAGE_URL ""
| /* end confdefs.h. */
| #include <ac_nonexistent.h>
configure:4403: result: cc -E
configure:4423: cc -E conftest.c
configure:4423: $? = 0
configure:4437: cc -E conftest.c
conftest.c:9:10: fatal error: 'ac_nonexistent.h' file not found
#include <ac_nonexistent.h>
^~~~~~~~~~~~~~~~~~
1 error generated.
configure:4437: $? = 1
configure: failed program was:
| /* confdefs.h */
| #define PACKAGE_NAME ""
| #define PACKAGE_TARNAME ""
| #define PACKAGE_VERSION ""
| #define PACKAGE_STRING ""
| #define PACKAGE_BUGREPORT ""
| #define PACKAGE_URL ""
| /* end confdefs.h. */
| #include <ac_nonexistent.h>
configure:4468: checking for icc
configure:4477: result: no
configure:4491: checking for suncc
configure:4500: result: no
configure:4518: checking whether cc understands -c and -o together
configure:4546: cc -c conftest.c -o conftest2.o >&5
configure:4550: $? = 0
configure:4556: cc -c conftest.c -o conftest2.o >&5
configure:4560: $? = 0
configure:4615: result: yes
configure:4630: checking how to run the C preprocessor
configure:4700: result: cc -E
configure:4720: cc -E conftest.c
configure:4720: $? = 0
configure:4734: cc -E conftest.c
conftest.c:9:10: fatal error: 'ac_nonexistent.h' file not found
#include <ac_nonexistent.h>
^~~~~~~~~~~~~~~~~~
1 error generated.
configure:4734: $? = 1
configure: failed program was:
| /* confdefs.h */
| #define PACKAGE_NAME ""
| #define PACKAGE_TARNAME ""
| #define PACKAGE_VERSION ""
| #define PACKAGE_STRING ""
| #define PACKAGE_BUGREPORT ""
| #define PACKAGE_URL ""
| /* end confdefs.h. */
| #include <ac_nonexistent.h>
configure:4762: checking for ANSI C header files
configure:4782: cc -c -g -O2 conftest.c >&5
configure:4782: $? = 0
configure:4855: cc -o conftest -g -O2 conftest.c >&5
configure:4855: $? = 0
configure:4855: ./conftest
configure:4855: $? = 0
configure:4866: result: yes
configure:4879: checking for sys/types.h
configure:4879: cc -c -g -O2 conftest.c >&5
configure:4879: $? = 0
configure:4879: result: yes
configure:4879: checking for sys/stat.h
configure:4879: cc -c -g -O2 conftest.c >&5
configure:4879: $? = 0
configure:4879: result: yes
configure:4879: checking for stdlib.h
configure:4879: cc -c -g -O2 conftest.c >&5
configure:4879: $? = 0
configure:4879: result: yes
configure:4879: checking for string.h
configure:4879: cc -c -g -O2 conftest.c >&5
configure:4879: $? = 0
configure:4879: result: yes
configure:4879: checking for memory.h
configure:4879: cc -c -g -O2 conftest.c >&5
configure:4879: $? = 0
configure:4879: result: yes
configure:4879: checking for strings.h
configure:4879: cc -c -g -O2 conftest.c >&5
configure:4879: $? = 0
configure:4879: result: yes
configure:4879: checking for inttypes.h
configure:4879: cc -c -g -O2 conftest.c >&5
configure:4879: $? = 0
configure:4879: result: yes
configure:4879: checking for stdint.h
configure:4879: cc -c -g -O2 conftest.c >&5
configure:4879: $? = 0
configure:4879: result: yes
configure:4879: checking for unistd.h
configure:4879: cc -c -g -O2 conftest.c >&5
configure:4879: $? = 0
configure:4879: result: yes
configure:4892: checking minix/config.h usability
configure:4892: cc -c -g -O2 conftest.c >&5
conftest.c:52:10: fatal error: 'minix/config.h' file not found
#include <minix/config.h>
^~~~~~~~~~~~~~~~
1 error generated.
configure:4892: $? = 1
configure: failed program was:
| /* confdefs.h */
| #define PACKAGE_NAME ""
| #define PACKAGE_TARNAME ""
| #define PACKAGE_VERSION ""
| #define PACKAGE_STRING ""
| #define PACKAGE_BUGREPORT ""
| #define PACKAGE_URL ""
| #define STDC_HEADERS 1
| #define HAVE_SYS_TYPES_H 1
| #define HAVE_SYS_STAT_H 1
| #define HAVE_STDLIB_H 1
| #define HAVE_STRING_H 1
| #define HAVE_MEMORY_H 1
| #define HAVE_STRINGS_H 1
| #define HAVE_INTTYPES_H 1
| #define HAVE_STDINT_H 1
| #define HAVE_UNISTD_H 1
| /* end confdefs.h. */
| #include <stdio.h>
| #ifdef HAVE_SYS_TYPES_H
| # include <sys/types.h>
| #endif
| #ifdef HAVE_SYS_STAT_H
| # include <sys/stat.h>
| #endif
| #ifdef STDC_HEADERS
| # include <stdlib.h>
| # include <stddef.h>
| #else
| # ifdef HAVE_STDLIB_H
| # include <stdlib.h>
| # endif
| #endif
| #ifdef HAVE_STRING_H
| # if !defined STDC_HEADERS && defined HAVE_MEMORY_H
| # include <memory.h>
| # endif
| # include <string.h>
| #endif
| #ifdef HAVE_STRINGS_H
| # include <strings.h>
| #endif
| #ifdef HAVE_INTTYPES_H
| # include <inttypes.h>
| #endif
| #ifdef HAVE_STDINT_H
| # include <stdint.h>
| #endif
| #ifdef HAVE_UNISTD_H
| # include <unistd.h>
| #endif
| #include <minix/config.h>
configure:4892: result: no
configure:4892: checking minix/config.h presence
configure:4892: cc -E conftest.c
conftest.c:19:10: fatal error: 'minix/config.h' file not found
#include <minix/config.h>
^~~~~~~~~~~~~~~~
1 error generated.
configure:4892: $? = 1
configure: failed program was:
| /* confdefs.h */
| #define PACKAGE_NAME ""
| #define PACKAGE_TARNAME ""
| #define PACKAGE_VERSION ""
| #define PACKAGE_STRING ""
| #define PACKAGE_BUGREPORT ""
| #define PACKAGE_URL ""
| #define STDC_HEADERS 1
| #define HAVE_SYS_TYPES_H 1
| #define HAVE_SYS_STAT_H 1
| #define HAVE_STDLIB_H 1
| #define HAVE_STRING_H 1
| #define HAVE_MEMORY_H 1
| #define HAVE_STRINGS_H 1
| #define HAVE_INTTYPES_H 1
| #define HAVE_STDINT_H 1
| #define HAVE_UNISTD_H 1
| /* end confdefs.h. */
| #include <minix/config.h>
configure:4892: result: no
configure:4892: checking for minix/config.h
configure:4892: result: no
configure:4913: checking whether it is safe to define __EXTENSIONS__
configure:4931: cc -c -g -O2 conftest.c >&5
configure:4931: $? = 0
configure:4938: result: yes
configure:4952: checking whether ln -s works
configure:4956: result: yes
configure:4967: checking for system library directory
configure:4982: result: lib
configure:4991: checking whether to enable runpaths
configure:5005: result: yes
configure:5012: checking if compiler supports -R
configure:5031: cc -o conftest -g -O2 conftest.c -R /usr/lib >&5
warning: unknown remark option '-R' [-Wunknown-warning-option]
1 warning generated.
ld: can't map file, errno=22 file '/Applications/Xcode.app/Contents/Developer/Platforms/MacOSX.platform/Developer/SDKs/MacOSX.sdk/usr/lib' for architecture x86_64
clang: error: linker command failed with exit code 1 (use -v to see invocation)
configure:5031: $? = 1
configure: failed program was:
| /* confdefs.h */
| #define PACKAGE_NAME ""
| #define PACKAGE_TARNAME ""
| #define PACKAGE_VERSION ""
| #define PACKAGE_STRING ""
| #define PACKAGE_BUGREPORT ""
| #define PACKAGE_URL ""
| #define STDC_HEADERS 1
| #define HAVE_SYS_TYPES_H 1
| #define HAVE_SYS_STAT_H 1
| #define HAVE_STDLIB_H 1
| #define HAVE_STRING_H 1
| #define HAVE_MEMORY_H 1
| #define HAVE_STRINGS_H 1
| #define HAVE_INTTYPES_H 1
| #define HAVE_STDINT_H 1
| #define HAVE_UNISTD_H 1
| #define __EXTENSIONS__ 1
| #define _ALL_SOURCE 1
| #define _GNU_SOURCE 1
| #define _POSIX_PTHREAD_SEMANTICS 1
| #define _TANDEM_SOURCE 1
| /* end confdefs.h. */
|
| int
| main ()
| {
|
| ;
| return 0;
| }
configure:5041: result: no
configure:5046: checking if compiler supports -Wl,-rpath,
configure:5065: cc -o conftest -g -O2 conftest.c -Wl,-rpath,/usr/lib >&5
configure:5065: $? = 0
configure:5075: result: yes
configure:5093: checking for gawk
configure:5124: result: no
configure:5093: checking for nawk
configure:5124: result: no
configure:5093: checking for awk
configure:5110: found /usr/bin/awk
configure:5121: result: awk
configure:5144: checking if awk is broken
configure:5151: result: no
configure:5165: checking for bison
configure:5181: found /usr/bin/bison
configure:5192: result: bison -y
configure:5218: checking for bison version
configure:5242: result: invalid
configure:5248: WARNING: This bison version is not supported for regeneration of the Zend/PHP parsers (found: 2.3, min: 204, excluded: ).
configure:5261: checking for re2c
configure:5277: found /usr/local/bin/re2c
configure:5288: result: re2c
configure:5297: checking for re2c version
configure:5311: result: 1.2.1 (ok)
configure:5337: checking whether to enable computed goto gcc extension with re2c
configure:5351: result: no
configure:5419: checking whether C compiler accepts -fvisibility=hidden
configure:5438: cc -c -g -O2 -fvisibility=hidden conftest.c >&5
configure:5438: $? = 0
configure:5446: result: yes
configure:5469: checking whether cc supports -no-cpp-precomp
configure:5486: result: yes
configure:5517: checking whether to force non-PIC code in shared modules
configure:5531: result: no
configure:5547: checking whether /dev/urandom exists
configure:5553: result: yes
configure:5560: checking whether /dev/arandom exists
configure:5569: result: no
configure:5584: checking for global register variables support
configure:5632: cc -c -g -O2 -fvisibility=hidden -no-cpp-precomp conftest.c >&5
conftest.c:44:3: error: "global register variables are not supported"
# error "global register variables are not supported"
^
conftest.c:47:28: error: expected string literal in 'asm'
register void *FP __asm__(ZEND_VM_FP_GLOBAL_REG);
^
conftest.c:48:45: error: expected string literal in 'asm'
register const opcode_handler_t *IP __asm__(ZEND_VM_IP_GLOBAL_REG);
^
conftest.c:50:36: error: use of undeclared identifier 'IP'
const opcode_handler_t *orig_ip = IP;
^
conftest.c:51:18: error: use of undeclared identifier 'FP'
void *orig_fp = FP;
^
conftest.c:52:2: error: use of undeclared identifier 'IP'
IP = ip;
^
conftest.c:53:2: error: use of undeclared identifier 'FP'
FP = fp;
^
conftest.c:55:2: error: use of undeclared identifier 'FP'
FP = orig_fp;
^
conftest.c:56:2: error: use of undeclared identifier 'IP'
IP = orig_ip;
^
9 errors generated.
configure:5632: $? = 1
configure: failed program was:
| /* confdefs.h */
| #define PACKAGE_NAME ""
| #define PACKAGE_TARNAME ""
| #define PACKAGE_VERSION ""
| #define PACKAGE_STRING ""
| #define PACKAGE_BUGREPORT ""
| #define PACKAGE_URL ""
| #define STDC_HEADERS 1
| #define HAVE_SYS_TYPES_H 1
| #define HAVE_SYS_STAT_H 1
| #define HAVE_STDLIB_H 1
| #define HAVE_STRING_H 1
| #define HAVE_MEMORY_H 1
| #define HAVE_STRINGS_H 1
| #define HAVE_INTTYPES_H 1
| #define HAVE_STDINT_H 1
| #define HAVE_UNISTD_H 1
| #define __EXTENSIONS__ 1
| #define _ALL_SOURCE 1
| #define _GNU_SOURCE 1
| #define _POSIX_PTHREAD_SEMANTICS 1
| #define _TANDEM_SOURCE 1
| #define HAVE_DEV_URANDOM 1
| /* end confdefs.h. */
|
| #if defined(__GNUC__)
| # define ZEND_GCC_VERSION (__GNUC__ * 1000 + __GNUC_MINOR__)
| #else
| # define ZEND_GCC_VERSION 0
| #endif
| #if defined(__GNUC__) && ZEND_GCC_VERSION >= 4008 && defined(i386)
| # define ZEND_VM_FP_GLOBAL_REG "%esi"
| # define ZEND_VM_IP_GLOBAL_REG "%edi"
| #elif defined(__GNUC__) && ZEND_GCC_VERSION >= 4008 && defined(__x86_64__)
| # define ZEND_VM_FP_GLOBAL_REG "%r14"
| # define ZEND_VM_IP_GLOBAL_REG "%r15"
| #elif defined(__GNUC__) && ZEND_GCC_VERSION >= 4008 && defined(__powerpc64__)
| # define ZEND_VM_FP_GLOBAL_REG "r28"
| # define ZEND_VM_IP_GLOBAL_REG "r29"
| #elif defined(__IBMC__) && ZEND_GCC_VERSION >= 4002 && defined(__powerpc64__)
| # define ZEND_VM_FP_GLOBAL_REG "r28"
| # define ZEND_VM_IP_GLOBAL_REG "r29"
| #else
| # error "global register variables are not supported"
| #endif
| typedef int (*opcode_handler_t)(void);
| register void *FP __asm__(ZEND_VM_FP_GLOBAL_REG);
| register const opcode_handler_t *IP __asm__(ZEND_VM_IP_GLOBAL_REG);
| int emu(const opcode_handler_t *ip, void *fp) {
| const opcode_handler_t *orig_ip = IP;
| void *orig_fp = FP;
| IP = ip;
| FP = fp;
| while ((*ip)());
| FP = orig_fp;
| IP = orig_ip;
| }
|
| int
| main ()
| {
|
|
| ;
| return 0;
| }
configure:5650: result: no
configure:5653: checking whether atof() accepts NAN
configure:5684: cc -o conftest -g -O2 -fvisibility=hidden -no-cpp-precomp conftest.c >&5
configure:5684: $? = 0
configure:5684: ./conftest
configure:5684: $? = 1
configure: program exited with status 1
configure: failed program was:
| /* confdefs.h */
| #define PACKAGE_NAME ""
| #define PACKAGE_TARNAME ""
| #define PACKAGE_VERSION ""
| #define PACKAGE_STRING ""
| #define PACKAGE_BUGREPORT ""
| #define PACKAGE_URL ""
| #define STDC_HEADERS 1
| #define HAVE_SYS_TYPES_H 1
| #define HAVE_SYS_STAT_H 1
| #define HAVE_STDLIB_H 1
| #define HAVE_STRING_H 1
| #define HAVE_MEMORY_H 1
| #define HAVE_STRINGS_H 1
| #define HAVE_INTTYPES_H 1
| #define HAVE_STDINT_H 1
| #define HAVE_UNISTD_H 1
| #define __EXTENSIONS__ 1
| #define _ALL_SOURCE 1
| #define _GNU_SOURCE 1
| #define _POSIX_PTHREAD_SEMANTICS 1
| #define _TANDEM_SOURCE 1
| #define HAVE_DEV_URANDOM 1
| /* end confdefs.h. */
|
| #include <math.h>
| #include <stdlib.h>
|
| #ifdef HAVE_ISNAN
| #define zend_isnan(a) isnan(a)
| #elif defined(HAVE_FPCLASS)
| #define zend_isnan(a) ((fpclass(a) == FP_SNAN) || (fpclass(a) == FP_QNAN))
| #else
| #define zend_isnan(a) 0
| #endif
|
| int main(int argc, char** argv)
| {
| return zend_isnan(atof("NAN")) ? 0 : 1;
| }
|
configure:5698: result: no
configure:5706: checking whether atof() accepts INF
configure:5740: cc -o conftest -g -O2 -fvisibility=hidden -no-cpp-precomp conftest.c >&5
configure:5740: $? = 0
configure:5740: ./conftest
configure:5740: $? = 1
configure: program exited with status 1
configure: failed program was:
| /* confdefs.h */
| #define PACKAGE_NAME ""
| #define PACKAGE_TARNAME ""
| #define PACKAGE_VERSION ""
| #define PACKAGE_STRING ""
| #define PACKAGE_BUGREPORT ""
| #define PACKAGE_URL ""
| #define STDC_HEADERS 1
| #define HAVE_SYS_TYPES_H 1
| #define HAVE_SYS_STAT_H 1
| #define HAVE_STDLIB_H 1
| #define HAVE_STRING_H 1
| #define HAVE_MEMORY_H 1
| #define HAVE_STRINGS_H 1
| #define HAVE_INTTYPES_H 1
| #define HAVE_STDINT_H 1
| #define HAVE_UNISTD_H 1
| #define __EXTENSIONS__ 1
| #define _ALL_SOURCE 1
| #define _GNU_SOURCE 1
| #define _POSIX_PTHREAD_SEMANTICS 1
| #define _TANDEM_SOURCE 1
| #define HAVE_DEV_URANDOM 1
| /* end confdefs.h. */
|
| #include <math.h>
| #include <stdlib.h>
|
| #ifdef HAVE_ISINF
| #define zend_isinf(a) isinf(a)
| #elif defined(INFINITY)
| /* Might not work, but is required by ISO C99 */
| #define zend_isinf(a) (((a)==INFINITY)?1:0)
| #elif defined(HAVE_FPCLASS)
| #define zend_isinf(a) ((fpclass(a) == FP_PINF) || (fpclass(a) == FP_NINF))
| #else
| #define zend_isinf(a) 0
| #endif
|
| int main(int argc, char** argv)
| {
| return zend_isinf(atof("INF")) && zend_isinf(atof("-INF")) ? 0 : 1;
| }
|
configure:5754: result: no
configure:5762: checking whether HUGE_VAL == INF
configure:5796: cc -o conftest -g -O2 -fvisibility=hidden -no-cpp-precomp conftest.c >&5
configure:5796: $? = 0
configure:5796: ./conftest
configure:5796: $? = 0
configure:5810: result: yes
configure:5818: checking whether HUGE_VAL + -HUGEVAL == NAN
configure:5854: cc -o conftest -g -O2 -fvisibility=hidden -no-cpp-precomp conftest.c >&5
configure:5854: $? = 0
configure:5854: ./conftest
configure:5854: $? = 1
configure: program exited with status 1
configure: failed program was:
| /* confdefs.h */
| #define PACKAGE_NAME ""
| #define PACKAGE_TARNAME ""
| #define PACKAGE_VERSION ""
| #define PACKAGE_STRING ""
| #define PACKAGE_BUGREPORT ""
| #define PACKAGE_URL ""
| #define STDC_HEADERS 1
| #define HAVE_SYS_TYPES_H 1
| #define HAVE_SYS_STAT_H 1
| #define HAVE_STDLIB_H 1
| #define HAVE_STRING_H 1
| #define HAVE_MEMORY_H 1
| #define HAVE_STRINGS_H 1
| #define HAVE_INTTYPES_H 1
| #define HAVE_STDINT_H 1
| #define HAVE_UNISTD_H 1
| #define __EXTENSIONS__ 1
| #define _ALL_SOURCE 1
| #define _GNU_SOURCE 1
| #define _POSIX_PTHREAD_SEMANTICS 1
| #define _TANDEM_SOURCE 1
| #define HAVE_DEV_URANDOM 1
| #define HAVE_HUGE_VAL_INF 1
| /* end confdefs.h. */
|
| #include <math.h>
| #include <stdlib.h>
|
| #ifdef HAVE_ISNAN
| #define zend_isnan(a) isnan(a)
| #elif defined(HAVE_FPCLASS)
| #define zend_isnan(a) ((fpclass(a) == FP_SNAN) || (fpclass(a) == FP_QNAN))
| #else
| #define zend_isnan(a) 0
| #endif
|
| int main(int argc, char** argv)
| {
| #if defined(__sparc__) && !(__GNUC__ >= 3)
| /* prevent bug #27830 */
| return 1;
| #else
| return zend_isnan(HUGE_VAL + -HUGE_VAL) ? 0 : 1;
| #endif
| }
|
configure:5868: result: no
configure:5876: checking whether __cpuid_count is available
configure:5898: cc -o conftest -g -O2 -fvisibility=hidden -no-cpp-precomp conftest.c >&5
configure:5898: $? = 0
configure:5910: result: yes
configure:6034: cc -o conftest -g -O2 -fvisibility=hidden -no-cpp-precomp conftest.c >&5
configure:6034: $? = 0
configure:6049: checking for pthreads_cflags
configure:6079: cc -o conftest -g -O2 -fvisibility=hidden -kthread -no-cpp-precomp conftest.c >&5
clang: error: unknown argument '-kthread', did you mean '-pthread'?
configure:6079: $? = 1
configure: failed program was:
| /* confdefs.h */
| #define PACKAGE_NAME ""
| #define PACKAGE_TARNAME ""
| #define PACKAGE_VERSION ""
| #define PACKAGE_STRING ""
| #define PACKAGE_BUGREPORT ""
| #define PACKAGE_URL ""
| #define STDC_HEADERS 1
| #define HAVE_SYS_TYPES_H 1
| #define HAVE_SYS_STAT_H 1
| #define HAVE_STDLIB_H 1
| #define HAVE_STRING_H 1
| #define HAVE_MEMORY_H 1
| #define HAVE_STRINGS_H 1
| #define HAVE_INTTYPES_H 1
| #define HAVE_STDINT_H 1
| #define HAVE_UNISTD_H 1
| #define __EXTENSIONS__ 1
| #define _ALL_SOURCE 1
| #define _GNU_SOURCE 1
| #define _POSIX_PTHREAD_SEMANTICS 1
| #define _TANDEM_SOURCE 1
| #define HAVE_DEV_URANDOM 1
| #define HAVE_HUGE_VAL_INF 1
| #define HAVE_CPUID_COUNT 1
| /* end confdefs.h. */
|
| #include <pthread.h>
| #include <stddef.h>
|
| void *thread_routine(void *data) {
| return data;
| }
|
| int main() {
| pthread_t thd;
| pthread_mutexattr_t mattr;
| int data = 1;
| pthread_mutexattr_init(&mattr);
| return pthread_create(&thd, NULL, thread_routine, &data);
| }
configure:6079: cc -o conftest -g -O2 -fvisibility=hidden -pthread -no-cpp-precomp conftest.c >&5
configure:6079: $? = 0
configure:6100: result: -pthread
configure:6103: checking for pthreads_lib
configure:6133: cc -o conftest -g -O2 -fvisibility=hidden -no-cpp-precomp conftest.c -lpthread >&5
configure:6133: $? = 0
configure:6154: result: pthread
configure:6231: result:
configure:6233: result: Configuring SAPI modules
configure:6267: checking for Apache 2.0 handler-module support via DSO through APXS
configure:6898: result: no
configure:6930: checking for setproctitle
configure:6930: cc -o conftest -g -O2 -fvisibility=hidden -no-cpp-precomp conftest.c >&5
Undefined symbols for architecture x86_64:
"_setproctitle", referenced from:
_main in conftest-28ae6c.o
ld: symbol(s) not found for architecture x86_64
clang: error: linker command failed with exit code 1 (use -v to see invocation)
configure:6930: $? = 1
configure: failed program was:
| /* confdefs.h */
| #define PACKAGE_NAME ""
| #define PACKAGE_TARNAME ""
| #define PACKAGE_VERSION ""
| #define PACKAGE_STRING ""
| #define PACKAGE_BUGREPORT ""
| #define PACKAGE_URL ""
| #define STDC_HEADERS 1
| #define HAVE_SYS_TYPES_H 1
| #define HAVE_SYS_STAT_H 1
| #define HAVE_STDLIB_H 1
| #define HAVE_STRING_H 1
| #define HAVE_MEMORY_H 1
| #define HAVE_STRINGS_H 1
| #define HAVE_INTTYPES_H 1
| #define HAVE_STDINT_H 1
| #define HAVE_UNISTD_H 1
| #define __EXTENSIONS__ 1
| #define _ALL_SOURCE 1
| #define _GNU_SOURCE 1
| #define _POSIX_PTHREAD_SEMANTICS 1
| #define _TANDEM_SOURCE 1
| #define HAVE_DEV_URANDOM 1
| #define HAVE_HUGE_VAL_INF 1
| #define HAVE_CPUID_COUNT 1
| /* end confdefs.h. */
| /* Define setproctitle to an innocuous variant, in case <limits.h> declares setproctitle.
| For example, HP-UX 11i <limits.h> declares gettimeofday. */
| #define setproctitle innocuous_setproctitle
|
| /* System header to define __stub macros and hopefully few prototypes,
| which can conflict with char setproctitle (); below.
| Prefer <limits.h> to <assert.h> if __STDC__ is defined, since
| <limits.h> exists even on freestanding compilers. */
|
| #ifdef __STDC__
| # include <limits.h>
| #else
| # include <assert.h>
| #endif
|
| #undef setproctitle
|
| /* Override any GCC internal prototype to avoid an error.
| Use char because int might match the return type of a GCC
| builtin and then its argument prototype would still apply. */
| #ifdef __cplusplus
| extern "C"
| #endif
| char setproctitle ();
| /* The GNU C library defines this for functions which it implements
| to always fail with ENOSYS. Some functions are actually named
| something starting with __ and the normal name is an alias. */
| #if defined __stub_setproctitle || defined __stub___setproctitle
| choke me
| #endif
|
| int
| main ()
| {
| return setproctitle ();
| ;
| return 0;
| }
configure:6930: result: no
configure:6942: checking sys/pstat.h usability
configure:6942: cc -c -g -O2 -fvisibility=hidden -no-cpp-precomp conftest.c >&5
conftest.c:60:10: fatal error: 'sys/pstat.h' file not found
#include <sys/pstat.h>
^~~~~~~~~~~~~
1 error generated.
configure:6942: $? = 1
configure: failed program was:
| /* confdefs.h */
| #define PACKAGE_NAME ""
| #define PACKAGE_TARNAME ""
| #define PACKAGE_VERSION ""
| #define PACKAGE_STRING ""
| #define PACKAGE_BUGREPORT ""
| #define PACKAGE_URL ""
| #define STDC_HEADERS 1
| #define HAVE_SYS_TYPES_H 1
| #define HAVE_SYS_STAT_H 1
| #define HAVE_STDLIB_H 1
| #define HAVE_STRING_H 1
| #define HAVE_MEMORY_H 1
| #define HAVE_STRINGS_H 1
| #define HAVE_INTTYPES_H 1
| #define HAVE_STDINT_H 1
| #define HAVE_UNISTD_H 1
| #define __EXTENSIONS__ 1
| #define _ALL_SOURCE 1
| #define _GNU_SOURCE 1
| #define _POSIX_PTHREAD_SEMANTICS 1
| #define _TANDEM_SOURCE 1
| #define HAVE_DEV_URANDOM 1
| #define HAVE_HUGE_VAL_INF 1
| #define HAVE_CPUID_COUNT 1
| /* end confdefs.h. */
| #include <stdio.h>
| #ifdef HAVE_SYS_TYPES_H
| # include <sys/types.h>
| #endif
| #ifdef HAVE_SYS_STAT_H
| # include <sys/stat.h>
| #endif
| #ifdef STDC_HEADERS
| # include <stdlib.h>
| # include <stddef.h>
| #else
| # ifdef HAVE_STDLIB_H
| # include <stdlib.h>
| # endif
| #endif
| #ifdef HAVE_STRING_H
| # if !defined STDC_HEADERS && defined HAVE_MEMORY_H
| # include <memory.h>
| # endif
| # include <string.h>
| #endif
| #ifdef HAVE_STRINGS_H
| # include <strings.h>
| #endif
| #ifdef HAVE_INTTYPES_H
| # include <inttypes.h>
| #endif
| #ifdef HAVE_STDINT_H
| # include <stdint.h>
| #endif
| #ifdef HAVE_UNISTD_H
| # include <unistd.h>
| #endif
| #include <sys/pstat.h>
configure:6942: result: no
configure:6942: checking sys/pstat.h presence
configure:6942: cc -E -no-cpp-precomp conftest.c
conftest.c:27:10: fatal error: 'sys/pstat.h' file not found
#include <sys/pstat.h>
^~~~~~~~~~~~~
1 error generated.
configure:6942: $? = 1
configure: failed program was:
| /* confdefs.h */
| #define PACKAGE_NAME ""
| #define PACKAGE_TARNAME ""
| #define PACKAGE_VERSION ""
| #define PACKAGE_STRING ""
| #define PACKAGE_BUGREPORT ""
| #define PACKAGE_URL ""
| #define STDC_HEADERS 1
| #define HAVE_SYS_TYPES_H 1
| #define HAVE_SYS_STAT_H 1
| #define HAVE_STDLIB_H 1
| #define HAVE_STRING_H 1
| #define HAVE_MEMORY_H 1
| #define HAVE_STRINGS_H 1
| #define HAVE_INTTYPES_H 1
| #define HAVE_STDINT_H 1
| #define HAVE_UNISTD_H 1
| #define __EXTENSIONS__ 1
| #define _ALL_SOURCE 1
| #define _GNU_SOURCE 1
| #define _POSIX_PTHREAD_SEMANTICS 1
| #define _TANDEM_SOURCE 1
| #define HAVE_DEV_URANDOM 1
| #define HAVE_HUGE_VAL_INF 1
| #define HAVE_CPUID_COUNT 1
| /* end confdefs.h. */
| #include <sys/pstat.h>
configure:6942: result: no
configure:6942: checking for sys/pstat.h
configure:6942: result: no
configure:6953: checking for PS_STRINGS
configure:6972: cc -o conftest -g -O2 -fvisibility=hidden -no-cpp-precomp conftest.c >&5
conftest.c:28:10: fatal error: 'sys/exec.h' file not found
#include <sys/exec.h>
^~~~~~~~~~~~
1 error generated.
configure:6972: $? = 1
configure: failed program was:
| /* confdefs.h */
| #define PACKAGE_NAME ""
| #define PACKAGE_TARNAME ""
| #define PACKAGE_VERSION ""
| #define PACKAGE_STRING ""
| #define PACKAGE_BUGREPORT ""
| #define PACKAGE_URL ""
| #define STDC_HEADERS 1
| #define HAVE_SYS_TYPES_H 1
| #define HAVE_SYS_STAT_H 1
| #define HAVE_STDLIB_H 1
| #define HAVE_STRING_H 1
| #define HAVE_MEMORY_H 1
| #define HAVE_STRINGS_H 1
| #define HAVE_INTTYPES_H 1
| #define HAVE_STDINT_H 1
| #define HAVE_UNISTD_H 1
| #define __EXTENSIONS__ 1
| #define _ALL_SOURCE 1
| #define _GNU_SOURCE 1
| #define _POSIX_PTHREAD_SEMANTICS 1
| #define _TANDEM_SOURCE 1
| #define HAVE_DEV_URANDOM 1
| #define HAVE_HUGE_VAL_INF 1
| #define HAVE_CPUID_COUNT 1
| /* end confdefs.h. */
| #include <machine/vmparam.h>
| #include <sys/exec.h>
|
| int
| main ()
| {
| PS_STRINGS->ps_nargvstr = 1;
| PS_STRINGS->ps_argvstr = "foo";
| ;
| return 0;
| }
configure:6980: result: no
configure:6988: checking for CLI build
configure:7147: result: yes
configure:7175: checking for embedded SAPI library support
configure:7374: result: no
configure:7434: checking for FPM build
configure:7437: result: yes
configure:7444: checking for setenv
configure:7444: cc -o conftest -g -O2 -fvisibility=hidden -no-cpp-precomp conftest.c >&5
configure:7444: $? = 0
configure:7444: result: yes
configure:7444: checking for clearenv
configure:7444: cc -o conftest -g -O2 -fvisibility=hidden -no-cpp-precomp conftest.c >&5
Undefined symbols for architecture x86_64:
"_clearenv", referenced from:
_main in conftest-fe8b22.o
ld: symbol(s) not found for architecture x86_64
clang: error: linker command failed with exit code 1 (use -v to see invocation)
configure:7444: $? = 1
configure: failed program was:
| /* confdefs.h */
| #define PACKAGE_NAME ""
| #define PACKAGE_TARNAME ""
| #define PACKAGE_VERSION ""
| #define PACKAGE_STRING ""
| #define PACKAGE_BUGREPORT ""
| #define PACKAGE_URL ""
| #define STDC_HEADERS 1
| #define HAVE_SYS_TYPES_H 1
| #define HAVE_SYS_STAT_H 1
| #define HAVE_STDLIB_H 1
| #define HAVE_STRING_H 1
| #define HAVE_MEMORY_H 1
| #define HAVE_STRINGS_H 1
| #define HAVE_INTTYPES_H 1
| #define HAVE_STDINT_H 1
| #define HAVE_UNISTD_H 1
| #define __EXTENSIONS__ 1
| #define _ALL_SOURCE 1
| #define _GNU_SOURCE 1
| #define _POSIX_PTHREAD_SEMANTICS 1
| #define _TANDEM_SOURCE 1
| #define HAVE_DEV_URANDOM 1
| #define HAVE_HUGE_VAL_INF 1
| #define HAVE_CPUID_COUNT 1
| #define HAVE_SETENV 1
| /* end confdefs.h. */
| /* Define clearenv to an innocuous variant, in case <limits.h> declares clearenv.
| For example, HP-UX 11i <limits.h> declares gettimeofday. */
| #define clearenv innocuous_clearenv
|
| /* System header to define __stub macros and hopefully few prototypes,
| which can conflict with char clearenv (); below.
| Prefer <limits.h> to <assert.h> if __STDC__ is defined, since
| <limits.h> exists even on freestanding compilers. */
|
| #ifdef __STDC__
| # include <limits.h>
| #else
| # include <assert.h>
| #endif
|
| #undef clearenv
|
| /* Override any GCC internal prototype to avoid an error.
| Use char because int might match the return type of a GCC
| builtin and then its argument prototype would still apply. */
| #ifdef __cplusplus
| extern "C"
| #endif
| char clearenv ();
| /* The GNU C library defines this for functions which it implements
| to always fail with ENOSYS. Some functions are actually named
| something starting with __ and the normal name is an alias. */
| #if defined __stub_clearenv || defined __stub___clearenv
| choke me
| #endif
|
| int
| main ()
| {
| return clearenv ();
| ;
| return 0;
| }
configure:7444: result: no
configure:7444: checking for setproctitle
configure:7444: result: no
configure:7444: checking for setproctitle_fast
configure:7444: cc -o conftest -g -O2 -fvisibility=hidden -no-cpp-precomp conftest.c >&5
Undefined symbols for architecture x86_64:
"_setproctitle_fast", referenced from:
_main in conftest-d4f149.o
ld: symbol(s) not found for architecture x86_64
clang: error: linker command failed with exit code 1 (use -v to see invocation)
configure:7444: $? = 1
configure: failed program was:
| /* confdefs.h */
| #define PACKAGE_NAME ""
| #define PACKAGE_TARNAME ""
| #define PACKAGE_VERSION ""
| #define PACKAGE_STRING ""
| #define PACKAGE_BUGREPORT ""
| #define PACKAGE_URL ""
| #define STDC_HEADERS 1
| #define HAVE_SYS_TYPES_H 1
| #define HAVE_SYS_STAT_H 1
| #define HAVE_STDLIB_H 1
| #define HAVE_STRING_H 1
| #define HAVE_MEMORY_H 1
| #define HAVE_STRINGS_H 1
| #define HAVE_INTTYPES_H 1
| #define HAVE_STDINT_H 1
| #define HAVE_UNISTD_H 1
| #define __EXTENSIONS__ 1
| #define _ALL_SOURCE 1
| #define _GNU_SOURCE 1
| #define _POSIX_PTHREAD_SEMANTICS 1
| #define _TANDEM_SOURCE 1
| #define HAVE_DEV_URANDOM 1
| #define HAVE_HUGE_VAL_INF 1
| #define HAVE_CPUID_COUNT 1
| #define HAVE_SETENV 1
| /* end confdefs.h. */
| /* Define setproctitle_fast to an innocuous variant, in case <limits.h> declares setproctitle_fast.
| For example, HP-UX 11i <limits.h> declares gettimeofday. */
| #define setproctitle_fast innocuous_setproctitle_fast
|
| /* System header to define __stub macros and hopefully few prototypes,
| which can conflict with char setproctitle_fast (); below.
| Prefer <limits.h> to <assert.h> if __STDC__ is defined, since
| <limits.h> exists even on freestanding compilers. */
|
| #ifdef __STDC__
| # include <limits.h>
| #else
| # include <assert.h>
| #endif
|
| #undef setproctitle_fast
|
| /* Override any GCC internal prototype to avoid an error.
| Use char because int might match the return type of a GCC
| builtin and then its argument prototype would still apply. */
| #ifdef __cplusplus
| extern "C"
| #endif
| char setproctitle_fast ();
| /* The GNU C library defines this for functions which it implements
| to always fail with ENOSYS. Some functions are actually named
| something starting with __ and the normal name is an alias. */
| #if defined __stub_setproctitle_fast || defined __stub___setproctitle_fast
| choke me
| #endif
|
| int
| main ()
| {
| return setproctitle_fast ();
| ;
| return 0;
| }
configure:7444: result: no
configure:7454: checking for library containing socket
configure:7485: cc -o conftest -g -O2 -fvisibility=hidden -no-cpp-precomp conftest.c >&5
configure:7485: $? = 0
configure:7502: result: none required
configure:7510: checking for library containing inet_addr
configure:7541: cc -o conftest -g -O2 -fvisibility=hidden -no-cpp-precomp conftest.c >&5
configure:7541: $? = 0
configure:7558: result: none required
configure:7570: checking errno.h usability
configure:7570: cc -c -g -O2 -fvisibility=hidden -no-cpp-precomp conftest.c >&5
configure:7570: $? = 0
configure:7570: result: yes
configure:7570: checking errno.h presence
configure:7570: cc -E -no-cpp-precomp conftest.c
configure:7570: $? = 0
configure:7570: result: yes
configure:7570: checking for errno.h
configure:7570: result: yes
configure:7570: checking fcntl.h usability
configure:7570: cc -c -g -O2 -fvisibility=hidden -no-cpp-precomp conftest.c >&5
configure:7570: $? = 0
configure:7570: result: yes
configure:7570: checking fcntl.h presence
configure:7570: cc -E -no-cpp-precomp conftest.c
configure:7570: $? = 0
configure:7570: result: yes
configure:7570: checking for fcntl.h
configure:7570: result: yes
configure:7570: checking stdio.h usability
configure:7570: cc -c -g -O2 -fvisibility=hidden -no-cpp-precomp conftest.c >&5
configure:7570: $? = 0
configure:7570: result: yes
configure:7570: checking stdio.h presence
configure:7570: cc -E -no-cpp-precomp conftest.c
configure:7570: $? = 0
configure:7570: result: yes
configure:7570: checking for stdio.h
configure:7570: result: yes
configure:7570: checking for stdlib.h
configure:7570: result: yes
configure:7570: checking for unistd.h
configure:7570: result: yes
configure:7570: checking sys/uio.h usability
configure:7570: cc -c -g -O2 -fvisibility=hidden -no-cpp-precomp conftest.c >&5
configure:7570: $? = 0
configure:7570: result: yes
configure:7570: checking sys/uio.h presence
configure:7570: cc -E -no-cpp-precomp conftest.c
configure:7570: $? = 0
configure:7570: result: yes
configure:7570: checking for sys/uio.h
configure:7570: result: yes
configure:7583: checking sys/select.h usability
configure:7583: cc -c -g -O2 -fvisibility=hidden -no-cpp-precomp conftest.c >&5
configure:7583: $? = 0
configure:7583: result: yes
configure:7583: checking sys/select.h presence
configure:7583: cc -E -no-cpp-precomp conftest.c
configure:7583: $? = 0
configure:7583: result: yes
configure:7583: checking for sys/select.h
configure:7583: result: yes
configure:7583: checking sys/socket.h usability
configure:7583: cc -c -g -O2 -fvisibility=hidden -no-cpp-precomp conftest.c >&5
configure:7583: $? = 0
configure:7583: result: yes
configure:7583: checking sys/socket.h presence
configure:7583: cc -E -no-cpp-precomp conftest.c
configure:7583: $? = 0
configure:7583: result: yes
configure:7583: checking for sys/socket.h
configure:7583: result: yes
configure:7583: checking sys/time.h usability
configure:7583: cc -c -g -O2 -fvisibility=hidden -no-cpp-precomp conftest.c >&5
configure:7583: $? = 0
configure:7583: result: yes
configure:7583: checking sys/time.h presence
configure:7583: cc -E -no-cpp-precomp conftest.c
configure:7583: $? = 0
configure:7583: result: yes
configure:7583: checking for sys/time.h
configure:7583: result: yes
configure:7596: checking arpa/inet.h usability
configure:7596: cc -c -g -O2 -fvisibility=hidden -no-cpp-precomp conftest.c >&5
configure:7596: $? = 0
configure:7596: result: yes
configure:7596: checking arpa/inet.h presence
configure:7596: cc -E -no-cpp-precomp conftest.c
configure:7596: $? = 0
configure:7596: result: yes
configure:7596: checking for arpa/inet.h
configure:7596: result: yes
configure:7596: checking netinet/in.h usability
configure:7596: cc -c -g -O2 -fvisibility=hidden -no-cpp-precomp conftest.c >&5
configure:7596: $? = 0
configure:7596: result: yes
configure:7596: checking netinet/in.h presence
configure:7596: cc -E -no-cpp-precomp conftest.c
configure:7596: $? = 0
configure:7596: result: yes
configure:7596: checking for netinet/in.h
configure:7596: result: yes
configure:7608: checking sysexits.h usability
configure:7608: cc -c -g -O2 -fvisibility=hidden -no-cpp-precomp conftest.c >&5
configure:7608: $? = 0
configure:7608: result: yes
configure:7608: checking sysexits.h presence
configure:7608: cc -E -no-cpp-precomp conftest.c
configure:7608: $? = 0
configure:7608: result: yes
configure:7608: checking for sysexits.h
configure:7608: result: yes
configure:7620: checking for prctl
configure:7634: cc -c -g -O2 -fvisibility=hidden -no-cpp-precomp conftest.c >&5
conftest.c:40:10: fatal error: 'sys/prctl.h' file not found
#include <sys/prctl.h>
^~~~~~~~~~~~~
1 error generated.
configure:7634: $? = 1
configure: failed program was:
| /* confdefs.h */
| #define PACKAGE_NAME ""
| #define PACKAGE_TARNAME ""
| #define PACKAGE_VERSION ""
| #define PACKAGE_STRING ""
| #define PACKAGE_BUGREPORT ""
| #define PACKAGE_URL ""
| #define STDC_HEADERS 1
| #define HAVE_SYS_TYPES_H 1
| #define HAVE_SYS_STAT_H 1
| #define HAVE_STDLIB_H 1
| #define HAVE_STRING_H 1
| #define HAVE_MEMORY_H 1
| #define HAVE_STRINGS_H 1
| #define HAVE_INTTYPES_H 1
| #define HAVE_STDINT_H 1
| #define HAVE_UNISTD_H 1
| #define __EXTENSIONS__ 1
| #define _ALL_SOURCE 1
| #define _GNU_SOURCE 1
| #define _POSIX_PTHREAD_SEMANTICS 1
| #define _TANDEM_SOURCE 1
| #define HAVE_DEV_URANDOM 1
| #define HAVE_HUGE_VAL_INF 1
| #define HAVE_CPUID_COUNT 1
| #define HAVE_SETENV 1
| #define HAVE_ERRNO_H 1
| #define HAVE_FCNTL_H 1
| #define HAVE_STDIO_H 1
| #define HAVE_STDLIB_H 1
| #define HAVE_UNISTD_H 1
| #define HAVE_SYS_UIO_H 1
| #define HAVE_SYS_SELECT_H 1
| #define HAVE_SYS_SOCKET_H 1
| #define HAVE_SYS_TIME_H 1
| #define HAVE_ARPA_INET_H 1
| #define HAVE_NETINET_IN_H 1
| #define HAVE_SYSEXITS_H 1
| /* end confdefs.h. */
| #include <sys/prctl.h>
| int
| main ()
| {
| prctl(0, 0, 0, 0, 0);
| ;
| return 0;
| }
configure:7644: result: no
configure:7653: checking for clock_gettime
configure:7667: cc -o conftest -g -O2 -fvisibility=hidden -no-cpp-precomp conftest.c >&5
configure:7667: $? = 0
configure:7670: result: yes
configure:7785: checking for ptrace
configure:7801: cc -c -g -O2 -fvisibility=hidden -no-cpp-precomp conftest.c >&5
configure:7801: $? = 0
configure:7804: result: yes
configure:7816: checking whether ptrace works
configure:7896: cc -o conftest -g -O2 -fvisibility=hidden -no-cpp-precomp conftest.c >&5
conftest.c:71:26: warning: 'ePtAttachDeprecated' is deprecated: PT_ATTACH is deprecated. See PT_ATTACHEXC [-Wdeprecated-declarations]
if (0 > ptrace(PTRACE_ATTACH, child, 0, 0)) {
^
conftest.c:50:29: note: expanded from macro 'PTRACE_ATTACH'
#define PTRACE_ATTACH PT_ATTACH
^
/Applications/Xcode.app/Contents/Developer/Platforms/MacOSX.platform/Developer/SDKs/MacOSX.sdk/usr/include/sys/ptrace.h:85:25: note: expanded from macro 'PT_ATTACH'
#define PT_ATTACH ePtAttachDeprecated /* trace some running process */
^
/Applications/Xcode.app/Contents/Developer/Platforms/MacOSX.platform/Developer/SDKs/MacOSX.sdk/usr/include/sys/ptrace.h:71:22: note: 'ePtAttachDeprecated' has been explicitly marked deprecated here
ePtAttachDeprecated __deprecated_enum_msg("PT_ATTACH is deprecated. See PT_ATTACHEXC") = 10
^
/Applications/Xcode.app/Contents/Developer/Platforms/MacOSX.platform/Developer/SDKs/MacOSX.sdk/usr/include/sys/cdefs.h:197:38: note: expanded from macro '__deprecated_enum_msg'
#define __deprecated_enum_msg(_msg) __deprecated_msg(_msg)
^
/Applications/Xcode.app/Contents/Developer/Platforms/MacOSX.platform/Developer/SDKs/MacOSX.sdk/usr/include/sys/cdefs.h:191:48: note: expanded from macro '__deprecated_msg'
#define __deprecated_msg(_msg) __attribute__((__deprecated__(_msg)))
^
1 warning generated.
configure:7896: $? = 0
configure:7896: ./conftest
configure:7896: $? = 2
configure: program exited with status 2
configure: failed program was:
| /* confdefs.h */
| #define PACKAGE_NAME ""
| #define PACKAGE_TARNAME ""
| #define PACKAGE_VERSION ""
| #define PACKAGE_STRING ""
| #define PACKAGE_BUGREPORT ""
| #define PACKAGE_URL ""
| #define STDC_HEADERS 1
| #define HAVE_SYS_TYPES_H 1
| #define HAVE_SYS_STAT_H 1
| #define HAVE_STDLIB_H 1
| #define HAVE_STRING_H 1
| #define HAVE_MEMORY_H 1
| #define HAVE_STRINGS_H 1
| #define HAVE_INTTYPES_H 1
| #define HAVE_STDINT_H 1
| #define HAVE_UNISTD_H 1
| #define __EXTENSIONS__ 1
| #define _ALL_SOURCE 1
| #define _GNU_SOURCE 1
| #define _POSIX_PTHREAD_SEMANTICS 1
| #define _TANDEM_SOURCE 1
| #define HAVE_DEV_URANDOM 1
| #define HAVE_HUGE_VAL_INF 1
| #define HAVE_CPUID_COUNT 1
| #define HAVE_SETENV 1
| #define HAVE_ERRNO_H 1
| #define HAVE_FCNTL_H 1
| #define HAVE_STDIO_H 1
| #define HAVE_STDLIB_H 1
| #define HAVE_UNISTD_H 1
| #define HAVE_SYS_UIO_H 1
| #define HAVE_SYS_SELECT_H 1
| #define HAVE_SYS_SOCKET_H 1
| #define HAVE_SYS_TIME_H 1
| #define HAVE_ARPA_INET_H 1
| #define HAVE_NETINET_IN_H 1
| #define HAVE_SYSEXITS_H 1
| #define HAVE_CLOCK_GETTIME 1
| /* end confdefs.h. */
|
| #include <unistd.h>
| #include <signal.h>
| #include <sys/wait.h>
| #include <sys/types.h>
| #include <sys/ptrace.h>
| #include <errno.h>
|
| #if !defined(PTRACE_ATTACH) && defined(PT_ATTACH)
| #define PTRACE_ATTACH PT_ATTACH
| #endif
|
| #if !defined(PTRACE_DETACH) && defined(PT_DETACH)
| #define PTRACE_DETACH PT_DETACH
| #endif
|
| #if !defined(PTRACE_PEEKDATA) && defined(PT_READ_D)
| #define PTRACE_PEEKDATA PT_READ_D
| #endif
|
| int main()
| {
| long v1 = (unsigned int) -1; /* copy will fail if sizeof(long) == 8 and we've got "int ptrace()" */
| long v2;
| pid_t child;
| int status;
|
| if ( (child = fork()) ) { /* parent */
| int ret = 0;
|
| if (0 > ptrace(PTRACE_ATTACH, child, 0, 0)) {
| return 2;
| }
|
| waitpid(child, &status, 0);
|
| #ifdef PT_IO
| struct ptrace_io_desc ptio = {
| .piod_op = PIOD_READ_D,
| .piod_offs = &v1,
| .piod_addr = &v2,
| .piod_len = sizeof(v1)
| };
|
| if (0 > ptrace(PT_IO, child, (void *) &ptio, 0)) {
| ret = 3;
| }
| #else
| errno = 0;
|
| v2 = ptrace(PTRACE_PEEKDATA, child, (void *) &v1, 0);
|
| if (errno) {
| ret = 4;
| }
| #endif
| ptrace(PTRACE_DETACH, child, (void *) 1, 0);
|
| kill(child, SIGKILL);
|
| return ret ? ret : (v1 != v2);
| }
| else { /* child */
| sleep(10);
| return 0;
| }
| }
|
configure:7905: result: no
configure:7924: checking for mach_vm_read
configure:7942: cc -c -g -O2 -fvisibility=hidden -no-cpp-precomp conftest.c >&5
configure:7942: $? = 0
configure:7945: result: yes
configure:8057: checking if gcc supports __sync_bool_compare_and_swap
configure:8074: cc -o conftest -g -O2 -fvisibility=hidden -no-cpp-precomp conftest.c >&5
configure:8074: $? = 0
configure:8076: result: yes
configure:8094: checking for TCP_INFO
configure:8108: cc -c -g -O2 -fvisibility=hidden -no-cpp-precomp conftest.c >&5
conftest.c:47:17: error: variable has incomplete type 'struct tcp_info'
struct tcp_info ti; int x = TCP_INFO;
^
conftest.c:47:8: note: forward declaration of 'struct tcp_info'
struct tcp_info ti; int x = TCP_INFO;
^
conftest.c:47:29: error: use of undeclared identifier 'TCP_INFO'
struct tcp_info ti; int x = TCP_INFO;
^
2 errors generated.
configure:8108: $? = 1
configure: failed program was:
| /* confdefs.h */
| #define PACKAGE_NAME ""
| #define PACKAGE_TARNAME ""
| #define PACKAGE_VERSION ""
| #define PACKAGE_STRING ""
| #define PACKAGE_BUGREPORT ""
| #define PACKAGE_URL ""
| #define STDC_HEADERS 1
| #define HAVE_SYS_TYPES_H 1
| #define HAVE_SYS_STAT_H 1
| #define HAVE_STDLIB_H 1
| #define HAVE_STRING_H 1
| #define HAVE_MEMORY_H 1
| #define HAVE_STRINGS_H 1
| #define HAVE_INTTYPES_H 1
| #define HAVE_STDINT_H 1
| #define HAVE_UNISTD_H 1
| #define __EXTENSIONS__ 1
| #define _ALL_SOURCE 1
| #define _GNU_SOURCE 1
| #define _POSIX_PTHREAD_SEMANTICS 1
| #define _TANDEM_SOURCE 1
| #define HAVE_DEV_URANDOM 1
| #define HAVE_HUGE_VAL_INF 1
| #define HAVE_CPUID_COUNT 1
| #define HAVE_SETENV 1
| #define HAVE_ERRNO_H 1
| #define HAVE_FCNTL_H 1
| #define HAVE_STDIO_H 1
| #define HAVE_STDLIB_H 1
| #define HAVE_UNISTD_H 1
| #define HAVE_SYS_UIO_H 1
| #define HAVE_SYS_SELECT_H 1
| #define HAVE_SYS_SOCKET_H 1
| #define HAVE_SYS_TIME_H 1
| #define HAVE_ARPA_INET_H 1
| #define HAVE_NETINET_IN_H 1
| #define HAVE_SYSEXITS_H 1
| #define HAVE_CLOCK_GETTIME 1
| #define HAVE_MACH_VM_READ 1
| #define HAVE_BUILTIN_ATOMIC 1
| /* end confdefs.h. */
| #include <netinet/tcp.h>
| int
| main ()
| {
| struct tcp_info ti; int x = TCP_INFO;
| ;
| return 0;
| }
configure:8116: result: no
configure:8129: checking for SO_LISTENQLEN
configure:8143: cc -c -g -O2 -fvisibility=hidden -no-cpp-precomp conftest.c >&5
conftest.c:47:9: error: use of undeclared identifier 'SO_LISTENQLIMIT'
int x = SO_LISTENQLIMIT; int y = SO_LISTENQLEN;
^
conftest.c:47:34: error: use of undeclared identifier 'SO_LISTENQLEN'
int x = SO_LISTENQLIMIT; int y = SO_LISTENQLEN;
^
2 errors generated.
configure:8143: $? = 1
configure: failed program was:
| /* confdefs.h */
| #define PACKAGE_NAME ""
| #define PACKAGE_TARNAME ""
| #define PACKAGE_VERSION ""
| #define PACKAGE_STRING ""
| #define PACKAGE_BUGREPORT ""
| #define PACKAGE_URL ""
| #define STDC_HEADERS 1
| #define HAVE_SYS_TYPES_H 1
| #define HAVE_SYS_STAT_H 1
| #define HAVE_STDLIB_H 1
| #define HAVE_STRING_H 1
| #define HAVE_MEMORY_H 1
| #define HAVE_STRINGS_H 1
| #define HAVE_INTTYPES_H 1
| #define HAVE_STDINT_H 1
| #define HAVE_UNISTD_H 1
| #define __EXTENSIONS__ 1
| #define _ALL_SOURCE 1
| #define _GNU_SOURCE 1
| #define _POSIX_PTHREAD_SEMANTICS 1
| #define _TANDEM_SOURCE 1
| #define HAVE_DEV_URANDOM 1
| #define HAVE_HUGE_VAL_INF 1
| #define HAVE_CPUID_COUNT 1
| #define HAVE_SETENV 1
| #define HAVE_ERRNO_H 1
| #define HAVE_FCNTL_H 1
| #define HAVE_STDIO_H 1
| #define HAVE_STDLIB_H 1
| #define HAVE_UNISTD_H 1
| #define HAVE_SYS_UIO_H 1
| #define HAVE_SYS_SELECT_H 1
| #define HAVE_SYS_SOCKET_H 1
| #define HAVE_SYS_TIME_H 1
| #define HAVE_ARPA_INET_H 1
| #define HAVE_NETINET_IN_H 1
| #define HAVE_SYSEXITS_H 1
| #define HAVE_CLOCK_GETTIME 1
| #define HAVE_MACH_VM_READ 1
| #define HAVE_BUILTIN_ATOMIC 1
| /* end confdefs.h. */
| #include <sys/socket.h>
| int
| main ()
| {
| int x = SO_LISTENQLIMIT; int y = SO_LISTENQLEN;
| ;
| return 0;
| }
configure:8151: result: no
configure:8165: checking for sysconf
configure:8179: cc -c -g -O2 -fvisibility=hidden -no-cpp-precomp conftest.c >&5
configure:8179: $? = 0
configure:8184: result: yes
configure:8196: checking for times
configure:8210: cc -c -g -O2 -fvisibility=hidden -no-cpp-precomp conftest.c >&5
configure:8210: $? = 0
configure:8215: result: yes
configure:8227: checking for kqueue
configure:8251: cc -c -g -O2 -fvisibility=hidden -no-cpp-precomp conftest.c >&5
configure:8251: $? = 0
configure:8256: result: yes
configure:8268: checking for port framework
configure:8291: cc -c -g -O2 -fvisibility=hidden -no-cpp-precomp conftest.c >&5
conftest.c:47:12: fatal error: 'port.h' file not found
#include <port.h>
^~~~~~~~
1 error generated.
configure:8291: $? = 1
configure: failed program was:
| /* confdefs.h */
| #define PACKAGE_NAME ""
| #define PACKAGE_TARNAME ""
| #define PACKAGE_VERSION ""
| #define PACKAGE_STRING ""
| #define PACKAGE_BUGREPORT ""
| #define PACKAGE_URL ""
| #define STDC_HEADERS 1
| #define HAVE_SYS_TYPES_H 1
| #define HAVE_SYS_STAT_H 1
| #define HAVE_STDLIB_H 1
| #define HAVE_STRING_H 1
| #define HAVE_MEMORY_H 1
| #define HAVE_STRINGS_H 1
| #define HAVE_INTTYPES_H 1
| #define HAVE_STDINT_H 1
| #define HAVE_UNISTD_H 1
| #define __EXTENSIONS__ 1
| #define _ALL_SOURCE 1
| #define _GNU_SOURCE 1
| #define _POSIX_PTHREAD_SEMANTICS 1
| #define _TANDEM_SOURCE 1
| #define HAVE_DEV_URANDOM 1
| #define HAVE_HUGE_VAL_INF 1
| #define HAVE_CPUID_COUNT 1
| #define HAVE_SETENV 1
| #define HAVE_ERRNO_H 1
| #define HAVE_FCNTL_H 1
| #define HAVE_STDIO_H 1
| #define HAVE_STDLIB_H 1
| #define HAVE_UNISTD_H 1
| #define HAVE_SYS_UIO_H 1
| #define HAVE_SYS_SELECT_H 1
| #define HAVE_SYS_SOCKET_H 1
| #define HAVE_SYS_TIME_H 1
| #define HAVE_ARPA_INET_H 1
| #define HAVE_NETINET_IN_H 1
| #define HAVE_SYSEXITS_H 1
| #define HAVE_CLOCK_GETTIME 1
| #define HAVE_MACH_VM_READ 1
| #define HAVE_BUILTIN_ATOMIC 1
| #define HAVE_SYSCONF 1
| #define HAVE_TIMES 1
| #define HAVE_KQUEUE 1
| /* end confdefs.h. */
|
| #include <port.h>
|
| int
| main ()
| {
|
| int port;
|
| port = port_create();
| if (port < 0) {
| return 1;
| }
|
| ;
| return 0;
| }
configure:8301: result: no
configure:8308: checking for /dev/poll
configure:8333: cc -c -g -O2 -fvisibility=hidden -no-cpp-precomp conftest.c >&5
conftest.c:48:12: fatal error: 'sys/devpoll.h' file not found
#include <sys/devpoll.h>
^~~~~~~~~~~~~~~
1 error generated.
configure:8333: $? = 1
configure: failed program was:
| /* confdefs.h */
| #define PACKAGE_NAME ""
| #define PACKAGE_TARNAME ""
| #define PACKAGE_VERSION ""
| #define PACKAGE_STRING ""
| #define PACKAGE_BUGREPORT ""
| #define PACKAGE_URL ""
| #define STDC_HEADERS 1
| #define HAVE_SYS_TYPES_H 1
| #define HAVE_SYS_STAT_H 1
| #define HAVE_STDLIB_H 1
| #define HAVE_STRING_H 1
| #define HAVE_MEMORY_H 1
| #define HAVE_STRINGS_H 1
| #define HAVE_INTTYPES_H 1
| #define HAVE_STDINT_H 1
| #define HAVE_UNISTD_H 1
| #define __EXTENSIONS__ 1
| #define _ALL_SOURCE 1
| #define _GNU_SOURCE 1
| #define _POSIX_PTHREAD_SEMANTICS 1
| #define _TANDEM_SOURCE 1
| #define HAVE_DEV_URANDOM 1
| #define HAVE_HUGE_VAL_INF 1
| #define HAVE_CPUID_COUNT 1
| #define HAVE_SETENV 1
| #define HAVE_ERRNO_H 1
| #define HAVE_FCNTL_H 1
| #define HAVE_STDIO_H 1
| #define HAVE_STDLIB_H 1
| #define HAVE_UNISTD_H 1
| #define HAVE_SYS_UIO_H 1
| #define HAVE_SYS_SELECT_H 1
| #define HAVE_SYS_SOCKET_H 1
| #define HAVE_SYS_TIME_H 1
| #define HAVE_ARPA_INET_H 1
| #define HAVE_NETINET_IN_H 1
| #define HAVE_SYSEXITS_H 1
| #define HAVE_CLOCK_GETTIME 1
| #define HAVE_MACH_VM_READ 1
| #define HAVE_BUILTIN_ATOMIC 1
| #define HAVE_SYSCONF 1
| #define HAVE_TIMES 1
| #define HAVE_KQUEUE 1
| /* end confdefs.h. */
|
| #include <stdio.h>
| #include <sys/devpoll.h>
|
| int
| main ()
| {
|
| int n, dp;
| struct dvpoll dvp;
| dp = 0;
| dvp.dp_fds = NULL;
| dvp.dp_nfds = 0;
| dvp.dp_timeout = 0;
| n = ioctl(dp, DP_POLL, &dvp)
|
| ;
| return 0;
| }
configure:8343: result: no
configure:8350: checking for epoll
configure:8386: cc -c -g -O2 -fvisibility=hidden -no-cpp-precomp conftest.c >&5
conftest.c:47:12: fatal error: 'sys/epoll.h' file not found
#include <sys/epoll.h>
^~~~~~~~~~~~~
1 error generated.
configure:8386: $? = 1
configure: failed program was:
| /* confdefs.h */
| #define PACKAGE_NAME ""
| #define PACKAGE_TARNAME ""
| #define PACKAGE_VERSION ""
| #define PACKAGE_STRING ""
| #define PACKAGE_BUGREPORT ""
| #define PACKAGE_URL ""
| #define STDC_HEADERS 1
| #define HAVE_SYS_TYPES_H 1
| #define HAVE_SYS_STAT_H 1
| #define HAVE_STDLIB_H 1
| #define HAVE_STRING_H 1
| #define HAVE_MEMORY_H 1
| #define HAVE_STRINGS_H 1
| #define HAVE_INTTYPES_H 1
| #define HAVE_STDINT_H 1
| #define HAVE_UNISTD_H 1
| #define __EXTENSIONS__ 1
| #define _ALL_SOURCE 1
| #define _GNU_SOURCE 1
| #define _POSIX_PTHREAD_SEMANTICS 1
| #define _TANDEM_SOURCE 1
| #define HAVE_DEV_URANDOM 1
| #define HAVE_HUGE_VAL_INF 1
| #define HAVE_CPUID_COUNT 1
| #define HAVE_SETENV 1
| #define HAVE_ERRNO_H 1
| #define HAVE_FCNTL_H 1
| #define HAVE_STDIO_H 1
| #define HAVE_STDLIB_H 1
| #define HAVE_UNISTD_H 1
| #define HAVE_SYS_UIO_H 1
| #define HAVE_SYS_SELECT_H 1
| #define HAVE_SYS_SOCKET_H 1
| #define HAVE_SYS_TIME_H 1
| #define HAVE_ARPA_INET_H 1
| #define HAVE_NETINET_IN_H 1
| #define HAVE_SYSEXITS_H 1
| #define HAVE_CLOCK_GETTIME 1
| #define HAVE_MACH_VM_READ 1
| #define HAVE_BUILTIN_ATOMIC 1
| #define HAVE_SYSCONF 1
| #define HAVE_TIMES 1
| #define HAVE_KQUEUE 1
| /* end confdefs.h. */
|
| #include <sys/epoll.h>
|
| int
| main ()
| {
|
| int epollfd;
| struct epoll_event e;
|
| epollfd = epoll_create(1);
| if (epollfd < 0) {
| return 1;
| }
|
| e.events = EPOLLIN | EPOLLET;
| e.data.fd = 0;
|
| if (epoll_ctl(epollfd, EPOLL_CTL_ADD, 0, &e) == -1) {
| return 1;
| }
|
| e.events = 0;
| if (epoll_wait(epollfd, &e, 1, 1) < 0) {
| return 1;
| }
|
| ;
| return 0;
| }
configure:8396: result: no
configure:8403: checking for poll
configure:8429: cc -c -g -O2 -fvisibility=hidden -no-cpp-precomp conftest.c >&5
configure:8429: $? = 0
configure:8434: result: yes
configure:8446: checking for select
configure:8477: cc -c -g -O2 -fvisibility=hidden -no-cpp-precomp conftest.c >&5
configure:8477: $? = 0
configure:8482: result: yes
configure:8494: checking for apparmor
configure:8511: cc -o conftest -g -O2 -fvisibility=hidden -no-cpp-precomp conftest.c -lapparmor >&5
conftest.c:48:10: fatal error: 'sys/apparmor.h' file not found
#include <sys/apparmor.h>
^~~~~~~~~~~~~~~~
1 error generated.
configure:8511: $? = 1
configure: failed program was:
| /* confdefs.h */
| #define PACKAGE_NAME ""
| #define PACKAGE_TARNAME ""
| #define PACKAGE_VERSION ""
| #define PACKAGE_STRING ""
| #define PACKAGE_BUGREPORT ""
| #define PACKAGE_URL ""
| #define STDC_HEADERS 1
| #define HAVE_SYS_TYPES_H 1
| #define HAVE_SYS_STAT_H 1
| #define HAVE_STDLIB_H 1
| #define HAVE_STRING_H 1
| #define HAVE_MEMORY_H 1
| #define HAVE_STRINGS_H 1
| #define HAVE_INTTYPES_H 1
| #define HAVE_STDINT_H 1
| #define HAVE_UNISTD_H 1
| #define __EXTENSIONS__ 1
| #define _ALL_SOURCE 1
| #define _GNU_SOURCE 1
| #define _POSIX_PTHREAD_SEMANTICS 1
| #define _TANDEM_SOURCE 1
| #define HAVE_DEV_URANDOM 1
| #define HAVE_HUGE_VAL_INF 1
| #define HAVE_CPUID_COUNT 1
| #define HAVE_SETENV 1
| #define HAVE_ERRNO_H 1
| #define HAVE_FCNTL_H 1
| #define HAVE_STDIO_H 1
| #define HAVE_STDLIB_H 1
| #define HAVE_UNISTD_H 1
| #define HAVE_SYS_UIO_H 1
| #define HAVE_SYS_SELECT_H 1
| #define HAVE_SYS_SOCKET_H 1
| #define HAVE_SYS_TIME_H 1
| #define HAVE_ARPA_INET_H 1
| #define HAVE_NETINET_IN_H 1
| #define HAVE_SYSEXITS_H 1
| #define HAVE_CLOCK_GETTIME 1
| #define HAVE_MACH_VM_READ 1
| #define HAVE_BUILTIN_ATOMIC 1
| #define HAVE_SYSCONF 1
| #define HAVE_TIMES 1
| #define HAVE_KQUEUE 1
| #define HAVE_POLL 1
| #define HAVE_SELECT 1
| /* end confdefs.h. */
| #include <sys/apparmor.h>
| int
| main ()
| {
| change_hat("test", 0);
| ;
| return 0;
| }
configure:8522: result: no
configure:9200: checking for LiteSpeed support
configure:9370: result: no
configure:9380: checking for phpdbg support
configure:9415: result: yes
configure:9424: checking for phpdbg web SAPI support
configure:9459: result: no
configure:9468: checking for phpdbg debug build
configure:9482: result: no
configure:9491: checking for phpdbg readline support
configure:9505: result: no
configure:9512: checking whether termios.h defines TIOCGWINSZ
configure:9535: result: yes
configure:9589: checking for phpdbg and readline integration
configure:9604: result: disabled
configure:10037: checking for CGI build
configure:10040: result: yes
configure:10042: checking for socklen_t in sys/socket.h
configure:10051: result: yes
configure:10063: checking for sun_len in sys/un.h
configure:10072: result: yes
configure:10084: checking whether cross-process locking is required by accept()
configure:10095: result: no
configure:10245: checking for chosen SAPI module
configure:10247: result: none
configure:10250: checking for executable SAPI binaries
configure:10253: result: cli fpm phpdbg cgi
configure:10306: result:
configure:10308: result: Running system checks
configure:10316: checking for sendmail
configure:10335: found /usr/sbin/sendmail
configure:10347: result: /usr/sbin/sendmail
configure:10361: checking whether system uses EBCDIC
configure:10380: cc -o conftest -g -O2 -fvisibility=hidden -no-cpp-precomp conftest.c >&5
configure:10380: $? = 0
configure:10380: ./conftest
configure:10380: $? = 1
configure: program exited with status 1
configure: failed program was:
| /* confdefs.h */
| #define PACKAGE_NAME ""
| #define PACKAGE_TARNAME ""
| #define PACKAGE_VERSION ""
| #define PACKAGE_STRING ""
| #define PACKAGE_BUGREPORT ""
| #define PACKAGE_URL ""
| #define STDC_HEADERS 1
| #define HAVE_SYS_TYPES_H 1
| #define HAVE_SYS_STAT_H 1
| #define HAVE_STDLIB_H 1
| #define HAVE_STRING_H 1
| #define HAVE_MEMORY_H 1
| #define HAVE_STRINGS_H 1
| #define HAVE_INTTYPES_H 1
| #define HAVE_STDINT_H 1
| #define HAVE_UNISTD_H 1
| #define __EXTENSIONS__ 1
| #define _ALL_SOURCE 1
| #define _GNU_SOURCE 1
| #define _POSIX_PTHREAD_SEMANTICS 1
| #define _TANDEM_SOURCE 1
| #define HAVE_DEV_URANDOM 1
| #define HAVE_HUGE_VAL_INF 1
| #define HAVE_CPUID_COUNT 1
| #define HAVE_SETENV 1
| #define HAVE_ERRNO_H 1
| #define HAVE_FCNTL_H 1
| #define HAVE_STDIO_H 1
| #define HAVE_STDLIB_H 1
| #define HAVE_UNISTD_H 1
| #define HAVE_SYS_UIO_H 1
| #define HAVE_SYS_SELECT_H 1
| #define HAVE_SYS_SOCKET_H 1
| #define HAVE_SYS_TIME_H 1
| #define HAVE_ARPA_INET_H 1
| #define HAVE_NETINET_IN_H 1
| #define HAVE_SYSEXITS_H 1
| #define HAVE_CLOCK_GETTIME 1
| #define HAVE_MACH_VM_READ 1
| #define HAVE_BUILTIN_ATOMIC 1
| #define HAVE_SYSCONF 1
| #define HAVE_TIMES 1
| #define HAVE_KQUEUE 1
| #define HAVE_POLL 1
| #define HAVE_SELECT 1
| #define PHP_FPM_SYSTEMD "simple"
| #define PHP_FPM_USER "nobody"
| #define PHP_FPM_GROUP "nobody"
| #define HAVE_PHPDBG 1
| #define PHPDBG_DEBUG 0
| #define HAVE_SOCKLEN_T 1
| #define HAVE_SOCKADDR_UN_SUN_LEN 1
| /* end confdefs.h. */
|
| int main(void) {
| return (unsigned char)'A' != (unsigned char)0xC1;
| }
|
configure:10394: result: no
configure:10403: checking whether byte ordering is bigendian
configure:10429: cc -o conftest -g -O2 -fvisibility=hidden -no-cpp-precomp conftest.c >&5
configure:10429: $? = 0
configure:10429: ./conftest
configure:10429: $? = 1
configure: program exited with status 1
configure: failed program was:
| /* confdefs.h */
| #define PACKAGE_NAME ""
| #define PACKAGE_TARNAME ""
| #define PACKAGE_VERSION ""
| #define PACKAGE_STRING ""
| #define PACKAGE_BUGREPORT ""
| #define PACKAGE_URL ""
| #define STDC_HEADERS 1
| #define HAVE_SYS_TYPES_H 1
| #define HAVE_SYS_STAT_H 1
| #define HAVE_STDLIB_H 1
| #define HAVE_STRING_H 1
| #define HAVE_MEMORY_H 1
| #define HAVE_STRINGS_H 1
| #define HAVE_INTTYPES_H 1
| #define HAVE_STDINT_H 1
| #define HAVE_UNISTD_H 1
| #define __EXTENSIONS__ 1
| #define _ALL_SOURCE 1
| #define _GNU_SOURCE 1
| #define _POSIX_PTHREAD_SEMANTICS 1
| #define _TANDEM_SOURCE 1
| #define HAVE_DEV_URANDOM 1
| #define HAVE_HUGE_VAL_INF 1
| #define HAVE_CPUID_COUNT 1
| #define HAVE_SETENV 1
| #define HAVE_ERRNO_H 1
| #define HAVE_FCNTL_H 1
| #define HAVE_STDIO_H 1
| #define HAVE_STDLIB_H 1
| #define HAVE_UNISTD_H 1
| #define HAVE_SYS_UIO_H 1
| #define HAVE_SYS_SELECT_H 1
| #define HAVE_SYS_SOCKET_H 1
| #define HAVE_SYS_TIME_H 1
| #define HAVE_ARPA_INET_H 1
| #define HAVE_NETINET_IN_H 1
| #define HAVE_SYSEXITS_H 1
| #define HAVE_CLOCK_GETTIME 1
| #define HAVE_MACH_VM_READ 1
| #define HAVE_BUILTIN_ATOMIC 1
| #define HAVE_SYSCONF 1
| #define HAVE_TIMES 1
| #define HAVE_KQUEUE 1
| #define HAVE_POLL 1
| #define HAVE_SELECT 1
| #define PHP_FPM_SYSTEMD "simple"
| #define PHP_FPM_USER "nobody"
| #define PHP_FPM_GROUP "nobody"
| #define HAVE_PHPDBG 1
| #define PHPDBG_DEBUG 0
| #define HAVE_SOCKLEN_T 1
| #define HAVE_SOCKADDR_UN_SUN_LEN 1
| /* end confdefs.h. */
|
| int main(void)
| {
| short one = 1;
| char *cp = (char *)&one;
|
| if (*cp == 0) {
| return(0);
| } else {
| return(1);
| }
| }
|
configure:10440: result: no
configure:10450: checking whether writing to stdout works
configure:10479: cc -o conftest -g -O2 -fvisibility=hidden -no-cpp-precomp conftest.c >&5
conftest.c:62:1: warning: type specifier missing, defaults to 'int' [-Wimplicit-int]
main()
^
1 warning generated.
configure:10479: $? = 0
configure:10479: ./conftest
configure:10479: $? = 0
configure:10494: result: yes
configure:10549: checking for socket
configure:10549: cc -o conftest -g -O2 -fvisibility=hidden -no-cpp-precomp conftest.c >&5
configure:10549: $? = 0
configure:10549: result: yes
configure:10717: checking for socketpair
configure:10717: cc -o conftest -g -O2 -fvisibility=hidden -no-cpp-precomp conftest.c >&5
configure:10717: $? = 0
configure:10717: result: yes
configure:10885: checking for htonl
configure:10885: cc -o conftest -g -O2 -fvisibility=hidden -no-cpp-precomp conftest.c >&5
configure:10885: $? = 0
configure:10885: result: yes
configure:11053: checking for gethostname
configure:11053: cc -o conftest -g -O2 -fvisibility=hidden -no-cpp-precomp conftest.c >&5
configure:11053: $? = 0
configure:11053: result: yes
configure:11221: checking for gethostbyaddr
configure:11221: cc -o conftest -g -O2 -fvisibility=hidden -no-cpp-precomp conftest.c >&5
configure:11221: $? = 0
configure:11221: result: yes
configure:11389: checking for yp_get_default_domain
configure:11389: cc -o conftest -g -O2 -fvisibility=hidden -no-cpp-precomp conftest.c >&5
configure:11389: $? = 0
configure:11389: result: yes
configure:11558: checking for dlopen
configure:11558: cc -o conftest -g -O2 -fvisibility=hidden -no-cpp-precomp conftest.c >&5
configure:11558: $? = 0
configure:11558: result: yes
configure:11726: checking for sin in -lm
configure:11751: cc -o conftest -g -O2 -fvisibility=hidden -no-cpp-precomp conftest.c -lm >&5
conftest.c:71:6: warning: incompatible redeclaration of library function 'sin' [-Wincompatible-library-redeclaration]
char sin ();
^
conftest.c:71:6: note: 'sin' is a builtin with type 'double (double)'
1 warning generated.
configure:11751: $? = 0
configure:11760: result: yes
configure:11777: checking for inet_aton
configure:11777: cc -o conftest -g -O2 -fvisibility=hidden -no-cpp-precomp conftest.c -lm >&5
configure:11777: $? = 0
configure:11777: result: yes
configure:12077: checking for ANSI C header files
configure:12181: result: yes
configure:12192: checking for dirent.h that defines DIR
configure:12211: cc -c -g -O2 -fvisibility=hidden -no-cpp-precomp conftest.c >&5
configure:12211: $? = 0
configure:12219: result: yes
configure:12232: checking for library containing opendir
configure:12263: cc -o conftest -g -O2 -fvisibility=hidden -no-cpp-precomp conftest.c -lm >&5
configure:12263: $? = 0
configure:12280: result: none required
configure:12410: checking for inttypes.h
configure:12410: result: yes
configure:12410: checking for stdint.h
configure:12410: result: yes
configure:12410: checking for dirent.h
configure:12410: cc -c -g -O2 -fvisibility=hidden -no-cpp-precomp conftest.c >&5
configure:12410: $? = 0
configure:12410: result: yes
configure:12410: checking for ApplicationServices/ApplicationServices.h
configure:12410: cc -c -g -O2 -fvisibility=hidden -no-cpp-precomp conftest.c >&5
configure:12410: $? = 0
configure:12410: result: yes
configure:12410: checking for sys/param.h
configure:12410: cc -c -g -O2 -fvisibility=hidden -no-cpp-precomp conftest.c >&5
configure:12410: $? = 0
configure:12410: result: yes
configure:12410: checking for sys/types.h
configure:12410: result: yes
configure:12410: checking for sys/time.h
configure:12410: result: yes
configure:12410: checking for netinet/in.h
configure:12410: result: yes
configure:12410: checking for alloca.h
configure:12410: cc -c -g -O2 -fvisibility=hidden -no-cpp-precomp conftest.c >&5
configure:12410: $? = 0
configure:12410: result: yes
configure:12410: checking for arpa/inet.h
configure:12410: result: yes
configure:12410: checking for arpa/nameser.h
configure:12410: cc -c -g -O2 -fvisibility=hidden -no-cpp-precomp conftest.c >&5
configure:12410: $? = 0
configure:12410: result: yes
configure:12410: checking for assert.h
configure:12410: cc -c -g -O2 -fvisibility=hidden -no-cpp-precomp conftest.c >&5
configure:12410: $? = 0
configure:12410: result: yes
configure:12410: checking for crypt.h
configure:12410: cc -c -g -O2 -fvisibility=hidden -no-cpp-precomp conftest.c >&5
conftest.c:98:10: fatal error: 'crypt.h' file not found
#include <crypt.h>
^~~~~~~~~
1 error generated.
configure:12410: $? = 1
configure: failed program was:
| /* confdefs.h */
| #define PACKAGE_NAME ""
| #define PACKAGE_TARNAME ""
| #define PACKAGE_VERSION ""
| #define PACKAGE_STRING ""
| #define PACKAGE_BUGREPORT ""
| #define PACKAGE_URL ""
| #define STDC_HEADERS 1
| #define HAVE_SYS_TYPES_H 1
| #define HAVE_SYS_STAT_H 1
| #define HAVE_STDLIB_H 1
| #define HAVE_STRING_H 1
| #define HAVE_MEMORY_H 1
| #define HAVE_STRINGS_H 1
| #define HAVE_INTTYPES_H 1
| #define HAVE_STDINT_H 1
| #define HAVE_UNISTD_H 1
| #define __EXTENSIONS__ 1
| #define _ALL_SOURCE 1
| #define _GNU_SOURCE 1
| #define _POSIX_PTHREAD_SEMANTICS 1
| #define _TANDEM_SOURCE 1
| #define HAVE_DEV_URANDOM 1
| #define HAVE_HUGE_VAL_INF 1
| #define HAVE_CPUID_COUNT 1
| #define HAVE_SETENV 1
| #define HAVE_ERRNO_H 1
| #define HAVE_FCNTL_H 1
| #define HAVE_STDIO_H 1
| #define HAVE_STDLIB_H 1
| #define HAVE_UNISTD_H 1
| #define HAVE_SYS_UIO_H 1
| #define HAVE_SYS_SELECT_H 1
| #define HAVE_SYS_SOCKET_H 1
| #define HAVE_SYS_TIME_H 1
| #define HAVE_ARPA_INET_H 1
| #define HAVE_NETINET_IN_H 1
| #define HAVE_SYSEXITS_H 1
| #define HAVE_CLOCK_GETTIME 1
| #define HAVE_MACH_VM_READ 1
| #define HAVE_BUILTIN_ATOMIC 1
| #define HAVE_SYSCONF 1
| #define HAVE_TIMES 1
| #define HAVE_KQUEUE 1
| #define HAVE_POLL 1
| #define HAVE_SELECT 1
| #define PHP_FPM_SYSTEMD "simple"
| #define PHP_FPM_USER "nobody"
| #define PHP_FPM_GROUP "nobody"
| #define HAVE_PHPDBG 1
| #define PHPDBG_DEBUG 0
| #define HAVE_SOCKLEN_T 1
| #define HAVE_SOCKADDR_UN_SUN_LEN 1
| #define PHP_WRITE_STDOUT 1
| #define HAVE_SOCKET 1
| #define HAVE_SOCKETPAIR 1
| #define HAVE_HTONL 1
| #define HAVE_GETHOSTNAME 1
| #define HAVE_GETHOSTBYADDR 1
| #define HAVE_YP_GET_DEFAULT_DOMAIN 1
| #define HAVE_DLOPEN 1
| #define HAVE_LIBDL 1
| #define HAVE_LIBM 1
| #define HAVE_INET_ATON 1
| #define STDC_HEADERS 1
| #define HAVE_DIRENT_H 1
| #define HAVE_INTTYPES_H 1
| #define HAVE_STDINT_H 1
| #define HAVE_DIRENT_H 1
| #define HAVE_APPLICATIONSERVICES_APPLICATIONSERVICES_H 1
| #define HAVE_SYS_PARAM_H 1
| #define HAVE_SYS_TYPES_H 1
| #define HAVE_SYS_TIME_H 1
| #define HAVE_NETINET_IN_H 1
| #define HAVE_ALLOCA_H 1
| #define HAVE_ARPA_INET_H 1
| #define HAVE_ARPA_NAMESER_H 1
| #define HAVE_ASSERT_H 1
| /* end confdefs.h. */
|
| #ifdef HAVE_SYS_PARAM_H
| #include <sys/param.h>
| #endif
| #ifdef HAVE_SYS_TYPES_H
| #include <sys/types.h>
| #endif
| #ifdef HAVE_SYS_TIME_H
| #include <sys/time.h>
| #endif
| #ifdef HAVE_NETINET_IN_H
| #include <netinet/in.h>
| #endif
| #ifdef HAVE_ARPA_NAMESER_H
| #include <arpa/nameser.h>
| #endif
|
|
| #include <crypt.h>
configure:12410: result: no
configure:12410: checking for dns.h
configure:12410: cc -c -g -O2 -fvisibility=hidden -no-cpp-precomp conftest.c >&5
configure:12410: $? = 0
configure:12410: result: yes
configure:12410: checking for fcntl.h
configure:12410: result: yes
configure:12410: checking for grp.h
configure:12410: cc -c -g -O2 -fvisibility=hidden -no-cpp-precomp conftest.c >&5
configure:12410: $? = 0
configure:12410: result: yes
configure:12410: checking for ieeefp.h
configure:12410: cc -c -g -O2 -fvisibility=hidden -no-cpp-precomp conftest.c >&5
conftest.c:101:10: fatal error: 'ieeefp.h' file not found
#include <ieeefp.h>
^~~~~~~~~~
1 error generated.
configure:12410: $? = 1
configure: failed program was:
| /* confdefs.h */
| #define PACKAGE_NAME ""
| #define PACKAGE_TARNAME ""
| #define PACKAGE_VERSION ""
| #define PACKAGE_STRING ""
| #define PACKAGE_BUGREPORT ""
| #define PACKAGE_URL ""
| #define STDC_HEADERS 1
| #define HAVE_SYS_TYPES_H 1
| #define HAVE_SYS_STAT_H 1
| #define HAVE_STDLIB_H 1
| #define HAVE_STRING_H 1
| #define HAVE_MEMORY_H 1
| #define HAVE_STRINGS_H 1
| #define HAVE_INTTYPES_H 1
| #define HAVE_STDINT_H 1
| #define HAVE_UNISTD_H 1
| #define __EXTENSIONS__ 1
| #define _ALL_SOURCE 1
| #define _GNU_SOURCE 1
| #define _POSIX_PTHREAD_SEMANTICS 1
| #define _TANDEM_SOURCE 1
| #define HAVE_DEV_URANDOM 1
| #define HAVE_HUGE_VAL_INF 1
| #define HAVE_CPUID_COUNT 1
| #define HAVE_SETENV 1
| #define HAVE_ERRNO_H 1
| #define HAVE_FCNTL_H 1
| #define HAVE_STDIO_H 1
| #define HAVE_STDLIB_H 1
| #define HAVE_UNISTD_H 1
| #define HAVE_SYS_UIO_H 1
| #define HAVE_SYS_SELECT_H 1
| #define HAVE_SYS_SOCKET_H 1
| #define HAVE_SYS_TIME_H 1
| #define HAVE_ARPA_INET_H 1
| #define HAVE_NETINET_IN_H 1
| #define HAVE_SYSEXITS_H 1
| #define HAVE_CLOCK_GETTIME 1
| #define HAVE_MACH_VM_READ 1
| #define HAVE_BUILTIN_ATOMIC 1
| #define HAVE_SYSCONF 1
| #define HAVE_TIMES 1
| #define HAVE_KQUEUE 1
| #define HAVE_POLL 1
| #define HAVE_SELECT 1
| #define PHP_FPM_SYSTEMD "simple"
| #define PHP_FPM_USER "nobody"
| #define PHP_FPM_GROUP "nobody"
| #define HAVE_PHPDBG 1
| #define PHPDBG_DEBUG 0
| #define HAVE_SOCKLEN_T 1
| #define HAVE_SOCKADDR_UN_SUN_LEN 1
| #define PHP_WRITE_STDOUT 1
| #define HAVE_SOCKET 1
| #define HAVE_SOCKETPAIR 1
| #define HAVE_HTONL 1
| #define HAVE_GETHOSTNAME 1
| #define HAVE_GETHOSTBYADDR 1
| #define HAVE_YP_GET_DEFAULT_DOMAIN 1
| #define HAVE_DLOPEN 1
| #define HAVE_LIBDL 1
| #define HAVE_LIBM 1
| #define HAVE_INET_ATON 1
| #define STDC_HEADERS 1
| #define HAVE_DIRENT_H 1
| #define HAVE_INTTYPES_H 1
| #define HAVE_STDINT_H 1
| #define HAVE_DIRENT_H 1
| #define HAVE_APPLICATIONSERVICES_APPLICATIONSERVICES_H 1
| #define HAVE_SYS_PARAM_H 1
| #define HAVE_SYS_TYPES_H 1
| #define HAVE_SYS_TIME_H 1
| #define HAVE_NETINET_IN_H 1
| #define HAVE_ALLOCA_H 1
| #define HAVE_ARPA_INET_H 1
| #define HAVE_ARPA_NAMESER_H 1
| #define HAVE_ASSERT_H 1
| #define HAVE_DNS_H 1
| #define HAVE_FCNTL_H 1
| #define HAVE_GRP_H 1
| /* end confdefs.h. */
|
| #ifdef HAVE_SYS_PARAM_H
| #include <sys/param.h>
| #endif
| #ifdef HAVE_SYS_TYPES_H
| #include <sys/types.h>
| #endif
| #ifdef HAVE_SYS_TIME_H
| #include <sys/time.h>
| #endif
| #ifdef HAVE_NETINET_IN_H
| #include <netinet/in.h>
| #endif
| #ifdef HAVE_ARPA_NAMESER_H
| #include <arpa/nameser.h>
| #endif
|
|
| #include <ieeefp.h>
configure:12410: result: no
configure:12410: checking for langinfo.h
configure:12410: cc -c -g -O2 -fvisibility=hidden -no-cpp-precomp conftest.c >&5
configure:12410: $? = 0
configure:12410: result: yes
configure:12410: checking for limits.h
configure:12410: cc -c -g -O2 -fvisibility=hidden -no-cpp-precomp conftest.c >&5
configure:12410: $? = 0
configure:12410: result: yes
configure:12410: checking for locale.h
configure:12410: cc -c -g -O2 -fvisibility=hidden -no-cpp-precomp conftest.c >&5
configure:12410: $? = 0
configure:12410: result: yes
configure:12410: checking for monetary.h
configure:12410: cc -c -g -O2 -fvisibility=hidden -no-cpp-precomp conftest.c >&5
configure:12410: $? = 0
configure:12410: result: yes
configure:12410: checking for netdb.h
configure:12410: cc -c -g -O2 -fvisibility=hidden -no-cpp-precomp conftest.c >&5
configure:12410: $? = 0
configure:12410: result: yes
configure:12410: checking for poll.h
configure:12410: cc -c -g -O2 -fvisibility=hidden -no-cpp-precomp conftest.c >&5
configure:12410: $? = 0
configure:12410: result: yes
configure:12410: checking for pwd.h
configure:12410: cc -c -g -O2 -fvisibility=hidden -no-cpp-precomp conftest.c >&5
configure:12410: $? = 0
configure:12410: result: yes
configure:12410: checking for resolv.h
configure:12410: cc -c -g -O2 -fvisibility=hidden -no-cpp-precomp conftest.c >&5
configure:12410: $? = 0
configure:12410: result: yes
configure:12410: checking for signal.h
configure:12410: cc -c -g -O2 -fvisibility=hidden -no-cpp-precomp conftest.c >&5
configure:12410: $? = 0
configure:12410: result: yes
configure:12410: checking for stdarg.h
configure:12410: cc -c -g -O2 -fvisibility=hidden -no-cpp-precomp conftest.c >&5
configure:12410: $? = 0
configure:12410: result: yes
configure:12410: checking for stdlib.h
configure:12410: result: yes
configure:12410: checking for string.h
configure:12410: result: yes
configure:12410: checking for syslog.h
configure:12410: cc -c -g -O2 -fvisibility=hidden -no-cpp-precomp conftest.c >&5
configure:12410: $? = 0
configure:12410: result: yes
configure:12410: checking for sysexits.h
configure:12410: result: yes
configure:12410: checking for sys/ioctl.h
configure:12410: cc -c -g -O2 -fvisibility=hidden -no-cpp-precomp conftest.c >&5
configure:12410: $? = 0
configure:12410: result: yes
configure:12410: checking for sys/file.h
configure:12410: cc -c -g -O2 -fvisibility=hidden -no-cpp-precomp conftest.c >&5
configure:12410: $? = 0
configure:12410: result: yes
configure:12410: checking for sys/mman.h
configure:12410: cc -c -g -O2 -fvisibility=hidden -no-cpp-precomp conftest.c >&5
configure:12410: $? = 0
configure:12410: result: yes
configure:12410: checking for sys/mount.h
configure:12410: cc -c -g -O2 -fvisibility=hidden -no-cpp-precomp conftest.c >&5
configure:12410: $? = 0
configure:12410: result: yes
configure:12410: checking for sys/poll.h
configure:12410: cc -c -g -O2 -fvisibility=hidden -no-cpp-precomp conftest.c >&5
configure:12410: $? = 0
configure:12410: result: yes
configure:12410: checking for sys/resource.h
configure:12410: cc -c -g -O2 -fvisibility=hidden -no-cpp-precomp conftest.c >&5
configure:12410: $? = 0
configure:12410: result: yes
configure:12410: checking for sys/select.h
configure:12410: result: yes
configure:12410: checking for sys/socket.h
configure:12410: result: yes
configure:12410: checking for sys/stat.h
configure:12410: result: yes
configure:12410: checking for sys/statfs.h
configure:12410: cc -c -g -O2 -fvisibility=hidden -no-cpp-precomp conftest.c >&5
conftest.c:124:10: fatal error: 'sys/statfs.h' file not found
#include <sys/statfs.h>
^~~~~~~~~~~~~~
1 error generated.
configure:12410: $? = 1
configure: failed program was:
| /* confdefs.h */
| #define PACKAGE_NAME ""
| #define PACKAGE_TARNAME ""
| #define PACKAGE_VERSION ""
| #define PACKAGE_STRING ""
| #define PACKAGE_BUGREPORT ""
| #define PACKAGE_URL ""
| #define STDC_HEADERS 1
| #define HAVE_SYS_TYPES_H 1
| #define HAVE_SYS_STAT_H 1
| #define HAVE_STDLIB_H 1
| #define HAVE_STRING_H 1
| #define HAVE_MEMORY_H 1
| #define HAVE_STRINGS_H 1
| #define HAVE_INTTYPES_H 1
| #define HAVE_STDINT_H 1
| #define HAVE_UNISTD_H 1
| #define __EXTENSIONS__ 1
| #define _ALL_SOURCE 1
| #define _GNU_SOURCE 1
| #define _POSIX_PTHREAD_SEMANTICS 1
| #define _TANDEM_SOURCE 1
| #define HAVE_DEV_URANDOM 1
| #define HAVE_HUGE_VAL_INF 1
| #define HAVE_CPUID_COUNT 1
| #define HAVE_SETENV 1
| #define HAVE_ERRNO_H 1
| #define HAVE_FCNTL_H 1
| #define HAVE_STDIO_H 1
| #define HAVE_STDLIB_H 1
| #define HAVE_UNISTD_H 1
| #define HAVE_SYS_UIO_H 1
| #define HAVE_SYS_SELECT_H 1
| #define HAVE_SYS_SOCKET_H 1
| #define HAVE_SYS_TIME_H 1
| #define HAVE_ARPA_INET_H 1
| #define HAVE_NETINET_IN_H 1
| #define HAVE_SYSEXITS_H 1
| #define HAVE_CLOCK_GETTIME 1
| #define HAVE_MACH_VM_READ 1
| #define HAVE_BUILTIN_ATOMIC 1
| #define HAVE_SYSCONF 1
| #define HAVE_TIMES 1
| #define HAVE_KQUEUE 1
| #define HAVE_POLL 1
| #define HAVE_SELECT 1
| #define PHP_FPM_SYSTEMD "simple"
| #define PHP_FPM_USER "nobody"
| #define PHP_FPM_GROUP "nobody"
| #define HAVE_PHPDBG 1
| #define PHPDBG_DEBUG 0
| #define HAVE_SOCKLEN_T 1
| #define HAVE_SOCKADDR_UN_SUN_LEN 1
| #define PHP_WRITE_STDOUT 1
| #define HAVE_SOCKET 1
| #define HAVE_SOCKETPAIR 1
| #define HAVE_HTONL 1
| #define HAVE_GETHOSTNAME 1
| #define HAVE_GETHOSTBYADDR 1
| #define HAVE_YP_GET_DEFAULT_DOMAIN 1
| #define HAVE_DLOPEN 1
| #define HAVE_LIBDL 1
| #define HAVE_LIBM 1
| #define HAVE_INET_ATON 1
| #define STDC_HEADERS 1
| #define HAVE_DIRENT_H 1
| #define HAVE_INTTYPES_H 1
| #define HAVE_STDINT_H 1
| #define HAVE_DIRENT_H 1
| #define HAVE_APPLICATIONSERVICES_APPLICATIONSERVICES_H 1
| #define HAVE_SYS_PARAM_H 1
| #define HAVE_SYS_TYPES_H 1
| #define HAVE_SYS_TIME_H 1
| #define HAVE_NETINET_IN_H 1
| #define HAVE_ALLOCA_H 1
| #define HAVE_ARPA_INET_H 1
| #define HAVE_ARPA_NAMESER_H 1
| #define HAVE_ASSERT_H 1
| #define HAVE_DNS_H 1
| #define HAVE_FCNTL_H 1
| #define HAVE_GRP_H 1
| #define HAVE_LANGINFO_H 1
| #define HAVE_LIMITS_H 1
| #define HAVE_LOCALE_H 1
| #define HAVE_MONETARY_H 1
| #define HAVE_NETDB_H 1
| #define HAVE_POLL_H 1
| #define HAVE_PWD_H 1
| #define HAVE_RESOLV_H 1
| #define HAVE_SIGNAL_H 1
| #define HAVE_STDARG_H 1
| #define HAVE_STDLIB_H 1
| #define HAVE_STRING_H 1
| #define HAVE_SYSLOG_H 1
| #define HAVE_SYSEXITS_H 1
| #define HAVE_SYS_IOCTL_H 1
| #define HAVE_SYS_FILE_H 1
| #define HAVE_SYS_MMAN_H 1
| #define HAVE_SYS_MOUNT_H 1
| #define HAVE_SYS_POLL_H 1
| #define HAVE_SYS_RESOURCE_H 1
| #define HAVE_SYS_SELECT_H 1
| #define HAVE_SYS_SOCKET_H 1
| #define HAVE_SYS_STAT_H 1
| /* end confdefs.h. */
|
| #ifdef HAVE_SYS_PARAM_H
| #include <sys/param.h>
| #endif
| #ifdef HAVE_SYS_TYPES_H
| #include <sys/types.h>
| #endif
| #ifdef HAVE_SYS_TIME_H
| #include <sys/time.h>
| #endif
| #ifdef HAVE_NETINET_IN_H
| #include <netinet/in.h>
| #endif
| #ifdef HAVE_ARPA_NAMESER_H
| #include <arpa/nameser.h>
| #endif
|
|
| #include <sys/statfs.h>
configure:12410: result: no
configure:12410: checking for sys/statvfs.h
configure:12410: cc -c -g -O2 -fvisibility=hidden -no-cpp-precomp conftest.c >&5
configure:12410: $? = 0
configure:12410: result: yes
configure:12410: checking for sys/vfs.h
configure:12410: cc -c -g -O2 -fvisibility=hidden -no-cpp-precomp conftest.c >&5
conftest.c:125:10: fatal error: 'sys/vfs.h' file not found
#include <sys/vfs.h>
^~~~~~~~~~~
1 error generated.
configure:12410: $? = 1
configure: failed program was:
| /* confdefs.h */
| #define PACKAGE_NAME ""
| #define PACKAGE_TARNAME ""
| #define PACKAGE_VERSION ""
| #define PACKAGE_STRING ""
| #define PACKAGE_BUGREPORT ""
| #define PACKAGE_URL ""
| #define STDC_HEADERS 1
| #define HAVE_SYS_TYPES_H 1
| #define HAVE_SYS_STAT_H 1
| #define HAVE_STDLIB_H 1
| #define HAVE_STRING_H 1
| #define HAVE_MEMORY_H 1
| #define HAVE_STRINGS_H 1
| #define HAVE_INTTYPES_H 1
| #define HAVE_STDINT_H 1
| #define HAVE_UNISTD_H 1
| #define __EXTENSIONS__ 1
| #define _ALL_SOURCE 1
| #define _GNU_SOURCE 1
| #define _POSIX_PTHREAD_SEMANTICS 1
| #define _TANDEM_SOURCE 1
| #define HAVE_DEV_URANDOM 1
| #define HAVE_HUGE_VAL_INF 1
| #define HAVE_CPUID_COUNT 1
| #define HAVE_SETENV 1
| #define HAVE_ERRNO_H 1
| #define HAVE_FCNTL_H 1
| #define HAVE_STDIO_H 1
| #define HAVE_STDLIB_H 1
| #define HAVE_UNISTD_H 1
| #define HAVE_SYS_UIO_H 1
| #define HAVE_SYS_SELECT_H 1
| #define HAVE_SYS_SOCKET_H 1
| #define HAVE_SYS_TIME_H 1
| #define HAVE_ARPA_INET_H 1
| #define HAVE_NETINET_IN_H 1
| #define HAVE_SYSEXITS_H 1
| #define HAVE_CLOCK_GETTIME 1
| #define HAVE_MACH_VM_READ 1
| #define HAVE_BUILTIN_ATOMIC 1
| #define HAVE_SYSCONF 1
| #define HAVE_TIMES 1
| #define HAVE_KQUEUE 1
| #define HAVE_POLL 1
| #define HAVE_SELECT 1
| #define PHP_FPM_SYSTEMD "simple"
| #define PHP_FPM_USER "nobody"
| #define PHP_FPM_GROUP "nobody"
| #define HAVE_PHPDBG 1
| #define PHPDBG_DEBUG 0
| #define HAVE_SOCKLEN_T 1
| #define HAVE_SOCKADDR_UN_SUN_LEN 1
| #define PHP_WRITE_STDOUT 1
| #define HAVE_SOCKET 1
| #define HAVE_SOCKETPAIR 1
| #define HAVE_HTONL 1
| #define HAVE_GETHOSTNAME 1
| #define HAVE_GETHOSTBYADDR 1
| #define HAVE_YP_GET_DEFAULT_DOMAIN 1
| #define HAVE_DLOPEN 1
| #define HAVE_LIBDL 1
| #define HAVE_LIBM 1
| #define HAVE_INET_ATON 1
| #define STDC_HEADERS 1
| #define HAVE_DIRENT_H 1
| #define HAVE_INTTYPES_H 1
| #define HAVE_STDINT_H 1
| #define HAVE_DIRENT_H 1
| #define HAVE_APPLICATIONSERVICES_APPLICATIONSERVICES_H 1
| #define HAVE_SYS_PARAM_H 1
| #define HAVE_SYS_TYPES_H 1
| #define HAVE_SYS_TIME_H 1
| #define HAVE_NETINET_IN_H 1
| #define HAVE_ALLOCA_H 1
| #define HAVE_ARPA_INET_H 1
| #define HAVE_ARPA_NAMESER_H 1
| #define HAVE_ASSERT_H 1
| #define HAVE_DNS_H 1
| #define HAVE_FCNTL_H 1
| #define HAVE_GRP_H 1
| #define HAVE_LANGINFO_H 1
| #define HAVE_LIMITS_H 1
| #define HAVE_LOCALE_H 1
| #define HAVE_MONETARY_H 1
| #define HAVE_NETDB_H 1
| #define HAVE_POLL_H 1
| #define HAVE_PWD_H 1
| #define HAVE_RESOLV_H 1
| #define HAVE_SIGNAL_H 1
| #define HAVE_STDARG_H 1
| #define HAVE_STDLIB_H 1
| #define HAVE_STRING_H 1
| #define HAVE_SYSLOG_H 1
| #define HAVE_SYSEXITS_H 1
| #define HAVE_SYS_IOCTL_H 1
| #define HAVE_SYS_FILE_H 1
| #define HAVE_SYS_MMAN_H 1
| #define HAVE_SYS_MOUNT_H 1
| #define HAVE_SYS_POLL_H 1
| #define HAVE_SYS_RESOURCE_H 1
| #define HAVE_SYS_SELECT_H 1
| #define HAVE_SYS_SOCKET_H 1
| #define HAVE_SYS_STAT_H 1
| #define HAVE_SYS_STATVFS_H 1
| /* end confdefs.h. */
|
| #ifdef HAVE_SYS_PARAM_H
| #include <sys/param.h>
| #endif
| #ifdef HAVE_SYS_TYPES_H
| #include <sys/types.h>
| #endif
| #ifdef HAVE_SYS_TIME_H
| #include <sys/time.h>
| #endif
| #ifdef HAVE_NETINET_IN_H
| #include <netinet/in.h>
| #endif
| #ifdef HAVE_ARPA_NAMESER_H
| #include <arpa/nameser.h>
| #endif
|
|
| #include <sys/vfs.h>
configure:12410: result: no
configure:12410: checking for sys/sysexits.h
configure:12410: cc -c -g -O2 -fvisibility=hidden -no-cpp-precomp conftest.c >&5
conftest.c:125:10: fatal error: 'sys/sysexits.h' file not found
#include <sys/sysexits.h>
^~~~~~~~~~~~~~~~
1 error generated.
configure:12410: $? = 1
configure: failed program was:
| /* confdefs.h */
| #define PACKAGE_NAME ""
| #define PACKAGE_TARNAME ""
| #define PACKAGE_VERSION ""
| #define PACKAGE_STRING ""
| #define PACKAGE_BUGREPORT ""
| #define PACKAGE_URL ""
| #define STDC_HEADERS 1
| #define HAVE_SYS_TYPES_H 1
| #define HAVE_SYS_STAT_H 1
| #define HAVE_STDLIB_H 1
| #define HAVE_STRING_H 1
| #define HAVE_MEMORY_H 1
| #define HAVE_STRINGS_H 1
| #define HAVE_INTTYPES_H 1
| #define HAVE_STDINT_H 1
| #define HAVE_UNISTD_H 1
| #define __EXTENSIONS__ 1
| #define _ALL_SOURCE 1
| #define _GNU_SOURCE 1
| #define _POSIX_PTHREAD_SEMANTICS 1
| #define _TANDEM_SOURCE 1
| #define HAVE_DEV_URANDOM 1
| #define HAVE_HUGE_VAL_INF 1
| #define HAVE_CPUID_COUNT 1
| #define HAVE_SETENV 1
| #define HAVE_ERRNO_H 1
| #define HAVE_FCNTL_H 1
| #define HAVE_STDIO_H 1
| #define HAVE_STDLIB_H 1
| #define HAVE_UNISTD_H 1
| #define HAVE_SYS_UIO_H 1
| #define HAVE_SYS_SELECT_H 1
| #define HAVE_SYS_SOCKET_H 1
| #define HAVE_SYS_TIME_H 1
| #define HAVE_ARPA_INET_H 1
| #define HAVE_NETINET_IN_H 1
| #define HAVE_SYSEXITS_H 1
| #define HAVE_CLOCK_GETTIME 1
| #define HAVE_MACH_VM_READ 1
| #define HAVE_BUILTIN_ATOMIC 1
| #define HAVE_SYSCONF 1
| #define HAVE_TIMES 1
| #define HAVE_KQUEUE 1
| #define HAVE_POLL 1
| #define HAVE_SELECT 1
| #define PHP_FPM_SYSTEMD "simple"
| #define PHP_FPM_USER "nobody"
| #define PHP_FPM_GROUP "nobody"
| #define HAVE_PHPDBG 1
| #define PHPDBG_DEBUG 0
| #define HAVE_SOCKLEN_T 1
| #define HAVE_SOCKADDR_UN_SUN_LEN 1
| #define PHP_WRITE_STDOUT 1
| #define HAVE_SOCKET 1
| #define HAVE_SOCKETPAIR 1
| #define HAVE_HTONL 1
| #define HAVE_GETHOSTNAME 1
| #define HAVE_GETHOSTBYADDR 1
| #define HAVE_YP_GET_DEFAULT_DOMAIN 1
| #define HAVE_DLOPEN 1
| #define HAVE_LIBDL 1
| #define HAVE_LIBM 1
| #define HAVE_INET_ATON 1
| #define STDC_HEADERS 1
| #define HAVE_DIRENT_H 1
| #define HAVE_INTTYPES_H 1
| #define HAVE_STDINT_H 1
| #define HAVE_DIRENT_H 1
| #define HAVE_APPLICATIONSERVICES_APPLICATIONSERVICES_H 1
| #define HAVE_SYS_PARAM_H 1
| #define HAVE_SYS_TYPES_H 1
| #define HAVE_SYS_TIME_H 1
| #define HAVE_NETINET_IN_H 1
| #define HAVE_ALLOCA_H 1
| #define HAVE_ARPA_INET_H 1
| #define HAVE_ARPA_NAMESER_H 1
| #define HAVE_ASSERT_H 1
| #define HAVE_DNS_H 1
| #define HAVE_FCNTL_H 1
| #define HAVE_GRP_H 1
| #define HAVE_LANGINFO_H 1
| #define HAVE_LIMITS_H 1
| #define HAVE_LOCALE_H 1
| #define HAVE_MONETARY_H 1
| #define HAVE_NETDB_H 1
| #define HAVE_POLL_H 1
| #define HAVE_PWD_H 1
| #define HAVE_RESOLV_H 1
| #define HAVE_SIGNAL_H 1
| #define HAVE_STDARG_H 1
| #define HAVE_STDLIB_H 1
| #define HAVE_STRING_H 1
| #define HAVE_SYSLOG_H 1
| #define HAVE_SYSEXITS_H 1
| #define HAVE_SYS_IOCTL_H 1
| #define HAVE_SYS_FILE_H 1
| #define HAVE_SYS_MMAN_H 1
| #define HAVE_SYS_MOUNT_H 1
| #define HAVE_SYS_POLL_H 1
| #define HAVE_SYS_RESOURCE_H 1
| #define HAVE_SYS_SELECT_H 1
| #define HAVE_SYS_SOCKET_H 1
| #define HAVE_SYS_STAT_H 1
| #define HAVE_SYS_STATVFS_H 1
| /* end confdefs.h. */
|
| #ifdef HAVE_SYS_PARAM_H
| #include <sys/param.h>
| #endif
| #ifdef HAVE_SYS_TYPES_H
| #include <sys/types.h>
| #endif
| #ifdef HAVE_SYS_TIME_H
| #include <sys/time.h>
| #endif
| #ifdef HAVE_NETINET_IN_H
| #include <netinet/in.h>
| #endif
| #ifdef HAVE_ARPA_NAMESER_H
| #include <arpa/nameser.h>
| #endif
|
|
| #include <sys/sysexits.h>
configure:12410: result: no
configure:12410: checking for sys/varargs.h
configure:12410: cc -c -g -O2 -fvisibility=hidden -no-cpp-precomp conftest.c >&5
conftest.c:125:10: fatal error: 'sys/varargs.h' file not found
#include <sys/varargs.h>
^~~~~~~~~~~~~~~
1 error generated.
configure:12410: $? = 1
configure: failed program was:
| /* confdefs.h */
| #define PACKAGE_NAME ""
| #define PACKAGE_TARNAME ""
| #define PACKAGE_VERSION ""
| #define PACKAGE_STRING ""
| #define PACKAGE_BUGREPORT ""
| #define PACKAGE_URL ""
| #define STDC_HEADERS 1
| #define HAVE_SYS_TYPES_H 1
| #define HAVE_SYS_STAT_H 1
| #define HAVE_STDLIB_H 1
| #define HAVE_STRING_H 1
| #define HAVE_MEMORY_H 1
| #define HAVE_STRINGS_H 1
| #define HAVE_INTTYPES_H 1
| #define HAVE_STDINT_H 1
| #define HAVE_UNISTD_H 1
| #define __EXTENSIONS__ 1
| #define _ALL_SOURCE 1
| #define _GNU_SOURCE 1
| #define _POSIX_PTHREAD_SEMANTICS 1
| #define _TANDEM_SOURCE 1
| #define HAVE_DEV_URANDOM 1
| #define HAVE_HUGE_VAL_INF 1
| #define HAVE_CPUID_COUNT 1
| #define HAVE_SETENV 1
| #define HAVE_ERRNO_H 1
| #define HAVE_FCNTL_H 1
| #define HAVE_STDIO_H 1
| #define HAVE_STDLIB_H 1
| #define HAVE_UNISTD_H 1
| #define HAVE_SYS_UIO_H 1
| #define HAVE_SYS_SELECT_H 1
| #define HAVE_SYS_SOCKET_H 1
| #define HAVE_SYS_TIME_H 1
| #define HAVE_ARPA_INET_H 1
| #define HAVE_NETINET_IN_H 1
| #define HAVE_SYSEXITS_H 1
| #define HAVE_CLOCK_GETTIME 1
| #define HAVE_MACH_VM_READ 1
| #define HAVE_BUILTIN_ATOMIC 1
| #define HAVE_SYSCONF 1
| #define HAVE_TIMES 1
| #define HAVE_KQUEUE 1
| #define HAVE_POLL 1
| #define HAVE_SELECT 1
| #define PHP_FPM_SYSTEMD "simple"
| #define PHP_FPM_USER "nobody"
| #define PHP_FPM_GROUP "nobody"
| #define HAVE_PHPDBG 1
| #define PHPDBG_DEBUG 0
| #define HAVE_SOCKLEN_T 1
| #define HAVE_SOCKADDR_UN_SUN_LEN 1
| #define PHP_WRITE_STDOUT 1
| #define HAVE_SOCKET 1
| #define HAVE_SOCKETPAIR 1
| #define HAVE_HTONL 1
| #define HAVE_GETHOSTNAME 1
| #define HAVE_GETHOSTBYADDR 1
| #define HAVE_YP_GET_DEFAULT_DOMAIN 1
| #define HAVE_DLOPEN 1
| #define HAVE_LIBDL 1
| #define HAVE_LIBM 1
| #define HAVE_INET_ATON 1
| #define STDC_HEADERS 1
| #define HAVE_DIRENT_H 1
| #define HAVE_INTTYPES_H 1
| #define HAVE_STDINT_H 1
| #define HAVE_DIRENT_H 1
| #define HAVE_APPLICATIONSERVICES_APPLICATIONSERVICES_H 1
| #define HAVE_SYS_PARAM_H 1
| #define HAVE_SYS_TYPES_H 1
| #define HAVE_SYS_TIME_H 1
| #define HAVE_NETINET_IN_H 1
| #define HAVE_ALLOCA_H 1
| #define HAVE_ARPA_INET_H 1
| #define HAVE_ARPA_NAMESER_H 1
| #define HAVE_ASSERT_H 1
| #define HAVE_DNS_H 1
| #define HAVE_FCNTL_H 1
| #define HAVE_GRP_H 1
| #define HAVE_LANGINFO_H 1
| #define HAVE_LIMITS_H 1
| #define HAVE_LOCALE_H 1
| #define HAVE_MONETARY_H 1
| #define HAVE_NETDB_H 1
| #define HAVE_POLL_H 1
| #define HAVE_PWD_H 1
| #define HAVE_RESOLV_H 1
| #define HAVE_SIGNAL_H 1
| #define HAVE_STDARG_H 1
| #define HAVE_STDLIB_H 1
| #define HAVE_STRING_H 1
| #define HAVE_SYSLOG_H 1
| #define HAVE_SYSEXITS_H 1
| #define HAVE_SYS_IOCTL_H 1
| #define HAVE_SYS_FILE_H 1
| #define HAVE_SYS_MMAN_H 1
| #define HAVE_SYS_MOUNT_H 1
| #define HAVE_SYS_POLL_H 1
| #define HAVE_SYS_RESOURCE_H 1
| #define HAVE_SYS_SELECT_H 1
| #define HAVE_SYS_SOCKET_H 1
| #define HAVE_SYS_STAT_H 1
| #define HAVE_SYS_STATVFS_H 1
| /* end confdefs.h. */
|
| #ifdef HAVE_SYS_PARAM_H
| #include <sys/param.h>
| #endif
| #ifdef HAVE_SYS_TYPES_H
| #include <sys/types.h>
| #endif
| #ifdef HAVE_SYS_TIME_H
| #include <sys/time.h>
| #endif
| #ifdef HAVE_NETINET_IN_H
| #include <netinet/in.h>
| #endif
| #ifdef HAVE_ARPA_NAMESER_H
| #include <arpa/nameser.h>
| #endif
|
|
| #include <sys/varargs.h>
configure:12410: result: no
configure:12410: checking for sys/wait.h
configure:12410: cc -c -g -O2 -fvisibility=hidden -no-cpp-precomp conftest.c >&5
configure:12410: $? = 0
configure:12410: result: yes
configure:12410: checking for sys/loadavg.h
configure:12410: cc -c -g -O2 -fvisibility=hidden -no-cpp-precomp conftest.c >&5
conftest.c:126:10: fatal error: 'sys/loadavg.h' file not found
#include <sys/loadavg.h>
^~~~~~~~~~~~~~~
1 error generated.
configure:12410: $? = 1
configure: failed program was:
| /* confdefs.h */
| #define PACKAGE_NAME ""
| #define PACKAGE_TARNAME ""
| #define PACKAGE_VERSION ""
| #define PACKAGE_STRING ""
| #define PACKAGE_BUGREPORT ""
| #define PACKAGE_URL ""
| #define STDC_HEADERS 1
| #define HAVE_SYS_TYPES_H 1
| #define HAVE_SYS_STAT_H 1
| #define HAVE_STDLIB_H 1
| #define HAVE_STRING_H 1
| #define HAVE_MEMORY_H 1
| #define HAVE_STRINGS_H 1
| #define HAVE_INTTYPES_H 1
| #define HAVE_STDINT_H 1
| #define HAVE_UNISTD_H 1
| #define __EXTENSIONS__ 1
| #define _ALL_SOURCE 1
| #define _GNU_SOURCE 1
| #define _POSIX_PTHREAD_SEMANTICS 1
| #define _TANDEM_SOURCE 1
| #define HAVE_DEV_URANDOM 1
| #define HAVE_HUGE_VAL_INF 1
| #define HAVE_CPUID_COUNT 1
| #define HAVE_SETENV 1
| #define HAVE_ERRNO_H 1
| #define HAVE_FCNTL_H 1
| #define HAVE_STDIO_H 1
| #define HAVE_STDLIB_H 1
| #define HAVE_UNISTD_H 1
| #define HAVE_SYS_UIO_H 1
| #define HAVE_SYS_SELECT_H 1
| #define HAVE_SYS_SOCKET_H 1
| #define HAVE_SYS_TIME_H 1
| #define HAVE_ARPA_INET_H 1
| #define HAVE_NETINET_IN_H 1
| #define HAVE_SYSEXITS_H 1
| #define HAVE_CLOCK_GETTIME 1
| #define HAVE_MACH_VM_READ 1
| #define HAVE_BUILTIN_ATOMIC 1
| #define HAVE_SYSCONF 1
| #define HAVE_TIMES 1
| #define HAVE_KQUEUE 1
| #define HAVE_POLL 1
| #define HAVE_SELECT 1
| #define PHP_FPM_SYSTEMD "simple"
| #define PHP_FPM_USER "nobody"
| #define PHP_FPM_GROUP "nobody"
| #define HAVE_PHPDBG 1
| #define PHPDBG_DEBUG 0
| #define HAVE_SOCKLEN_T 1
| #define HAVE_SOCKADDR_UN_SUN_LEN 1
| #define PHP_WRITE_STDOUT 1
| #define HAVE_SOCKET 1
| #define HAVE_SOCKETPAIR 1
| #define HAVE_HTONL 1
| #define HAVE_GETHOSTNAME 1
| #define HAVE_GETHOSTBYADDR 1
| #define HAVE_YP_GET_DEFAULT_DOMAIN 1
| #define HAVE_DLOPEN 1
| #define HAVE_LIBDL 1
| #define HAVE_LIBM 1
| #define HAVE_INET_ATON 1
| #define STDC_HEADERS 1
| #define HAVE_DIRENT_H 1
| #define HAVE_INTTYPES_H 1
| #define HAVE_STDINT_H 1
| #define HAVE_DIRENT_H 1
| #define HAVE_APPLICATIONSERVICES_APPLICATIONSERVICES_H 1
| #define HAVE_SYS_PARAM_H 1
| #define HAVE_SYS_TYPES_H 1
| #define HAVE_SYS_TIME_H 1
| #define HAVE_NETINET_IN_H 1
| #define HAVE_ALLOCA_H 1
| #define HAVE_ARPA_INET_H 1
| #define HAVE_ARPA_NAMESER_H 1
| #define HAVE_ASSERT_H 1
| #define HAVE_DNS_H 1
| #define HAVE_FCNTL_H 1
| #define HAVE_GRP_H 1
| #define HAVE_LANGINFO_H 1
| #define HAVE_LIMITS_H 1
| #define HAVE_LOCALE_H 1
| #define HAVE_MONETARY_H 1
| #define HAVE_NETDB_H 1
| #define HAVE_POLL_H 1
| #define HAVE_PWD_H 1
| #define HAVE_RESOLV_H 1
| #define HAVE_SIGNAL_H 1
| #define HAVE_STDARG_H 1
| #define HAVE_STDLIB_H 1
| #define HAVE_STRING_H 1
| #define HAVE_SYSLOG_H 1
| #define HAVE_SYSEXITS_H 1
| #define HAVE_SYS_IOCTL_H 1
| #define HAVE_SYS_FILE_H 1
| #define HAVE_SYS_MMAN_H 1
| #define HAVE_SYS_MOUNT_H 1
| #define HAVE_SYS_POLL_H 1
| #define HAVE_SYS_RESOURCE_H 1
| #define HAVE_SYS_SELECT_H 1
| #define HAVE_SYS_SOCKET_H 1
| #define HAVE_SYS_STAT_H 1
| #define HAVE_SYS_STATVFS_H 1
| #define HAVE_SYS_WAIT_H 1
| /* end confdefs.h. */
|
| #ifdef HAVE_SYS_PARAM_H
| #include <sys/param.h>
| #endif
| #ifdef HAVE_SYS_TYPES_H
| #include <sys/types.h>
| #endif
| #ifdef HAVE_SYS_TIME_H
| #include <sys/time.h>
| #endif
| #ifdef HAVE_NETINET_IN_H
| #include <netinet/in.h>
| #endif
| #ifdef HAVE_ARPA_NAMESER_H
| #include <arpa/nameser.h>
| #endif
|
|
| #include <sys/loadavg.h>
configure:12410: result: no
configure:12410: checking for termios.h
configure:12410: cc -c -g -O2 -fvisibility=hidden -no-cpp-precomp conftest.c >&5
configure:12410: $? = 0
configure:12410: result: yes
configure:12410: checking for unistd.h
configure:12410: result: yes
configure:12410: checking for unix.h
configure:12410: cc -c -g -O2 -fvisibility=hidden -no-cpp-precomp conftest.c >&5
conftest.c:128:10: fatal error: 'unix.h' file not found
#include <unix.h>
^~~~~~~~
1 error generated.
configure:12410: $? = 1
configure: failed program was:
| /* confdefs.h */
| #define PACKAGE_NAME ""
| #define PACKAGE_TARNAME ""
| #define PACKAGE_VERSION ""
| #define PACKAGE_STRING ""
| #define PACKAGE_BUGREPORT ""
| #define PACKAGE_URL ""
| #define STDC_HEADERS 1
| #define HAVE_SYS_TYPES_H 1
| #define HAVE_SYS_STAT_H 1
| #define HAVE_STDLIB_H 1
| #define HAVE_STRING_H 1
| #define HAVE_MEMORY_H 1
| #define HAVE_STRINGS_H 1
| #define HAVE_INTTYPES_H 1
| #define HAVE_STDINT_H 1
| #define HAVE_UNISTD_H 1
| #define __EXTENSIONS__ 1
| #define _ALL_SOURCE 1
| #define _GNU_SOURCE 1
| #define _POSIX_PTHREAD_SEMANTICS 1
| #define _TANDEM_SOURCE 1
| #define HAVE_DEV_URANDOM 1
| #define HAVE_HUGE_VAL_INF 1
| #define HAVE_CPUID_COUNT 1
| #define HAVE_SETENV 1
| #define HAVE_ERRNO_H 1
| #define HAVE_FCNTL_H 1
| #define HAVE_STDIO_H 1
| #define HAVE_STDLIB_H 1
| #define HAVE_UNISTD_H 1
| #define HAVE_SYS_UIO_H 1
| #define HAVE_SYS_SELECT_H 1
| #define HAVE_SYS_SOCKET_H 1
| #define HAVE_SYS_TIME_H 1
| #define HAVE_ARPA_INET_H 1
| #define HAVE_NETINET_IN_H 1
| #define HAVE_SYSEXITS_H 1
| #define HAVE_CLOCK_GETTIME 1
| #define HAVE_MACH_VM_READ 1
| #define HAVE_BUILTIN_ATOMIC 1
| #define HAVE_SYSCONF 1
| #define HAVE_TIMES 1
| #define HAVE_KQUEUE 1
| #define HAVE_POLL 1
| #define HAVE_SELECT 1
| #define PHP_FPM_SYSTEMD "simple"
| #define PHP_FPM_USER "nobody"
| #define PHP_FPM_GROUP "nobody"
| #define HAVE_PHPDBG 1
| #define PHPDBG_DEBUG 0
| #define HAVE_SOCKLEN_T 1
| #define HAVE_SOCKADDR_UN_SUN_LEN 1
| #define PHP_WRITE_STDOUT 1
| #define HAVE_SOCKET 1
| #define HAVE_SOCKETPAIR 1
| #define HAVE_HTONL 1
| #define HAVE_GETHOSTNAME 1
| #define HAVE_GETHOSTBYADDR 1
| #define HAVE_YP_GET_DEFAULT_DOMAIN 1
| #define HAVE_DLOPEN 1
| #define HAVE_LIBDL 1
| #define HAVE_LIBM 1
| #define HAVE_INET_ATON 1
| #define STDC_HEADERS 1
| #define HAVE_DIRENT_H 1
| #define HAVE_INTTYPES_H 1
| #define HAVE_STDINT_H 1
| #define HAVE_DIRENT_H 1
| #define HAVE_APPLICATIONSERVICES_APPLICATIONSERVICES_H 1
| #define HAVE_SYS_PARAM_H 1
| #define HAVE_SYS_TYPES_H 1
| #define HAVE_SYS_TIME_H 1
| #define HAVE_NETINET_IN_H 1
| #define HAVE_ALLOCA_H 1
| #define HAVE_ARPA_INET_H 1
| #define HAVE_ARPA_NAMESER_H 1
| #define HAVE_ASSERT_H 1
| #define HAVE_DNS_H 1
| #define HAVE_FCNTL_H 1
| #define HAVE_GRP_H 1
| #define HAVE_LANGINFO_H 1
| #define HAVE_LIMITS_H 1
| #define HAVE_LOCALE_H 1
| #define HAVE_MONETARY_H 1
| #define HAVE_NETDB_H 1
| #define HAVE_POLL_H 1
| #define HAVE_PWD_H 1
| #define HAVE_RESOLV_H 1
| #define HAVE_SIGNAL_H 1
| #define HAVE_STDARG_H 1
| #define HAVE_STDLIB_H 1
| #define HAVE_STRING_H 1
| #define HAVE_SYSLOG_H 1
| #define HAVE_SYSEXITS_H 1
| #define HAVE_SYS_IOCTL_H 1
| #define HAVE_SYS_FILE_H 1
| #define HAVE_SYS_MMAN_H 1
| #define HAVE_SYS_MOUNT_H 1
| #define HAVE_SYS_POLL_H 1
| #define HAVE_SYS_RESOURCE_H 1
| #define HAVE_SYS_SELECT_H 1
| #define HAVE_SYS_SOCKET_H 1
| #define HAVE_SYS_STAT_H 1
| #define HAVE_SYS_STATVFS_H 1
| #define HAVE_SYS_WAIT_H 1
| #define HAVE_TERMIOS_H 1
| #define HAVE_UNISTD_H 1
| /* end confdefs.h. */
|
| #ifdef HAVE_SYS_PARAM_H
| #include <sys/param.h>
| #endif
| #ifdef HAVE_SYS_TYPES_H
| #include <sys/types.h>
| #endif
| #ifdef HAVE_SYS_TIME_H
| #include <sys/time.h>
| #endif
| #ifdef HAVE_NETINET_IN_H
| #include <netinet/in.h>
| #endif
| #ifdef HAVE_ARPA_NAMESER_H
| #include <arpa/nameser.h>
| #endif
|
|
| #include <unix.h>
configure:12410: result: no
configure:12410: checking for utime.h
configure:12410: cc -c -g -O2 -fvisibility=hidden -no-cpp-precomp conftest.c >&5
configure:12410: $? = 0
configure:12410: result: yes
configure:12410: checking for sys/utsname.h
configure:12410: cc -c -g -O2 -fvisibility=hidden -no-cpp-precomp conftest.c >&5
configure:12410: $? = 0
configure:12410: result: yes
configure:12410: checking for sys/ipc.h
configure:12410: cc -c -g -O2 -fvisibility=hidden -no-cpp-precomp conftest.c >&5
configure:12410: $? = 0
configure:12410: result: yes
configure:12410: checking for dlfcn.h
configure:12410: cc -c -g -O2 -fvisibility=hidden -no-cpp-precomp conftest.c >&5
configure:12410: $? = 0
configure:12410: result: yes
configure:12410: checking for assert.h
configure:12410: result: yes
configure:12410: checking for tmmintrin.h
configure:12410: cc -c -g -O2 -fvisibility=hidden -no-cpp-precomp conftest.c >&5
configure:12410: $? = 0
configure:12410: result: yes
configure:12410: checking for nmmintrin.h
configure:12410: cc -c -g -O2 -fvisibility=hidden -no-cpp-precomp conftest.c >&5
configure:12410: $? = 0
configure:12410: result: yes
configure:12410: checking for immintrin.h
configure:12410: cc -c -g -O2 -fvisibility=hidden -no-cpp-precomp conftest.c >&5
configure:12410: $? = 0
configure:12410: result: yes
configure:12439: checking for fopencookie
configure:12439: cc -o conftest -g -O2 -fvisibility=hidden -no-cpp-precomp conftest.c -lm >&5
Undefined symbols for architecture x86_64:
"_fopencookie", referenced from:
_main in conftest-f9228d.o
ld: symbol(s) not found for architecture x86_64
clang: error: linker command failed with exit code 1 (use -v to see invocation)
configure:12439: $? = 1
configure: failed program was:
| /* confdefs.h */
| #define PACKAGE_NAME ""
| #define PACKAGE_TARNAME ""
| #define PACKAGE_VERSION ""
| #define PACKAGE_STRING ""
| #define PACKAGE_BUGREPORT ""
| #define PACKAGE_URL ""
| #define STDC_HEADERS 1
| #define HAVE_SYS_TYPES_H 1
| #define HAVE_SYS_STAT_H 1
| #define HAVE_STDLIB_H 1
| #define HAVE_STRING_H 1
| #define HAVE_MEMORY_H 1
| #define HAVE_STRINGS_H 1
| #define HAVE_INTTYPES_H 1
| #define HAVE_STDINT_H 1
| #define HAVE_UNISTD_H 1
| #define __EXTENSIONS__ 1
| #define _ALL_SOURCE 1
| #define _GNU_SOURCE 1
| #define _POSIX_PTHREAD_SEMANTICS 1
| #define _TANDEM_SOURCE 1
| #define HAVE_DEV_URANDOM 1
| #define HAVE_HUGE_VAL_INF 1
| #define HAVE_CPUID_COUNT 1
| #define HAVE_SETENV 1
| #define HAVE_ERRNO_H 1
| #define HAVE_FCNTL_H 1
| #define HAVE_STDIO_H 1
| #define HAVE_STDLIB_H 1
| #define HAVE_UNISTD_H 1
| #define HAVE_SYS_UIO_H 1
| #define HAVE_SYS_SELECT_H 1
| #define HAVE_SYS_SOCKET_H 1
| #define HAVE_SYS_TIME_H 1
| #define HAVE_ARPA_INET_H 1
| #define HAVE_NETINET_IN_H 1
| #define HAVE_SYSEXITS_H 1
| #define HAVE_CLOCK_GETTIME 1
| #define HAVE_MACH_VM_READ 1
| #define HAVE_BUILTIN_ATOMIC 1
| #define HAVE_SYSCONF 1
| #define HAVE_TIMES 1
| #define HAVE_KQUEUE 1
| #define HAVE_POLL 1
| #define HAVE_SELECT 1
| #define PHP_FPM_SYSTEMD "simple"
| #define PHP_FPM_USER "nobody"
| #define PHP_FPM_GROUP "nobody"
| #define HAVE_PHPDBG 1
| #define PHPDBG_DEBUG 0
| #define HAVE_SOCKLEN_T 1
| #define HAVE_SOCKADDR_UN_SUN_LEN 1
| #define PHP_WRITE_STDOUT 1
| #define HAVE_SOCKET 1
| #define HAVE_SOCKETPAIR 1
| #define HAVE_HTONL 1
| #define HAVE_GETHOSTNAME 1
| #define HAVE_GETHOSTBYADDR 1
| #define HAVE_YP_GET_DEFAULT_DOMAIN 1
| #define HAVE_DLOPEN 1
| #define HAVE_LIBDL 1
| #define HAVE_LIBM 1
| #define HAVE_INET_ATON 1
| #define STDC_HEADERS 1
| #define HAVE_DIRENT_H 1
| #define HAVE_INTTYPES_H 1
| #define HAVE_STDINT_H 1
| #define HAVE_DIRENT_H 1
| #define HAVE_APPLICATIONSERVICES_APPLICATIONSERVICES_H 1
| #define HAVE_SYS_PARAM_H 1
| #define HAVE_SYS_TYPES_H 1
| #define HAVE_SYS_TIME_H 1
| #define HAVE_NETINET_IN_H 1
| #define HAVE_ALLOCA_H 1
| #define HAVE_ARPA_INET_H 1
| #define HAVE_ARPA_NAMESER_H 1
| #define HAVE_ASSERT_H 1
| #define HAVE_DNS_H 1
| #define HAVE_FCNTL_H 1
| #define HAVE_GRP_H 1
| #define HAVE_LANGINFO_H 1
| #define HAVE_LIMITS_H 1
| #define HAVE_LOCALE_H 1
| #define HAVE_MONETARY_H 1
| #define HAVE_NETDB_H 1
| #define HAVE_POLL_H 1
| #define HAVE_PWD_H 1
| #define HAVE_RESOLV_H 1
| #define HAVE_SIGNAL_H 1
| #define HAVE_STDARG_H 1
| #define HAVE_STDLIB_H 1
| #define HAVE_STRING_H 1
| #define HAVE_SYSLOG_H 1
| #define HAVE_SYSEXITS_H 1
| #define HAVE_SYS_IOCTL_H 1
| #define HAVE_SYS_FILE_H 1
| #define HAVE_SYS_MMAN_H 1
| #define HAVE_SYS_MOUNT_H 1
| #define HAVE_SYS_POLL_H 1
| #define HAVE_SYS_RESOURCE_H 1
| #define HAVE_SYS_SELECT_H 1
| #define HAVE_SYS_SOCKET_H 1
| #define HAVE_SYS_STAT_H 1
| #define HAVE_SYS_STATVFS_H 1
| #define HAVE_SYS_WAIT_H 1
| #define HAVE_TERMIOS_H 1
| #define HAVE_UNISTD_H 1
| #define HAVE_UTIME_H 1
| #define HAVE_SYS_UTSNAME_H 1
| #define HAVE_SYS_IPC_H 1
| #define HAVE_DLFCN_H 1
| #define HAVE_ASSERT_H 1
| #define HAVE_TMMINTRIN_H 1
| #define HAVE_NMMINTRIN_H 1
| #define HAVE_IMMINTRIN_H 1
| /* end confdefs.h. */
| /* Define fopencookie to an innocuous variant, in case <limits.h> declares fopencookie.
| For example, HP-UX 11i <limits.h> declares gettimeofday. */
| #define fopencookie innocuous_fopencookie
|
| /* System header to define __stub macros and hopefully few prototypes,
| which can conflict with char fopencookie (); below.
| Prefer <limits.h> to <assert.h> if __STDC__ is defined, since
| <limits.h> exists even on freestanding compilers. */
|
| #ifdef __STDC__
| # include <limits.h>
| #else
| # include <assert.h>
| #endif
|
| #undef fopencookie
|
| /* Override any GCC internal prototype to avoid an error.
| Use char because int might match the return type of a GCC
| builtin and then its argument prototype would still apply. */
| #ifdef __cplusplus
| extern "C"
| #endif
| char fopencookie ();
| /* The GNU C library defines this for functions which it implements
| to always fail with ENOSYS. Some functions are actually named
| something starting with __ and the normal name is an alias. */
| #if defined __stub_fopencookie || defined __stub___fopencookie
| choke me
| #endif
|
| int
| main ()
| {
| return fopencookie ();
| ;
| return 0;
| }
configure:12439: result: no
configure:12564: checking for broken getcwd
configure:12575: result: no
configure:12580: checking for broken libc stdio
configure:12640: cc -o conftest -g -O2 -fvisibility=hidden -no-cpp-precomp conftest.c -lm >&5
conftest.c:124:20: warning: 'tmpnam' is deprecated: This function is provided for compatibility reasons only. Due to security concerns inherent in the design of tmpnam(3), it is highly recommended that you use mkstemp(3) instead. [-Wdeprecated-declarations]
char *filename = tmpnam(NULL);
^
/Applications/Xcode.app/Contents/Developer/Platforms/MacOSX.platform/Developer/SDKs/MacOSX.sdk/usr/include/stdio.h:186:1: note: 'tmpnam' has been explicitly marked deprecated here
__deprecated_msg("This function is provided for compatibility reasons only. Due to security concerns inherent in the design of tmpnam(3), it is highly recommended that you use mkstemp(3) instead.")
^
/Applications/Xcode.app/Contents/Developer/Platforms/MacOSX.platform/Developer/SDKs/MacOSX.sdk/usr/include/sys/cdefs.h:191:48: note: expanded from macro '__deprecated_msg'
#define __deprecated_msg(_msg) __attribute__((__deprecated__(_msg)))
^
conftest.c:129:5: warning: implicitly declaring library function 'exit' with type 'void (int) __attribute__((noreturn))' [-Wimplicit-function-declaration]
exit(2);
^
conftest.c:129:5: note: include the header <stdlib.h> or explicitly provide a declaration for 'exit'
conftest.c:137:3: warning: implicit declaration of function 'unlink' is invalid in C99 [-Wimplicit-function-declaration]
unlink(filename);
^
3 warnings generated.
configure:12640: $? = 0
configure:12640: ./conftest
configure:12640: $? = 0
configure:12659: result: no
configure:12665: checking for broken gcc optimize-strlen
configure:12696: cc -o conftest -g -O2 -fvisibility=hidden -no-cpp-precomp conftest.c -lm >&5
configure:12696: $? = 0
configure:12696: ./conftest
configure:12696: $? = 1
configure: program exited with status 1
configure: failed program was:
| /* confdefs.h */
| #define PACKAGE_NAME ""
| #define PACKAGE_TARNAME ""
| #define PACKAGE_VERSION ""
| #define PACKAGE_STRING ""
| #define PACKAGE_BUGREPORT ""
| #define PACKAGE_URL ""
| #define STDC_HEADERS 1
| #define HAVE_SYS_TYPES_H 1
| #define HAVE_SYS_STAT_H 1
| #define HAVE_STDLIB_H 1
| #define HAVE_STRING_H 1
| #define HAVE_MEMORY_H 1
| #define HAVE_STRINGS_H 1
| #define HAVE_INTTYPES_H 1
| #define HAVE_STDINT_H 1
| #define HAVE_UNISTD_H 1
| #define __EXTENSIONS__ 1
| #define _ALL_SOURCE 1
| #define _GNU_SOURCE 1
| #define _POSIX_PTHREAD_SEMANTICS 1
| #define _TANDEM_SOURCE 1
| #define HAVE_DEV_URANDOM 1
| #define HAVE_HUGE_VAL_INF 1
| #define HAVE_CPUID_COUNT 1
| #define HAVE_SETENV 1
| #define HAVE_ERRNO_H 1
| #define HAVE_FCNTL_H 1
| #define HAVE_STDIO_H 1
| #define HAVE_STDLIB_H 1
| #define HAVE_UNISTD_H 1
| #define HAVE_SYS_UIO_H 1
| #define HAVE_SYS_SELECT_H 1
| #define HAVE_SYS_SOCKET_H 1
| #define HAVE_SYS_TIME_H 1
| #define HAVE_ARPA_INET_H 1
| #define HAVE_NETINET_IN_H 1
| #define HAVE_SYSEXITS_H 1
| #define HAVE_CLOCK_GETTIME 1
| #define HAVE_MACH_VM_READ 1
| #define HAVE_BUILTIN_ATOMIC 1
| #define HAVE_SYSCONF 1
| #define HAVE_TIMES 1
| #define HAVE_KQUEUE 1
| #define HAVE_POLL 1
| #define HAVE_SELECT 1
| #define PHP_FPM_SYSTEMD "simple"
| #define PHP_FPM_USER "nobody"
| #define PHP_FPM_GROUP "nobody"
| #define HAVE_PHPDBG 1
| #define PHPDBG_DEBUG 0
| #define HAVE_SOCKLEN_T 1
| #define HAVE_SOCKADDR_UN_SUN_LEN 1
| #define PHP_WRITE_STDOUT 1
| #define HAVE_SOCKET 1
| #define HAVE_SOCKETPAIR 1
| #define HAVE_HTONL 1
| #define HAVE_GETHOSTNAME 1
| #define HAVE_GETHOSTBYADDR 1
| #define HAVE_YP_GET_DEFAULT_DOMAIN 1
| #define HAVE_DLOPEN 1
| #define HAVE_LIBDL 1
| #define HAVE_LIBM 1
| #define HAVE_INET_ATON 1
| #define STDC_HEADERS 1
| #define HAVE_DIRENT_H 1
| #define HAVE_INTTYPES_H 1
| #define HAVE_STDINT_H 1
| #define HAVE_DIRENT_H 1
| #define HAVE_APPLICATIONSERVICES_APPLICATIONSERVICES_H 1
| #define HAVE_SYS_PARAM_H 1
| #define HAVE_SYS_TYPES_H 1
| #define HAVE_SYS_TIME_H 1
| #define HAVE_NETINET_IN_H 1
| #define HAVE_ALLOCA_H 1
| #define HAVE_ARPA_INET_H 1
| #define HAVE_ARPA_NAMESER_H 1
| #define HAVE_ASSERT_H 1
| #define HAVE_DNS_H 1
| #define HAVE_FCNTL_H 1
| #define HAVE_GRP_H 1
| #define HAVE_LANGINFO_H 1
| #define HAVE_LIMITS_H 1
| #define HAVE_LOCALE_H 1
| #define HAVE_MONETARY_H 1
| #define HAVE_NETDB_H 1
| #define HAVE_POLL_H 1
| #define HAVE_PWD_H 1
| #define HAVE_RESOLV_H 1
| #define HAVE_SIGNAL_H 1
| #define HAVE_STDARG_H 1
| #define HAVE_STDLIB_H 1
| #define HAVE_STRING_H 1
| #define HAVE_SYSLOG_H 1
| #define HAVE_SYSEXITS_H 1
| #define HAVE_SYS_IOCTL_H 1
| #define HAVE_SYS_FILE_H 1
| #define HAVE_SYS_MMAN_H 1
| #define HAVE_SYS_MOUNT_H 1
| #define HAVE_SYS_POLL_H 1
| #define HAVE_SYS_RESOURCE_H 1
| #define HAVE_SYS_SELECT_H 1
| #define HAVE_SYS_SOCKET_H 1
| #define HAVE_SYS_STAT_H 1
| #define HAVE_SYS_STATVFS_H 1
| #define HAVE_SYS_WAIT_H 1
| #define HAVE_TERMIOS_H 1
| #define HAVE_UNISTD_H 1
| #define HAVE_UTIME_H 1
| #define HAVE_SYS_UTSNAME_H 1
| #define HAVE_SYS_IPC_H 1
| #define HAVE_DLFCN_H 1
| #define HAVE_ASSERT_H 1
| #define HAVE_TMMINTRIN_H 1
| #define HAVE_NMMINTRIN_H 1
| #define HAVE_IMMINTRIN_H 1
| /* end confdefs.h. */
|
| #include <stdlib.h>
| #include <string.h>
| #include <stdio.h>
| struct s
| {
| int i;
| char c[1];
| };
| int main()
| {
| struct s *s = malloc(sizeof(struct s) + 3);
| s->i = 3;
| strcpy(s->c, "foo");
| return strlen(s->c+1) == 2;
| }
|
configure:12710: result: no
configure:12719: checking whether struct tm is in sys/time.h or time.h
configure:12739: cc -c -g -O2 -fvisibility=hidden -no-cpp-precomp conftest.c >&5
configure:12739: $? = 0
configure:12746: result: time.h
configure:12754: checking for struct tm.tm_zone
configure:12754: cc -c -g -O2 -fvisibility=hidden -no-cpp-precomp conftest.c >&5
configure:12754: $? = 0
configure:12754: result: yes
configure:12823: checking for missing declarations of reentrant functions
configure:12836: cc -c -g -O2 -fvisibility=hidden -no-cpp-precomp conftest.c >&5
configure:12836: $? = 0
configure:12859: cc -c -g -O2 -fvisibility=hidden -no-cpp-precomp conftest.c >&5
configure:12859: $? = 0
configure:12882: cc -c -g -O2 -fvisibility=hidden -no-cpp-precomp conftest.c >&5
configure:12882: $? = 0
configure:12905: cc -c -g -O2 -fvisibility=hidden -no-cpp-precomp conftest.c >&5
configure:12905: $? = 0
configure:12928: cc -c -g -O2 -fvisibility=hidden -no-cpp-precomp conftest.c >&5
configure:12928: $? = 0
configure:12940: result: done
configure:12944: checking for fclose declaration
configure:12957: cc -c -g -O2 -fvisibility=hidden -no-cpp-precomp conftest.c >&5
configure:12957: $? = 0
configure:12962: result: ok
configure:12978: checking for tm_gmtoff in struct tm
configure:12995: cc -c -g -O2 -fvisibility=hidden -no-cpp-precomp conftest.c >&5
conftest.c:126:18: warning: expression result unused [-Wunused-value]
struct tm tm; tm.tm_gmtoff;
~~ ^~~~~~~~~
1 warning generated.
configure:12995: $? = 0
configure:13002: result: yes
configure:13012: checking for struct flock
configure:13031: cc -c -g -O2 -fvisibility=hidden -no-cpp-precomp conftest.c >&5
configure:13031: $? = 0
configure:13043: result: yes
configure:13052: checking for socklen_t
configure:13073: cc -c -g -O2 -fvisibility=hidden -no-cpp-precomp conftest.c >&5
configure:13073: $? = 0
configure:13084: result: yes
configure:13097: checking size of size_t
configure:13102: cc -o conftest -g -O2 -fvisibility=hidden -no-cpp-precomp conftest.c -lm >&5
configure:13102: $? = 0
configure:13102: ./conftest
configure:13102: $? = 0
configure:13116: result: 8
configure:13130: checking size of long long
configure:13135: cc -o conftest -g -O2 -fvisibility=hidden -no-cpp-precomp conftest.c -lm >&5
configure:13135: $? = 0
configure:13135: ./conftest
configure:13135: $? = 0
configure:13149: result: 8
configure:13163: checking size of long long int
configure:13168: cc -o conftest -g -O2 -fvisibility=hidden -no-cpp-precomp conftest.c -lm >&5
configure:13168: $? = 0
configure:13168: ./conftest
configure:13168: $? = 0
configure:13182: result: 8
configure:13196: checking size of long
configure:13201: cc -o conftest -g -O2 -fvisibility=hidden -no-cpp-precomp conftest.c -lm >&5
configure:13201: $? = 0
configure:13201: ./conftest
configure:13201: $? = 0
configure:13215: result: 8
configure:13229: checking size of int
configure:13234: cc -o conftest -g -O2 -fvisibility=hidden -no-cpp-precomp conftest.c -lm >&5
configure:13234: $? = 0
configure:13234: ./conftest
configure:13234: $? = 0
configure:13248: result: 4
configure:13260: checking size of intmax_t
configure:13301: cc -o conftest -g -O2 -fvisibility=hidden -no-cpp-precomp conftest.c >&5
conftest.c:146:22: warning: format specifies type 'int' but the argument has type 'unsigned long' [-Wformat]
fprintf(fp, "%d\n", sizeof(intmax_t));
~~ ^~~~~~~~~~~~~~~~
%lu
1 warning generated.
configure:13301: $? = 0
configure:13301: ./conftest
configure:13301: $? = 0
configure:13335: result: 8
configure:13339: checking size of ssize_t
configure:13380: cc -o conftest -g -O2 -fvisibility=hidden -no-cpp-precomp conftest.c >&5
conftest.c:148:22: warning: format specifies type 'int' but the argument has type 'unsigned long' [-Wformat]
fprintf(fp, "%d\n", sizeof(ssize_t));
~~ ^~~~~~~~~~~~~~~
%lu
1 warning generated.
configure:13380: $? = 0
configure:13380: ./conftest
configure:13380: $? = 0
configure:13414: result: 8
configure:13418: checking size of ptrdiff_t
configure:13459: cc -o conftest -g -O2 -fvisibility=hidden -no-cpp-precomp conftest.c >&5
conftest.c:150:22: warning: format specifies type 'int' but the argument has type 'unsigned long' [-Wformat]
fprintf(fp, "%d\n", sizeof(ptrdiff_t));
~~ ^~~~~~~~~~~~~~~~~
%lu
1 warning generated.
configure:13459: $? = 0
configure:13459: ./conftest
configure:13459: $? = 0
configure:13493: result: 8
configure:13502: checking size of short
configure:13507: cc -o conftest -g -O2 -fvisibility=hidden -no-cpp-precomp conftest.c -lm >&5
configure:13507: $? = 0
configure:13507: ./conftest
configure:13507: $? = 0
configure:13521: result: 2
configure:13535: checking size of int
configure:13554: result: 4
configure:13568: checking size of long
configure:13587: result: 8
configure:13601: checking size of long long
configure:13620: result: 8
configure:13630: checking for int8
configure:13630: cc -c -g -O2 -fvisibility=hidden -no-cpp-precomp conftest.c >&5
conftest.c:151:13: error: use of undeclared identifier 'int8'; did you mean 'int'?
if (sizeof (int8))
^~~~
int
conftest.c:151:12: error: reference to overloaded function could not be resolved; did you mean to call it?
if (sizeof (int8))
^~~~~~
2 errors generated.
configure:13630: $? = 1
configure: failed program was:
| /* confdefs.h */
| #define PACKAGE_NAME ""
| #define PACKAGE_TARNAME ""
| #define PACKAGE_VERSION ""
| #define PACKAGE_STRING ""
| #define PACKAGE_BUGREPORT ""
| #define PACKAGE_URL ""
| #define STDC_HEADERS 1
| #define HAVE_SYS_TYPES_H 1
| #define HAVE_SYS_STAT_H 1
| #define HAVE_STDLIB_H 1
| #define HAVE_STRING_H 1
| #define HAVE_MEMORY_H 1
| #define HAVE_STRINGS_H 1
| #define HAVE_INTTYPES_H 1
| #define HAVE_STDINT_H 1
| #define HAVE_UNISTD_H 1
| #define __EXTENSIONS__ 1
| #define _ALL_SOURCE 1
| #define _GNU_SOURCE 1
| #define _POSIX_PTHREAD_SEMANTICS 1
| #define _TANDEM_SOURCE 1
| #define HAVE_DEV_URANDOM 1
| #define HAVE_HUGE_VAL_INF 1
| #define HAVE_CPUID_COUNT 1
| #define HAVE_SETENV 1
| #define HAVE_ERRNO_H 1
| #define HAVE_FCNTL_H 1
| #define HAVE_STDIO_H 1
| #define HAVE_STDLIB_H 1
| #define HAVE_UNISTD_H 1
| #define HAVE_SYS_UIO_H 1
| #define HAVE_SYS_SELECT_H 1
| #define HAVE_SYS_SOCKET_H 1
| #define HAVE_SYS_TIME_H 1
| #define HAVE_ARPA_INET_H 1
| #define HAVE_NETINET_IN_H 1
| #define HAVE_SYSEXITS_H 1
| #define HAVE_CLOCK_GETTIME 1
| #define HAVE_MACH_VM_READ 1
| #define HAVE_BUILTIN_ATOMIC 1
| #define HAVE_SYSCONF 1
| #define HAVE_TIMES 1
| #define HAVE_KQUEUE 1
| #define HAVE_POLL 1
| #define HAVE_SELECT 1
| #define PHP_FPM_SYSTEMD "simple"
| #define PHP_FPM_USER "nobody"
| #define PHP_FPM_GROUP "nobody"
| #define HAVE_PHPDBG 1
| #define PHPDBG_DEBUG 0
| #define HAVE_SOCKLEN_T 1
| #define HAVE_SOCKADDR_UN_SUN_LEN 1
| #define PHP_WRITE_STDOUT 1
| #define HAVE_SOCKET 1
| #define HAVE_SOCKETPAIR 1
| #define HAVE_HTONL 1
| #define HAVE_GETHOSTNAME 1
| #define HAVE_GETHOSTBYADDR 1
| #define HAVE_YP_GET_DEFAULT_DOMAIN 1
| #define HAVE_DLOPEN 1
| #define HAVE_LIBDL 1
| #define HAVE_LIBM 1
| #define HAVE_INET_ATON 1
| #define STDC_HEADERS 1
| #define HAVE_DIRENT_H 1
| #define HAVE_INTTYPES_H 1
| #define HAVE_STDINT_H 1
| #define HAVE_DIRENT_H 1
| #define HAVE_APPLICATIONSERVICES_APPLICATIONSERVICES_H 1
| #define HAVE_SYS_PARAM_H 1
| #define HAVE_SYS_TYPES_H 1
| #define HAVE_SYS_TIME_H 1
| #define HAVE_NETINET_IN_H 1
| #define HAVE_ALLOCA_H 1
| #define HAVE_ARPA_INET_H 1
| #define HAVE_ARPA_NAMESER_H 1
| #define HAVE_ASSERT_H 1
| #define HAVE_DNS_H 1
| #define HAVE_FCNTL_H 1
| #define HAVE_GRP_H 1
| #define HAVE_LANGINFO_H 1
| #define HAVE_LIMITS_H 1
| #define HAVE_LOCALE_H 1
| #define HAVE_MONETARY_H 1
| #define HAVE_NETDB_H 1
| #define HAVE_POLL_H 1
| #define HAVE_PWD_H 1
| #define HAVE_RESOLV_H 1
| #define HAVE_SIGNAL_H 1
| #define HAVE_STDARG_H 1
| #define HAVE_STDLIB_H 1
| #define HAVE_STRING_H 1
| #define HAVE_SYSLOG_H 1
| #define HAVE_SYSEXITS_H 1
| #define HAVE_SYS_IOCTL_H 1
| #define HAVE_SYS_FILE_H 1
| #define HAVE_SYS_MMAN_H 1
| #define HAVE_SYS_MOUNT_H 1
| #define HAVE_SYS_POLL_H 1
| #define HAVE_SYS_RESOURCE_H 1
| #define HAVE_SYS_SELECT_H 1
| #define HAVE_SYS_SOCKET_H 1
| #define HAVE_SYS_STAT_H 1
| #define HAVE_SYS_STATVFS_H 1
| #define HAVE_SYS_WAIT_H 1
| #define HAVE_TERMIOS_H 1
| #define HAVE_UNISTD_H 1
| #define HAVE_UTIME_H 1
| #define HAVE_SYS_UTSNAME_H 1
| #define HAVE_SYS_IPC_H 1
| #define HAVE_DLFCN_H 1
| #define HAVE_ASSERT_H 1
| #define HAVE_TMMINTRIN_H 1
| #define HAVE_NMMINTRIN_H 1
| #define HAVE_IMMINTRIN_H 1
| #define HAVE_STRUCT_TM_TM_ZONE 1
| #define HAVE_TM_ZONE 1
| #define MISSING_FCLOSE_DECL 0
| #define HAVE_TM_GMTOFF 1
| #define HAVE_STRUCT_FLOCK 1
| #define HAVE_SOCKLEN_T 1
| #define SIZEOF_SIZE_T 8
| #define SIZEOF_LONG_LONG 8
| #define SIZEOF_LONG_LONG_INT 8
| #define SIZEOF_LONG 8
| #define SIZEOF_INT 4
| #define SIZEOF_INTMAX_T 8
| #define HAVE_INTMAX_T 1
| #define SIZEOF_SSIZE_T 8
| #define HAVE_SSIZE_T 1
| #define SIZEOF_PTRDIFF_T 8
| #define HAVE_PTRDIFF_T 1
| #define SIZEOF_SHORT 2
| #define SIZEOF_INT 4
| #define SIZEOF_LONG 8
| #define SIZEOF_LONG_LONG 8
| /* end confdefs.h. */
|
| #if HAVE_STDINT_H
| # include <stdint.h>
| #endif
| #if HAVE_SYS_TYPES_H
| # include <sys/types.h>
| #endif
|
|
| int
| main ()
| {
| if (sizeof (int8))
| return 0;
| ;
| return 0;
| }
configure:13630: result: no
configure:13647: checking for int16
configure:13647: cc -c -g -O2 -fvisibility=hidden -no-cpp-precomp conftest.c >&5
conftest.c:151:13: error: use of undeclared identifier 'int16'
if (sizeof (int16))
^
1 error generated.
configure:13647: $? = 1
configure: failed program was:
| /* confdefs.h */
| #define PACKAGE_NAME ""
| #define PACKAGE_TARNAME ""
| #define PACKAGE_VERSION ""
| #define PACKAGE_STRING ""
| #define PACKAGE_BUGREPORT ""
| #define PACKAGE_URL ""
| #define STDC_HEADERS 1
| #define HAVE_SYS_TYPES_H 1
| #define HAVE_SYS_STAT_H 1
| #define HAVE_STDLIB_H 1
| #define HAVE_STRING_H 1
| #define HAVE_MEMORY_H 1
| #define HAVE_STRINGS_H 1
| #define HAVE_INTTYPES_H 1
| #define HAVE_STDINT_H 1
| #define HAVE_UNISTD_H 1
| #define __EXTENSIONS__ 1
| #define _ALL_SOURCE 1
| #define _GNU_SOURCE 1
| #define _POSIX_PTHREAD_SEMANTICS 1
| #define _TANDEM_SOURCE 1
| #define HAVE_DEV_URANDOM 1
| #define HAVE_HUGE_VAL_INF 1
| #define HAVE_CPUID_COUNT 1
| #define HAVE_SETENV 1
| #define HAVE_ERRNO_H 1
| #define HAVE_FCNTL_H 1
| #define HAVE_STDIO_H 1
| #define HAVE_STDLIB_H 1
| #define HAVE_UNISTD_H 1
| #define HAVE_SYS_UIO_H 1
| #define HAVE_SYS_SELECT_H 1
| #define HAVE_SYS_SOCKET_H 1
| #define HAVE_SYS_TIME_H 1
| #define HAVE_ARPA_INET_H 1
| #define HAVE_NETINET_IN_H 1
| #define HAVE_SYSEXITS_H 1
| #define HAVE_CLOCK_GETTIME 1
| #define HAVE_MACH_VM_READ 1
| #define HAVE_BUILTIN_ATOMIC 1
| #define HAVE_SYSCONF 1
| #define HAVE_TIMES 1
| #define HAVE_KQUEUE 1
| #define HAVE_POLL 1
| #define HAVE_SELECT 1
| #define PHP_FPM_SYSTEMD "simple"
| #define PHP_FPM_USER "nobody"
| #define PHP_FPM_GROUP "nobody"
| #define HAVE_PHPDBG 1
| #define PHPDBG_DEBUG 0
| #define HAVE_SOCKLEN_T 1
| #define HAVE_SOCKADDR_UN_SUN_LEN 1
| #define PHP_WRITE_STDOUT 1
| #define HAVE_SOCKET 1
| #define HAVE_SOCKETPAIR 1
| #define HAVE_HTONL 1
| #define HAVE_GETHOSTNAME 1
| #define HAVE_GETHOSTBYADDR 1
| #define HAVE_YP_GET_DEFAULT_DOMAIN 1
| #define HAVE_DLOPEN 1
| #define HAVE_LIBDL 1
| #define HAVE_LIBM 1
| #define HAVE_INET_ATON 1
| #define STDC_HEADERS 1
| #define HAVE_DIRENT_H 1
| #define HAVE_INTTYPES_H 1
| #define HAVE_STDINT_H 1
| #define HAVE_DIRENT_H 1
| #define HAVE_APPLICATIONSERVICES_APPLICATIONSERVICES_H 1
| #define HAVE_SYS_PARAM_H 1
| #define HAVE_SYS_TYPES_H 1
| #define HAVE_SYS_TIME_H 1
| #define HAVE_NETINET_IN_H 1
| #define HAVE_ALLOCA_H 1
| #define HAVE_ARPA_INET_H 1
| #define HAVE_ARPA_NAMESER_H 1
| #define HAVE_ASSERT_H 1
| #define HAVE_DNS_H 1
| #define HAVE_FCNTL_H 1
| #define HAVE_GRP_H 1
| #define HAVE_LANGINFO_H 1
| #define HAVE_LIMITS_H 1
| #define HAVE_LOCALE_H 1
| #define HAVE_MONETARY_H 1
| #define HAVE_NETDB_H 1
| #define HAVE_POLL_H 1
| #define HAVE_PWD_H 1
| #define HAVE_RESOLV_H 1
| #define HAVE_SIGNAL_H 1
| #define HAVE_STDARG_H 1
| #define HAVE_STDLIB_H 1
| #define HAVE_STRING_H 1
| #define HAVE_SYSLOG_H 1
| #define HAVE_SYSEXITS_H 1
| #define HAVE_SYS_IOCTL_H 1
| #define HAVE_SYS_FILE_H 1
| #define HAVE_SYS_MMAN_H 1
| #define HAVE_SYS_MOUNT_H 1
| #define HAVE_SYS_POLL_H 1
| #define HAVE_SYS_RESOURCE_H 1
| #define HAVE_SYS_SELECT_H 1
| #define HAVE_SYS_SOCKET_H 1
| #define HAVE_SYS_STAT_H 1
| #define HAVE_SYS_STATVFS_H 1
| #define HAVE_SYS_WAIT_H 1
| #define HAVE_TERMIOS_H 1
| #define HAVE_UNISTD_H 1
| #define HAVE_UTIME_H 1
| #define HAVE_SYS_UTSNAME_H 1
| #define HAVE_SYS_IPC_H 1
| #define HAVE_DLFCN_H 1
| #define HAVE_ASSERT_H 1
| #define HAVE_TMMINTRIN_H 1
| #define HAVE_NMMINTRIN_H 1
| #define HAVE_IMMINTRIN_H 1
| #define HAVE_STRUCT_TM_TM_ZONE 1
| #define HAVE_TM_ZONE 1
| #define MISSING_FCLOSE_DECL 0
| #define HAVE_TM_GMTOFF 1
| #define HAVE_STRUCT_FLOCK 1
| #define HAVE_SOCKLEN_T 1
| #define SIZEOF_SIZE_T 8
| #define SIZEOF_LONG_LONG 8
| #define SIZEOF_LONG_LONG_INT 8
| #define SIZEOF_LONG 8
| #define SIZEOF_INT 4
| #define SIZEOF_INTMAX_T 8
| #define HAVE_INTMAX_T 1
| #define SIZEOF_SSIZE_T 8
| #define HAVE_SSIZE_T 1
| #define SIZEOF_PTRDIFF_T 8
| #define HAVE_PTRDIFF_T 1
| #define SIZEOF_SHORT 2
| #define SIZEOF_INT 4
| #define SIZEOF_LONG 8
| #define SIZEOF_LONG_LONG 8
| /* end confdefs.h. */
|
| #if HAVE_STDINT_H
| # include <stdint.h>
| #endif
| #if HAVE_SYS_TYPES_H
| # include <sys/types.h>
| #endif
|
|
| int
| main ()
| {
| if (sizeof (int16))
| return 0;
| ;
| return 0;
| }
configure:13647: result: no
configure:13664: checking for int32
configure:13664: cc -c -g -O2 -fvisibility=hidden -no-cpp-precomp conftest.c >&5
conftest.c:151:13: error: use of undeclared identifier 'int32'
if (sizeof (int32))
^
1 error generated.
configure:13664: $? = 1
configure: failed program was:
| /* confdefs.h */
| #define PACKAGE_NAME ""
| #define PACKAGE_TARNAME ""
| #define PACKAGE_VERSION ""
| #define PACKAGE_STRING ""