Skip to content

Instantly share code, notes, and snippets.

Embed
What would you like to do?
======================================================================
FAIL: test_attributes (test.test_os.TestScandir)
----------------------------------------------------------------------
Traceback (most recent call last):
File "/tmp/guix-build-python-3.5.3.drv-0/Python-3.5.3/Lib/test/test_os.py", line 2960, in test_attributes
self.check_entry(entry, 'dir', True, False, False)
File "/tmp/guix-build-python-3.5.3.drv-0/Python-3.5.3/Lib/test/test_os.py", line 2915, in check_entry
os.stat(entry.path, follow_symlinks=False).st_ino)
AssertionError: 36045942 != 2741586
----------------------------------------------------------------------
Ran 198 tests in 0.347s
FAILED (failures=1, skipped=43)
1 test failed again:
test_os
make: *** [Makefile:1002: test] Error 1
phase `check' failed after 145.5 seconds
builder for `/gnu/store/k5zxs6rfyqsx292i1vzl1y3k3jwnlcj4-python-3.5.3.drv' failed with exit code 1
@ build-failed /gnu/store/k5zxs6rfyqsx292i1vzl1y3k3jwnlcj4-python-3.5.3.drv - 1 builder for `/gnu/store/k5zxs6rfyqsx292i1vzl1y3k3jwnlcj4-python-3.5.3.drv' failed with exit code 1
cannot build derivation `/gnu/store/8s1wlw1216sadsa1z7v5dls35q0lhf18-python-wrapper-3.5.3.drv': 1 dependencies couldn't be built
cannot build derivation `/gnu/store/n1i58hjj61s7afiplfznwfik1fymjfal-ghostscript-9.14.0.drv': 2 dependencies couldn't be built
guix build: error: build failed: build of `/gnu/store/n1i58hjj61s7afiplfznwfik1fymjfal-ghostscript-9.14.0.drv' failed
/guix-dist #
Sign up for free to join this conversation on GitHub. Already have an account? Sign in to comment