Last active

Embed URL

HTTPS clone URL

SSH clone URL

You can clone with HTTPS or SSH.

Download Gist
View gist:f0b363d94ff45ea844f5
1 2 3 4 5 6 7 8 9 10 11 12 13 14 15 16 17 18 19 20 21 22 23 24 25 26
[INFO] Building JRuby Lib Setup 9000.dev
[INFO] ------------------------------------------------------------------------
Downloading: http://repository.codehaus.org/io/tesla/polyglot/tesla-polyglot-maven-plugin/0.0.9/tesla-polyglot-maven-plugin-0.0.9.pom
[WARNING] Checksum validation failed, expected <!DOCTYPE but is b95d8d7d1a57cf46d9f0e924f8864f94159bffd3 for http://repository.codehaus.org/io/tesla/polyglot/tesla-polyglot-maven-plugin/0.0.9/tesla-polyglot-maven-plugin-0.0.9.pom
[WARNING] Checksum validation failed, expected <!DOCTYPE but is b95d8d7d1a57cf46d9f0e924f8864f94159bffd3 for http://repository.codehaus.org/io/tesla/polyglot/tesla-polyglot-maven-plugin/0.0.9/tesla-polyglot-maven-plugin-0.0.9.pom
Downloaded: http://repository.codehaus.org/io/tesla/polyglot/tesla-polyglot-maven-plugin/0.0.9/tesla-polyglot-maven-plugin-0.0.9.pom (2 KB at 1.1 KB/sec)
[WARNING] The POM for io.tesla.polyglot:tesla-polyglot-maven-plugin:jar:0.0.9 is invalid, transitive dependencies (if any) will not be available, enable debug logging for more details
[INFO] ------------------------------------------------------------------------
[INFO] Reactor Summary:
[INFO]
[INFO] JRuby ............................................. SUCCESS [ 0.334 s]
[INFO] JRuby Core ........................................ SUCCESS [ 20.256 s]
[INFO] JRuby Ext ......................................... SUCCESS [ 0.002 s]
[INFO] JRuby OpenSSL ..................................... SUCCESS [ 0.710 s]
[INFO] JRuby Readline .................................... SUCCESS [ 0.057 s]
[INFO] JRuby Ripper ...................................... SUCCESS [ 0.213 s]
[INFO] JRuby Lib Setup ................................... FAILURE [ 1.466 s]
[INFO] ------------------------------------------------------------------------
[INFO] BUILD FAILURE
[INFO] ------------------------------------------------------------------------
[INFO] Total time: 23.394 s
[INFO] Finished at: 2014-02-28T13:41:58+01:00
[INFO] Final Memory: 43M/686M
[INFO] ------------------------------------------------------------------------
[ERROR] Plugin io.tesla.polyglot:tesla-polyglot-maven-plugin:0.0.9 or one of its dependencies could not be resolved: Failed to read artifact descriptor for io.tesla.polyglot:tesla-polyglot-maven-plugin:jar:0.0.9: 1 problem was encountered while building the effective model
[ERROR] [FATAL] Non-parseable POM /opt/local/maven-repo/io/tesla/polyglot/tesla-polyglot-maven-plugin/0.0.9/tesla-polyglot-maven-plugin-0.0.9.pom: end tag name </head> must be the same as start tag <meta> from line 25 (position: TEXT seen ... maximum-scale=1.0; user-scalable=0;" name="viewport">\n </head>... @26:12) @ line 26, column 12
Sign up for free to join this conversation on GitHub. Already have an account? Sign in to comment
Something went wrong with that request. Please try again.