Skip to content

Instantly share code, notes, and snippets.

@kilon kilon/make_release.log
Last active Mar 1, 2019

Embed
What would you like to do?
bf_intern_itasc.vcxproj -> C:\Users\user_name\ephestos\build_windows_Release_x64_vc15_Release\lib\Release\bf_intern_itasc.lib
audaspace.vcxproj -> C:\Users\user_name\ephestos\build_windows_Release_x64_vc15_Release\lib\Release\audaspace.lib
bf_alembic.vcxproj -> C:\Users\user_name\ephestos\build_windows_Release_x64_vc15_Release\lib\Release\bf_alembic.lib
audaspace-py.vcxproj -> C:\Users\user_name\ephestos\build_windows_Release_x64_vc15_Release\lib\Release\audaspace-py.lib
bf_avi.vcxproj -> C:\Users\user_name\ephestos\build_windows_Release_x64_vc15_Release\lib\Release\bf_avi.lib
bf_blenfont.vcxproj -> C:\Users\user_name\ephestos\build_windows_Release_x64_vc15_Release\lib\Release\bf_blenfont.lib
bf_blenlib.vcxproj -> C:\Users\user_name\ephestos\build_windows_Release_x64_vc15_Release\lib\Release\bf_blenlib.lib
bf_blentranslation.vcxproj -> C:\Users\user_name\ephestos\build_windows_Release_x64_vc15_Release\lib\Release\bf_blentranslation.lib
bf_blenkernel.vcxproj -> C:\Users\user_name\ephestos\build_windows_Release_x64_vc15_Release\lib\Release\bf_blenkernel.lib
bf_bmesh.vcxproj -> C:\Users\user_name\ephestos\build_windows_Release_x64_vc15_Release\lib\Release\bf_bmesh.lib
bf_collada.vcxproj -> C:\Users\user_name\ephestos\build_windows_Release_x64_vc15_Release\lib\Release\bf_collada.lib
bf_dna_blenlib.vcxproj -> C:\Users\user_name\ephestos\build_windows_Release_x64_vc15_Release\lib\Release\bf_dna_blenlib.lib
bf_depsgraph.vcxproj -> C:\Users\user_name\ephestos\build_windows_Release_x64_vc15_Release\lib\Release\bf_depsgraph.lib
bf_editor_armature.vcxproj -> C:\Users\user_name\ephestos\build_windows_Release_x64_vc15_Release\lib\Release\bf_editor_armature.lib
bf_editor_animation.vcxproj -> C:\Users\user_name\ephestos\build_windows_Release_x64_vc15_Release\lib\Release\bf_editor_animation.lib
bf_editor_curve.vcxproj -> C:\Users\user_name\ephestos\build_windows_Release_x64_vc15_Release\lib\Release\bf_editor_curve.lib
bf_editor_gizmo_library.vcxproj -> C:\Users\user_name\ephestos\build_windows_Release_x64_vc15_Release\lib\Release\bf_editor_gizmo_library.lib
bf_editor_gpencil.vcxproj -> C:\Users\user_name\ephestos\build_windows_Release_x64_vc15_Release\lib\Release\bf_editor_gpencil.lib
bf_editor_interface.vcxproj -> C:\Users\user_name\ephestos\build_windows_Release_x64_vc15_Release\lib\Release\bf_editor_interface.lib
bf_editor_io.vcxproj -> C:\Users\user_name\ephestos\build_windows_Release_x64_vc15_Release\lib\Release\bf_editor_io.lib
bf_editor_lattice.vcxproj -> C:\Users\user_name\ephestos\build_windows_Release_x64_vc15_Release\lib\Release\bf_editor_lattice.lib
bf_editor_mask.vcxproj -> C:\Users\user_name\ephestos\build_windows_Release_x64_vc15_Release\lib\Release\bf_editor_mask.lib
bf_editor_mesh.vcxproj -> C:\Users\user_name\ephestos\build_windows_Release_x64_vc15_Release\lib\Release\bf_editor_mesh.lib
bf_editor_metaball.vcxproj -> C:\Users\user_name\ephestos\build_windows_Release_x64_vc15_Release\lib\Release\bf_editor_metaball.lib
bf_editor_object.vcxproj -> C:\Users\user_name\ephestos\build_windows_Release_x64_vc15_Release\lib\Release\bf_editor_object.lib
bf_editor_physics.vcxproj -> C:\Users\user_name\ephestos\build_windows_Release_x64_vc15_Release\lib\Release\bf_editor_physics.lib
bf_editor_scene.vcxproj -> C:\Users\user_name\ephestos\build_windows_Release_x64_vc15_Release\lib\Release\bf_editor_scene.lib
bf_editor_render.vcxproj -> C:\Users\user_name\ephestos\build_windows_Release_x64_vc15_Release\lib\Release\bf_editor_render.lib
bf_editor_screen.vcxproj -> C:\Users\user_name\ephestos\build_windows_Release_x64_vc15_Release\lib\Release\bf_editor_screen.lib
bf_editor_sculpt_paint.vcxproj -> C:\Users\user_name\ephestos\build_windows_Release_x64_vc15_Release\lib\Release\bf_editor_sculpt_paint.lib
bf_editor_sound.vcxproj -> C:\Users\user_name\ephestos\build_windows_Release_x64_vc15_Release\lib\Release\bf_editor_sound.lib
bf_editor_space_action.vcxproj -> C:\Users\user_name\ephestos\build_windows_Release_x64_vc15_Release\lib\Release\bf_editor_space_action.lib
bf_editor_space_api.vcxproj -> C:\Users\user_name\ephestos\build_windows_Release_x64_vc15_Release\lib\Release\bf_editor_space_api.lib
bf_editor_space_buttons.vcxproj -> C:\Users\user_name\ephestos\build_windows_Release_x64_vc15_Release\lib\Release\bf_editor_space_buttons.lib
bf_editor_space_clip.vcxproj -> C:\Users\user_name\ephestos\build_windows_Release_x64_vc15_Release\lib\Release\bf_editor_space_clip.lib
bf_editor_space_console.vcxproj -> C:\Users\user_name\ephestos\build_windows_Release_x64_vc15_Release\lib\Release\bf_editor_space_console.lib
bf_editor_space_file.vcxproj -> C:\Users\user_name\ephestos\build_windows_Release_x64_vc15_Release\lib\Release\bf_editor_space_file.lib
bf_editor_space_graph.vcxproj -> C:\Users\user_name\ephestos\build_windows_Release_x64_vc15_Release\lib\Release\bf_editor_space_graph.lib
bf_editor_space_image.vcxproj -> C:\Users\user_name\ephestos\build_windows_Release_x64_vc15_Release\lib\Release\bf_editor_space_image.lib
bf_editor_space_info.vcxproj -> C:\Users\user_name\ephestos\build_windows_Release_x64_vc15_Release\lib\Release\bf_editor_space_info.lib
bf_editor_space_nla.vcxproj -> C:\Users\user_name\ephestos\build_windows_Release_x64_vc15_Release\lib\Release\bf_editor_space_nla.lib
bf_editor_space_node.vcxproj -> C:\Users\user_name\ephestos\build_windows_Release_x64_vc15_Release\lib\Release\bf_editor_space_node.lib
bf_editor_space_outliner.vcxproj -> C:\Users\user_name\ephestos\build_windows_Release_x64_vc15_Release\lib\Release\bf_editor_space_outliner.lib
bf_editor_space_script.vcxproj -> C:\Users\user_name\ephestos\build_windows_Release_x64_vc15_Release\lib\Release\bf_editor_space_script.lib
sequencer_draw.c
bf_editor_space_statusbar.vcxproj -> C:\Users\user_name\ephestos\build_windows_Release_x64_vc15_Release\lib\Release\bf_editor_space_statusbar.lib
bf_editor_space_text.vcxproj -> C:\Users\user_name\ephestos\build_windows_Release_x64_vc15_Release\lib\Release\bf_editor_space_text.lib
bf_editor_space_topbar.vcxproj -> C:\Users\user_name\ephestos\build_windows_Release_x64_vc15_Release\lib\Release\bf_editor_space_topbar.lib
bf_editor_space_userpref.vcxproj -> C:\Users\user_name\ephestos\build_windows_Release_x64_vc15_Release\lib\Release\bf_editor_space_userpref.lib
bf_editor_transform.vcxproj -> C:\Users\user_name\ephestos\build_windows_Release_x64_vc15_Release\lib\Release\bf_editor_transform.lib
bf_editor_space_view3d.vcxproj -> C:\Users\user_name\ephestos\build_windows_Release_x64_vc15_Release\lib\Release\bf_editor_space_view3d.lib
c:\users\user_name\ephestos\blender\source\blender\gpu\GPU_batch.h(60): error C2332: 'struct': missing tag name [C:\Users\user_name\ephestos\build_windows_Release_x64_vc15_Release\source\blender\editors\space_sequencer\bf_editor_space_sequencer.vcxproj]
c:\users\user_name\ephestos\blender\source\blender\gpu\GPU_batch.h(60): error C2059: syntax error: 'type' [C:\Users\user_name\ephestos\build_windows_Release_x64_vc15_Release\source\blender\editors\space_sequencer\bf_editor_space_sequencer.vcxproj]
c:\users\user_name\ephestos\blender\source\blender\gpu\GPU_batch.h(85): warning C4094: untagged 'union' declared no symbols [C:\Users\user_name\ephestos\build_windows_Release_x64_vc15_Release\source\blender\editors\space_sequencer\bf_editor_space_sequencer.vcxproj]
c:\users\user_name\ephestos\blender\source\blender\gpu\GPU_batch.h(91): error C2059: syntax error: '}' [C:\Users\user_name\ephestos\build_windows_Release_x64_vc15_Release\source\blender\editors\space_sequencer\bf_editor_space_sequencer.vcxproj]
c:\users\user_name\ephestos\blender\source\blender\gpu\GPU_batch.h(100): error C2143: syntax error: missing '{' before '*' [C:\Users\user_name\ephestos\build_windows_Release_x64_vc15_Release\source\blender\editors\space_sequencer\bf_editor_space_sequencer.vcxproj]
bf_editor_undo.vcxproj -> C:\Users\user_name\ephestos\build_windows_Release_x64_vc15_Release\lib\Release\bf_editor_undo.lib
c:\users\user_name\ephestos\blender\source\blender\gpu\GPU_batch.h(100): error C4431: missing type specifier - int assumed. Note: C no longer supports default-int [C:\Users\user_name\ephestos\build_windows_Release_x64_vc15_Release\source\blender\editors\space_sequencer\bf_editor_space_sequencer.vcxproj]
c:\users\user_name\ephestos\blender\source\blender\gpu\GPU_batch.h(101): error C2143: syntax error: missing ')' before '*' [C:\Users\user_name\ephestos\build_windows_Release_x64_vc15_Release\source\blender\editors\space_sequencer\bf_editor_space_sequencer.vcxproj]
c:\users\user_name\ephestos\blender\source\blender\gpu\GPU_batch.h(101): error C2143: syntax error: missing '{' before '*' [C:\Users\user_name\ephestos\build_windows_Release_x64_vc15_Release\source\blender\editors\space_sequencer\bf_editor_space_sequencer.vcxproj]
c:\users\user_name\ephestos\blender\source\blender\gpu\GPU_batch.h(101): error C2059: syntax error: ',' [C:\Users\user_name\ephestos\build_windows_Release_x64_vc15_Release\source\blender\editors\space_sequencer\bf_editor_space_sequencer.vcxproj]
c:\users\user_name\ephestos\blender\source\blender\gpu\GPU_batch.h(101): error C2059: syntax error: ')' [C:\Users\user_name\ephestos\build_windows_Release_x64_vc15_Release\source\blender\editors\space_sequencer\bf_editor_space_sequencer.vcxproj]
c:\users\user_name\ephestos\blender\source\blender\gpu\GPU_batch.h(102): error C2143: syntax error: missing ')' before '*' [C:\Users\user_name\ephestos\build_windows_Release_x64_vc15_Release\source\blender\editors\space_sequencer\bf_editor_space_sequencer.vcxproj]
c:\users\user_name\ephestos\blender\source\blender\gpu\GPU_batch.h(102): error C2143: syntax error: missing '{' before '*' [C:\Users\user_name\ephestos\build_windows_Release_x64_vc15_Release\source\blender\editors\space_sequencer\bf_editor_space_sequencer.vcxproj]
c:\users\user_name\ephestos\blender\source\blender\gpu\GPU_batch.h(102): error C4431: missing type specifier - int assumed. Note: C no longer supports default-int [C:\Users\user_name\ephestos\build_windows_Release_x64_vc15_Release\source\blender\editors\space_sequencer\bf_editor_space_sequencer.vcxproj]
c:\users\user_name\ephestos\blender\source\blender\gpu\GPU_batch.h(102): error C2143: syntax error: missing ';' before '*' [C:\Users\user_name\ephestos\build_windows_Release_x64_vc15_Release\source\blender\editors\space_sequencer\bf_editor_space_sequencer.vcxproj]
c:\users\user_name\ephestos\blender\source\blender\gpu\GPU_batch.h(102): error C2059: syntax error: ')' [C:\Users\user_name\ephestos\build_windows_Release_x64_vc15_Release\source\blender\editors\space_sequencer\bf_editor_space_sequencer.vcxproj]
c:\users\user_name\ephestos\blender\source\blender\gpu\GPU_batch.h(109): error C2143: syntax error: missing ')' before '*' [C:\Users\user_name\ephestos\build_windows_Release_x64_vc15_Release\source\blender\editors\space_sequencer\bf_editor_space_sequencer.vcxproj]
c:\users\user_name\ephestos\blender\source\blender\gpu\GPU_batch.h(109): error C2143: syntax error: missing '{' before '*' [C:\Users\user_name\ephestos\build_windows_Release_x64_vc15_Release\source\blender\editors\space_sequencer\bf_editor_space_sequencer.vcxproj]
c:\users\user_name\ephestos\blender\source\blender\gpu\GPU_batch.h(109): error C2059: syntax error: ')' [C:\Users\user_name\ephestos\build_windows_Release_x64_vc15_Release\source\blender\editors\space_sequencer\bf_editor_space_sequencer.vcxproj]
c:\users\user_name\ephestos\blender\source\blender\gpu\GPU_batch.h(109): error C2059: syntax error: ';' [C:\Users\user_name\ephestos\build_windows_Release_x64_vc15_Release\source\blender\editors\space_sequencer\bf_editor_space_sequencer.vcxproj]
c:\users\user_name\ephestos\blender\source\blender\gpu\GPU_batch.h(110): error C2143: syntax error: missing ')' before '*' [C:\Users\user_name\ephestos\build_windows_Release_x64_vc15_Release\source\blender\editors\space_sequencer\bf_editor_space_sequencer.vcxproj]
c:\users\user_name\ephestos\blender\source\blender\gpu\GPU_batch.h(110): error C2143: syntax error: missing '{' before '*' [C:\Users\user_name\ephestos\build_windows_Release_x64_vc15_Release\source\blender\editors\space_sequencer\bf_editor_space_sequencer.vcxproj]
c:\users\user_name\ephestos\blender\source\blender\gpu\GPU_batch.h(110): error C2059: syntax error: ')' [C:\Users\user_name\ephestos\build_windows_Release_x64_vc15_Release\source\blender\editors\space_sequencer\bf_editor_space_sequencer.vcxproj]
c:\users\user_name\ephestos\blender\source\blender\gpu\GPU_batch.h(110): error C2059: syntax error: ';' [C:\Users\user_name\ephestos\build_windows_Release_x64_vc15_Release\source\blender\editors\space_sequencer\bf_editor_space_sequencer.vcxproj]
c:\users\user_name\ephestos\blender\source\blender\gpu\GPU_batch.h(112): error C2143: syntax error: missing ')' before '*' [C:\Users\user_name\ephestos\build_windows_Release_x64_vc15_Release\source\blender\editors\space_sequencer\bf_editor_space_sequencer.vcxproj]
c:\users\user_name\ephestos\blender\source\blender\gpu\GPU_batch.h(112): error C2143: syntax error: missing '{' before '*' [C:\Users\user_name\ephestos\build_windows_Release_x64_vc15_Release\source\blender\editors\space_sequencer\bf_editor_space_sequencer.vcxproj]
c:\users\user_name\ephestos\blender\source\blender\gpu\GPU_batch.h(112): error C2059: syntax error: ')' [C:\Users\user_name\ephestos\build_windows_Release_x64_vc15_Release\source\blender\editors\space_sequencer\bf_editor_space_sequencer.vcxproj]
c:\users\user_name\ephestos\blender\source\blender\gpu\GPU_batch.h(112): error C2059: syntax error: ';' [C:\Users\user_name\ephestos\build_windows_Release_x64_vc15_Release\source\blender\editors\space_sequencer\bf_editor_space_sequencer.vcxproj]
c:\users\user_name\ephestos\blender\source\blender\gpu\GPU_batch.h(114): error C2143: syntax error: missing ')' before '*' [C:\Users\user_name\ephestos\build_windows_Release_x64_vc15_Release\source\blender\editors\space_sequencer\bf_editor_space_sequencer.vcxproj]
c:\users\user_name\ephestos\blender\source\blender\gpu\GPU_batch.h(114): error C2143: syntax error: missing '{' before '*' [C:\Users\user_name\ephestos\build_windows_Release_x64_vc15_Release\source\blender\editors\space_sequencer\bf_editor_space_sequencer.vcxproj]
c:\users\user_name\ephestos\blender\source\blender\gpu\GPU_batch.h(114): error C2059: syntax error: ',' [C:\Users\user_name\ephestos\build_windows_Release_x64_vc15_Release\source\blender\editors\space_sequencer\bf_editor_space_sequencer.vcxproj]
c:\users\user_name\ephestos\blender\source\blender\gpu\GPU_batch.h(116): error C2143: syntax error: missing ')' before '*' [C:\Users\user_name\ephestos\build_windows_Release_x64_vc15_Release\source\blender\editors\space_sequencer\bf_editor_space_sequencer.vcxproj]
c:\users\user_name\ephestos\blender\source\blender\gpu\GPU_batch.h(116): error C2143: syntax error: missing '{' before '*' [C:\Users\user_name\ephestos\build_windows_Release_x64_vc15_Release\source\blender\editors\space_sequencer\bf_editor_space_sequencer.vcxproj]
c:\users\user_name\ephestos\blender\source\blender\gpu\GPU_batch.h(116): error C2059: syntax error: ',' [C:\Users\user_name\ephestos\build_windows_Release_x64_vc15_Release\source\blender\editors\space_sequencer\bf_editor_space_sequencer.vcxproj]
c:\users\user_name\ephestos\blender\source\blender\gpu\GPU_batch.h(116): error C2059: syntax error: ')' [C:\Users\user_name\ephestos\build_windows_Release_x64_vc15_Release\source\blender\editors\space_sequencer\bf_editor_space_sequencer.vcxproj]
c:\users\user_name\ephestos\blender\source\blender\gpu\GPU_batch.h(118): error C2143: syntax error: missing ')' before '*' [C:\Users\user_name\ephestos\build_windows_Release_x64_vc15_Release\source\blender\editors\space_sequencer\bf_editor_space_sequencer.vcxproj]
c:\users\user_name\ephestos\blender\source\blender\gpu\GPU_batch.h(118): error C2143: syntax error: missing '{' before '*' [C:\Users\user_name\ephestos\build_windows_Release_x64_vc15_Release\source\blender\editors\space_sequencer\bf_editor_space_sequencer.vcxproj]
c:\users\user_name\ephestos\blender\source\blender\gpu\GPU_batch.h(118): error C2059: syntax error: ',' [C:\Users\user_name\ephestos\build_windows_Release_x64_vc15_Release\source\blender\editors\space_sequencer\bf_editor_space_sequencer.vcxproj]
c:\users\user_name\ephestos\blender\source\blender\gpu\GPU_batch.h(118): error C2059: syntax error: ')' [C:\Users\user_name\ephestos\build_windows_Release_x64_vc15_Release\source\blender\editors\space_sequencer\bf_editor_space_sequencer.vcxproj]
c:\users\user_name\ephestos\blender\source\blender\gpu\GPU_batch.h(123): error C2143: syntax error: missing ')' before '*' [C:\Users\user_name\ephestos\build_windows_Release_x64_vc15_Release\source\blender\editors\space_sequencer\bf_editor_space_sequencer.vcxproj]
c:\users\user_name\ephestos\blender\source\blender\gpu\GPU_batch.h(123): error C2143: syntax error: missing '{' before '*' [C:\Users\user_name\ephestos\build_windows_Release_x64_vc15_Release\source\blender\editors\space_sequencer\bf_editor_space_sequencer.vcxproj]
c:\users\user_name\ephestos\blender\source\blender\gpu\GPU_batch.h(123): error C2059: syntax error: ',' [C:\Users\user_name\ephestos\build_windows_Release_x64_vc15_Release\source\blender\editors\space_sequencer\bf_editor_space_sequencer.vcxproj]
c:\users\user_name\ephestos\blender\source\blender\gpu\GPU_batch.h(123): error C2059: syntax error: ')' [C:\Users\user_name\ephestos\build_windows_Release_x64_vc15_Release\source\blender\editors\space_sequencer\bf_editor_space_sequencer.vcxproj]
c:\users\user_name\ephestos\blender\source\blender\gpu\GPU_batch.h(124): error C2143: syntax error: missing ')' before '*' [C:\Users\user_name\ephestos\build_windows_Release_x64_vc15_Release\source\blender\editors\space_sequencer\bf_editor_space_sequencer.vcxproj]
c:\users\user_name\ephestos\blender\source\blender\gpu\GPU_batch.h(124): error C2143: syntax error: missing '{' before '*' [C:\Users\user_name\ephestos\build_windows_Release_x64_vc15_Release\source\blender\editors\space_sequencer\bf_editor_space_sequencer.vcxproj]
c:\users\user_name\ephestos\blender\source\blender\gpu\GPU_batch.h(124): error C2059: syntax error: ',' [C:\Users\user_name\ephestos\build_windows_Release_x64_vc15_Release\source\blender\editors\space_sequencer\bf_editor_space_sequencer.vcxproj]
c:\users\user_name\ephestos\blender\source\blender\gpu\GPU_batch.h(124): error C2059: syntax error: ')' [C:\Users\user_name\ephestos\build_windows_Release_x64_vc15_Release\source\blender\editors\space_sequencer\bf_editor_space_sequencer.vcxproj]
c:\users\user_name\ephestos\blender\source\blender\gpu\GPU_batch.h(125): error C2143: syntax error: missing ')' before '*' [C:\Users\user_name\ephestos\build_windows_Release_x64_vc15_Release\source\blender\editors\space_sequencer\bf_editor_space_sequencer.vcxproj]
c:\users\user_name\ephestos\blender\source\blender\gpu\GPU_batch.h(125): error C2143: syntax error: missing '{' before '*' [C:\Users\user_name\ephestos\build_windows_Release_x64_vc15_Release\source\blender\editors\space_sequencer\bf_editor_space_sequencer.vcxproj]
c:\users\user_name\ephestos\blender\source\blender\gpu\GPU_batch.h(125): error C2059: syntax error: ',' [C:\Users\user_name\ephestos\build_windows_Release_x64_vc15_Release\source\blender\editors\space_sequencer\bf_editor_space_sequencer.vcxproj]
c:\users\user_name\ephestos\blender\source\blender\gpu\GPU_batch.h(125): error C2059: syntax error: ')' [C:\Users\user_name\ephestos\build_windows_Release_x64_vc15_Release\source\blender\editors\space_sequencer\bf_editor_space_sequencer.vcxproj]
c:\users\user_name\ephestos\blender\source\blender\gpu\GPU_batch.h(127): error C2143: syntax error: missing ')' before '*' [C:\Users\user_name\ephestos\build_windows_Release_x64_vc15_Release\source\blender\editors\space_sequencer\bf_editor_space_sequencer.vcxproj]
c:\users\user_name\ephestos\blender\source\blender\gpu\GPU_batch.h(127): error C2143: syntax error: missing '{' before '*' [C:\Users\user_name\ephestos\build_windows_Release_x64_vc15_Release\source\blender\editors\space_sequencer\bf_editor_space_sequencer.vcxproj]
c:\users\user_name\ephestos\blender\source\blender\gpu\GPU_batch.h(127): error C4431: missing type specifier - int assumed. Note: C no longer supports default-int [C:\Users\user_name\ephestos\build_windows_Release_x64_vc15_Release\source\blender\editors\space_sequencer\bf_editor_space_sequencer.vcxproj]
bf_editor_util.vcxproj -> C:\Users\user_name\ephestos\build_windows_Release_x64_vc15_Release\lib\Release\bf_editor_util.lib
c:\users\user_name\ephestos\blender\source\blender\gpu\GPU_batch.h(127): error C2370: 'eGPUBuiltinShader': redefinition; different storage class [C:\Users\user_name\ephestos\build_windows_Release_x64_vc15_Release\source\blender\editors\space_sequencer\bf_editor_space_sequencer.vcxproj]
c:\users\user_name\ephestos\blender\source\blender\gpu\GPU_shader.h(359): note: see declaration of 'eGPUBuiltinShader'
c:\users\user_name\ephestos\blender\source\blender\gpu\GPU_batch.h(127): error C2146: syntax error: missing ';' before identifier 'shader_id' [C:\Users\user_name\ephestos\build_windows_Release_x64_vc15_Release\source\blender\editors\space_sequencer\bf_editor_space_sequencer.vcxproj]
c:\users\user_name\ephestos\blender\source\blender\gpu\GPU_batch.h(127): error C2059: syntax error: ')' [C:\Users\user_name\ephestos\build_windows_Release_x64_vc15_Release\source\blender\editors\space_sequencer\bf_editor_space_sequencer.vcxproj]
c:\users\user_name\ephestos\blender\source\blender\gpu\GPU_batch.h(129): error C2143: syntax error: missing ')' before '*' [C:\Users\user_name\ephestos\build_windows_Release_x64_vc15_Release\source\blender\editors\space_sequencer\bf_editor_space_sequencer.vcxproj]
c:\users\user_name\ephestos\blender\source\blender\gpu\GPU_batch.h(129): error C2143: syntax error: missing '{' before '*' [C:\Users\user_name\ephestos\build_windows_Release_x64_vc15_Release\source\blender\editors\space_sequencer\bf_editor_space_sequencer.vcxproj]
c:\users\user_name\ephestos\blender\source\blender\gpu\GPU_batch.h(129): error C4431: missing type specifier - int assumed. Note: C no longer supports default-int [C:\Users\user_name\ephestos\build_windows_Release_x64_vc15_Release\source\blender\editors\space_sequencer\bf_editor_space_sequencer.vcxproj]
c:\users\user_name\ephestos\blender\source\blender\gpu\GPU_batch.h(129): error C2370: 'eGPUBuiltinShader': redefinition; different storage class [C:\Users\user_name\ephestos\build_windows_Release_x64_vc15_Release\source\blender\editors\space_sequencer\bf_editor_space_sequencer.vcxproj]
c:\users\user_name\ephestos\blender\source\blender\gpu\GPU_shader.h(359): note: see declaration of 'eGPUBuiltinShader'
c:\users\user_name\ephestos\blender\source\blender\gpu\GPU_batch.h(129): error C2146: syntax error: missing ';' before identifier 'shader_id' [C:\Users\user_name\ephestos\build_windows_Release_x64_vc15_Release\source\blender\editors\space_sequencer\bf_editor_space_sequencer.vcxproj]
c:\users\user_name\ephestos\blender\source\blender\gpu\GPU_batch.h(129): error C2370: 'eGPUShaderConfig': redefinition; different storage class [C:\Users\user_name\ephestos\build_windows_Release_x64_vc15_Release\source\blender\editors\space_sequencer\bf_editor_space_sequencer.vcxproj]
c:\users\user_name\ephestos\blender\source\blender\gpu\GPU_shader.h(366): note: see declaration of 'eGPUShaderConfig'
c:\users\user_name\ephestos\blender\source\blender\gpu\GPU_batch.h(129): error C2146: syntax error: missing ';' before identifier 'sh_cfg' [C:\Users\user_name\ephestos\build_windows_Release_x64_vc15_Release\source\blender\editors\space_sequencer\bf_editor_space_sequencer.vcxproj]
c:\users\user_name\ephestos\blender\source\blender\gpu\GPU_batch.h(129): error C2059: syntax error: ')' [C:\Users\user_name\ephestos\build_windows_Release_x64_vc15_Release\source\blender\editors\space_sequencer\bf_editor_space_sequencer.vcxproj]
c:\users\user_name\ephestos\blender\source\blender\gpu\GPU_batch.h(133): error C2143: syntax error: missing ')' before '*' [C:\Users\user_name\ephestos\build_windows_Release_x64_vc15_Release\source\blender\editors\space_sequencer\bf_editor_space_sequencer.vcxproj]
c:\users\user_name\ephestos\blender\source\blender\gpu\GPU_batch.h(133): error C2143: syntax error: missing '{' before '*' [C:\Users\user_name\ephestos\build_windows_Release_x64_vc15_Release\source\blender\editors\space_sequencer\bf_editor_space_sequencer.vcxproj]
c:\users\user_name\ephestos\blender\source\blender\gpu\GPU_batch.h(133): error C2059: syntax error: ')' [C:\Users\user_name\ephestos\build_windows_Release_x64_vc15_Release\source\blender\editors\space_sequencer\bf_editor_space_sequencer.vcxproj]
c:\users\user_name\ephestos\blender\source\blender\gpu\GPU_batch.h(133): error C2059: syntax error: ';' [C:\Users\user_name\ephestos\build_windows_Release_x64_vc15_Release\source\blender\editors\space_sequencer\bf_editor_space_sequencer.vcxproj]
c:\users\user_name\ephestos\blender\source\blender\gpu\GPU_batch.h(134): error C2143: syntax error: missing ')' before '*' [C:\Users\user_name\ephestos\build_windows_Release_x64_vc15_Release\source\blender\editors\space_sequencer\bf_editor_space_sequencer.vcxproj]
c:\users\user_name\ephestos\blender\source\blender\gpu\GPU_batch.h(134): error C2143: syntax error: missing '{' before '*' [C:\Users\user_name\ephestos\build_windows_Release_x64_vc15_Release\source\blender\editors\space_sequencer\bf_editor_space_sequencer.vcxproj]
c:\users\user_name\ephestos\blender\source\blender\gpu\GPU_batch.h(134): error C2059: syntax error: ')' [C:\Users\user_name\ephestos\build_windows_Release_x64_vc15_Release\source\blender\editors\space_sequencer\bf_editor_space_sequencer.vcxproj]
c:\users\user_name\ephestos\blender\source\blender\gpu\GPU_batch.h(134): error C2059: syntax error: ';' [C:\Users\user_name\ephestos\build_windows_Release_x64_vc15_Release\source\blender\editors\space_sequencer\bf_editor_space_sequencer.vcxproj]
c:\users\user_name\ephestos\blender\source\blender\gpu\GPU_batch.h(136): error C2143: syntax error: missing ')' before '*' [C:\Users\user_name\ephestos\build_windows_Release_x64_vc15_Release\source\blender\editors\space_sequencer\bf_editor_space_sequencer.vcxproj]
c:\users\user_name\ephestos\blender\source\blender\gpu\GPU_batch.h(136): error C2143: syntax error: missing '{' before '*' [C:\Users\user_name\ephestos\build_windows_Release_x64_vc15_Release\source\blender\editors\space_sequencer\bf_editor_space_sequencer.vcxproj]
c:\users\user_name\ephestos\blender\source\blender\gpu\GPU_batch.h(136): error C2059: syntax error: ',' [C:\Users\user_name\ephestos\build_windows_Release_x64_vc15_Release\source\blender\editors\space_sequencer\bf_editor_space_sequencer.vcxproj]
c:\users\user_name\ephestos\blender\source\blender\gpu\GPU_batch.h(136): error C2059: syntax error: ')' [C:\Users\user_name\ephestos\build_windows_Release_x64_vc15_Release\source\blender\editors\space_sequencer\bf_editor_space_sequencer.vcxproj]
c:\users\user_name\ephestos\blender\source\blender\gpu\GPU_batch.h(137): error C2143: syntax error: missing ')' before '*' [C:\Users\user_name\ephestos\build_windows_Release_x64_vc15_Release\source\blender\editors\space_sequencer\bf_editor_space_sequencer.vcxproj]
c:\users\user_name\ephestos\blender\source\blender\gpu\GPU_batch.h(137): error C2143: syntax error: missing '{' before '*' [C:\Users\user_name\ephestos\build_windows_Release_x64_vc15_Release\source\blender\editors\space_sequencer\bf_editor_space_sequencer.vcxproj]
c:\users\user_name\ephestos\blender\source\blender\gpu\GPU_batch.h(137): error C2059: syntax error: ',' [C:\Users\user_name\ephestos\build_windows_Release_x64_vc15_Release\source\blender\editors\space_sequencer\bf_editor_space_sequencer.vcxproj]
c:\users\user_name\ephestos\blender\source\blender\gpu\GPU_batch.h(137): error C2059: syntax error: ')' [C:\Users\user_name\ephestos\build_windows_Release_x64_vc15_Release\source\blender\editors\space_sequencer\bf_editor_space_sequencer.vcxproj]
c:\users\user_name\ephestos\blender\source\blender\gpu\GPU_batch.h(138): error C2143: syntax error: missing ')' before '*' [C:\Users\user_name\ephestos\build_windows_Release_x64_vc15_Release\source\blender\editors\space_sequencer\bf_editor_space_sequencer.vcxproj]
c:\users\user_name\ephestos\blender\source\blender\gpu\GPU_batch.h(138): error C2143: syntax error: missing '{' before '*' [C:\Users\user_name\ephestos\build_windows_Release_x64_vc15_Release\source\blender\editors\space_sequencer\bf_editor_space_sequencer.vcxproj]
c:\users\user_name\ephestos\blender\source\blender\gpu\GPU_batch.h(138): error C2059: syntax error: ',' [C:\Users\user_name\ephestos\build_windows_Release_x64_vc15_Release\source\blender\editors\space_sequencer\bf_editor_space_sequencer.vcxproj]
c:\users\user_name\ephestos\blender\source\blender\gpu\GPU_batch.h(138): error C2059: syntax error: ')' [C:\Users\user_name\ephestos\build_windows_Release_x64_vc15_Release\source\blender\editors\space_sequencer\bf_editor_space_sequencer.vcxproj]
c:\users\user_name\ephestos\blender\source\blender\gpu\GPU_batch.h(139): error C2143: syntax error: missing ')' before '*' [C:\Users\user_name\ephestos\build_windows_Release_x64_vc15_Release\source\blender\editors\space_sequencer\bf_editor_space_sequencer.vcxproj]
c:\users\user_name\ephestos\blender\source\blender\gpu\GPU_batch.h(139): error C2143: syntax error: missing '{' before '*' [C:\Users\user_name\ephestos\build_windows_Release_x64_vc15_Release\source\blender\editors\space_sequencer\bf_editor_space_sequencer.vcxproj]
c:\users\user_name\ephestos\blender\source\blender\gpu\GPU_batch.h(139): error C2059: syntax error: ',' [C:\Users\user_name\ephestos\build_windows_Release_x64_vc15_Release\source\blender\editors\space_sequencer\bf_editor_space_sequencer.vcxproj]
c:\users\user_name\ephestos\blender\source\blender\gpu\GPU_batch.h(139): error C2059: syntax error: ')' [C:\Users\user_name\ephestos\build_windows_Release_x64_vc15_Release\source\blender\editors\space_sequencer\bf_editor_space_sequencer.vcxproj]
c:\users\user_name\ephestos\blender\source\blender\gpu\GPU_batch.h(140): error C2143: syntax error: missing ')' before '*' [C:\Users\user_name\ephestos\build_windows_Release_x64_vc15_Release\source\blender\editors\space_sequencer\bf_editor_space_sequencer.vcxproj]
c:\users\user_name\ephestos\blender\source\blender\gpu\GPU_batch.h(140): error C2143: syntax error: missing '{' before '*' [C:\Users\user_name\ephestos\build_windows_Release_x64_vc15_Release\source\blender\editors\space_sequencer\bf_editor_space_sequencer.vcxproj]
c:\users\user_name\ephestos\blender\source\blender\gpu\GPU_batch.h(140): error C2059: syntax error: ',' [C:\Users\user_name\ephestos\build_windows_Release_x64_vc15_Release\source\blender\editors\space_sequencer\bf_editor_space_sequencer.vcxproj]
c:\users\user_name\ephestos\blender\source\blender\gpu\GPU_batch.h(140): error C2059: syntax error: ')' [C:\Users\user_name\ephestos\build_windows_Release_x64_vc15_Release\source\blender\editors\space_sequencer\bf_editor_space_sequencer.vcxproj]
c:\users\user_name\ephestos\blender\source\blender\gpu\GPU_batch.h(141): error C2143: syntax error: missing ')' before '*' [C:\Users\user_name\ephestos\build_windows_Release_x64_vc15_Release\source\blender\editors\space_sequencer\bf_editor_space_sequencer.vcxproj]
c:\users\user_name\ephestos\blender\source\blender\gpu\GPU_batch.h(141): error C2143: syntax error: missing '{' before '*' [C:\Users\user_name\ephestos\build_windows_Release_x64_vc15_Release\source\blender\editors\space_sequencer\bf_editor_space_sequencer.vcxproj]
c:\users\user_name\ephestos\blender\source\blender\gpu\GPU_batch.h(141): error C2059: syntax error: ',' [C:\Users\user_name\ephestos\build_windows_Release_x64_vc15_Release\source\blender\editors\space_sequencer\bf_editor_space_sequencer.vcxproj]
c:\users\user_name\ephestos\blender\source\blender\gpu\GPU_batch.h(141): error C2059: syntax error: ')' [C:\Users\user_name\ephestos\build_windows_Release_x64_vc15_Release\source\blender\editors\space_sequencer\bf_editor_space_sequencer.vcxproj]
c:\users\user_name\ephestos\blender\source\blender\gpu\GPU_batch.h(142): error C2143: syntax error: missing ')' before '*' [C:\Users\user_name\ephestos\build_windows_Release_x64_vc15_Release\source\blender\editors\space_sequencer\bf_editor_space_sequencer.vcxproj]
c:\users\user_name\ephestos\blender\source\blender\gpu\GPU_batch.h(142): error C2143: syntax error: missing '{' before '*' [C:\Users\user_name\ephestos\build_windows_Release_x64_vc15_Release\source\blender\editors\space_sequencer\bf_editor_space_sequencer.vcxproj]
c:\users\user_name\ephestos\blender\source\blender\gpu\GPU_batch.h(142): error C2059: syntax error: ',' [C:\Users\user_name\ephestos\build_windows_Release_x64_vc15_Release\source\blender\editors\space_sequencer\bf_editor_space_sequencer.vcxproj]
c:\users\user_name\ephestos\blender\source\blender\gpu\GPU_batch.h(142): error C2059: syntax error: ')' [C:\Users\user_name\ephestos\build_windows_Release_x64_vc15_Release\source\blender\editors\space_sequencer\bf_editor_space_sequencer.vcxproj]
c:\users\user_name\ephestos\blender\source\blender\gpu\GPU_batch.h(143): error C2143: syntax error: missing ')' before '*' [C:\Users\user_name\ephestos\build_windows_Release_x64_vc15_Release\source\blender\editors\space_sequencer\bf_editor_space_sequencer.vcxproj]
c:\users\user_name\ephestos\blender\source\blender\gpu\GPU_batch.h(143): error C2143: syntax error: missing '{' before '*' [C:\Users\user_name\ephestos\build_windows_Release_x64_vc15_Release\source\blender\editors\space_sequencer\bf_editor_space_sequencer.vcxproj]
c:\users\user_name\ephestos\blender\source\blender\gpu\GPU_batch.h(143): error C2059: syntax error: ',' [C:\Users\user_name\ephestos\build_windows_Release_x64_vc15_Release\source\blender\editors\space_sequencer\bf_editor_space_sequencer.vcxproj]
c:\users\user_name\ephestos\blender\source\blender\gpu\GPU_batch.h(143): error C2059: syntax error: ')' [C:\Users\user_name\ephestos\build_windows_Release_x64_vc15_Release\source\blender\editors\space_sequencer\bf_editor_space_sequencer.vcxproj]
c:\users\user_name\ephestos\blender\source\blender\gpu\GPU_batch.h(144): error C2143: syntax error: missing ')' before '*' [C:\Users\user_name\ephestos\build_windows_Release_x64_vc15_Release\source\blender\editors\space_sequencer\bf_editor_space_sequencer.vcxproj]
c:\users\user_name\ephestos\blender\source\blender\gpu\GPU_batch.h(144): error C2143: syntax error: missing '{' before '*' [C:\Users\user_name\ephestos\build_windows_Release_x64_vc15_Release\source\blender\editors\space_sequencer\bf_editor_space_sequencer.vcxproj]
c:\users\user_name\ephestos\blender\source\blender\gpu\GPU_batch.h(144): fatal error C1003: error count exceeds 100; stopping compilation [C:\Users\user_name\ephestos\build_windows_Release_x64_vc15_Release\source\blender\editors\space_sequencer\bf_editor_space_sequencer.vcxproj]
bf_editor_uvedit.vcxproj -> C:\Users\user_name\ephestos\build_windows_Release_x64_vc15_Release\lib\Release\bf_editor_uvedit.lib
bf_gpencil_modifiers.vcxproj -> C:\Users\user_name\ephestos\build_windows_Release_x64_vc15_Release\lib\Release\bf_gpencil_modifiers.lib
bf_ikplugin.vcxproj -> C:\Users\user_name\ephestos\build_windows_Release_x64_vc15_Release\lib\Release\bf_ikplugin.lib
bf_imbuf.vcxproj -> C:\Users\user_name\ephestos\build_windows_Release_x64_vc15_Release\lib\Release\bf_imbuf.lib
bf_imbuf_cineon.vcxproj -> C:\Users\user_name\ephestos\build_windows_Release_x64_vc15_Release\lib\Release\bf_imbuf_cineon.lib
bf_imbuf_dds.vcxproj -> C:\Users\user_name\ephestos\build_windows_Release_x64_vc15_Release\lib\Release\bf_imbuf_dds.lib
bf_freestyle.vcxproj -> C:\Users\user_name\ephestos\build_windows_Release_x64_vc15_Release\lib\Release\bf_freestyle.lib
bf_imbuf_openexr.vcxproj -> C:\Users\user_name\ephestos\build_windows_Release_x64_vc15_Release\lib\Release\bf_imbuf_openexr.lib
bf_imbuf_openimageio.vcxproj -> C:\Users\user_name\ephestos\build_windows_Release_x64_vc15_Release\lib\Release\bf_imbuf_openimageio.lib
bf_intern_audaspace.vcxproj -> C:\Users\user_name\ephestos\build_windows_Release_x64_vc15_Release\lib\Release\bf_intern_audaspace.lib
bf_intern_clog.vcxproj -> C:\Users\user_name\ephestos\build_windows_Release_x64_vc15_Release\lib\Release\bf_intern_clog.lib
bf_intern_dualcon.vcxproj -> C:\Users\user_name\ephestos\build_windows_Release_x64_vc15_Release\lib\Release\bf_intern_dualcon.lib
bf_intern_eigen.vcxproj -> C:\Users\user_name\ephestos\build_windows_Release_x64_vc15_Release\lib\Release\bf_intern_eigen.lib
bf_intern_elbeem.vcxproj -> C:\Users\user_name\ephestos\build_windows_Release_x64_vc15_Release\lib\Release\bf_intern_elbeem.lib
bf_intern_glew_mx.vcxproj -> C:\Users\user_name\ephestos\build_windows_Release_x64_vc15_Release\lib\Release\bf_intern_glew_mx.lib
bf_intern_ghost.vcxproj -> C:\Users\user_name\ephestos\build_windows_Release_x64_vc15_Release\lib\Release\bf_intern_ghost.lib
bf_intern_guardedalloc.vcxproj -> C:\Users\user_name\ephestos\build_windows_Release_x64_vc15_Release\lib\Release\bf_intern_guardedalloc.lib
bf_intern_iksolver.vcxproj -> C:\Users\user_name\ephestos\build_windows_Release_x64_vc15_Release\lib\Release\bf_intern_iksolver.lib
bf_intern_locale.vcxproj -> C:\Users\user_name\ephestos\build_windows_Release_x64_vc15_Release\lib\Release\bf_intern_locale.lib
bf_intern_memutil.vcxproj -> C:\Users\user_name\ephestos\build_windows_Release_x64_vc15_Release\lib\Release\bf_intern_memutil.lib
bf_intern_mikktspace.vcxproj -> C:\Users\user_name\ephestos\build_windows_Release_x64_vc15_Release\lib\Release\bf_intern_mikktspace.lib
bf_intern_libmv.vcxproj -> C:\Users\user_name\ephestos\build_windows_Release_x64_vc15_Release\lib\Release\bf_intern_libmv.lib
bf_intern_numaapi.vcxproj -> C:\Users\user_name\ephestos\build_windows_Release_x64_vc15_Release\lib\Release\bf_intern_numaapi.lib
bf_intern_rigidbody.vcxproj -> C:\Users\user_name\ephestos\build_windows_Release_x64_vc15_Release\lib\Release\bf_intern_rigidbody.lib
bf_intern_openvdb.vcxproj -> C:\Users\user_name\ephestos\build_windows_Release_x64_vc15_Release\lib\Release\bf_intern_openvdb.lib
bf_intern_smoke.vcxproj -> C:\Users\user_name\ephestos\build_windows_Release_x64_vc15_Release\lib\Release\bf_intern_smoke.lib
bf_intern_string.vcxproj -> C:\Users\user_name\ephestos\build_windows_Release_x64_vc15_Release\lib\Release\bf_intern_string.lib
bf_intern_utfconv.vcxproj -> C:\Users\user_name\ephestos\build_windows_Release_x64_vc15_Release\lib\Release\bf_intern_utfconv.lib
bf_modifiers.vcxproj -> C:\Users\user_name\ephestos\build_windows_Release_x64_vc15_Release\lib\Release\bf_modifiers.lib
bf_physics.vcxproj -> C:\Users\user_name\ephestos\build_windows_Release_x64_vc15_Release\lib\Release\bf_physics.lib
bf_nodes.vcxproj -> C:\Users\user_name\ephestos\build_windows_Release_x64_vc15_Release\lib\Release\bf_nodes.lib
bf_python.vcxproj -> C:\Users\user_name\ephestos\build_windows_Release_x64_vc15_Release\lib\Release\bf_python.lib
bf_python_bmesh.vcxproj -> C:\Users\user_name\ephestos\build_windows_Release_x64_vc15_Release\lib\Release\bf_python_bmesh.lib
bf_python_ext.vcxproj -> C:\Users\user_name\ephestos\build_windows_Release_x64_vc15_Release\lib\Release\bf_python_ext.lib
msgfmt.vcxproj -> C:\Users\user_name\ephestos\build_windows_Release_x64_vc15_Release\bin\Release\msgfmt.exe
bf_python_gpu.vcxproj -> C:\Users\user_name\ephestos\build_windows_Release_x64_vc15_Release\lib\Release\bf_python_gpu.lib
bf_python_mathutils.vcxproj -> C:\Users\user_name\ephestos\build_windows_Release_x64_vc15_Release\lib\Release\bf_python_mathutils.lib
bf_render.vcxproj -> C:\Users\user_name\ephestos\build_windows_Release_x64_vc15_Release\lib\Release\bf_render.lib
bf_shader_fx.vcxproj -> C:\Users\user_name\ephestos\build_windows_Release_x64_vc15_Release\lib\Release\bf_shader_fx.lib
bf_windowmanager.vcxproj -> C:\Users\user_name\ephestos\build_windows_Release_x64_vc15_Release\lib\Release\bf_windowmanager.lib
Generating buildinfo.h_fake, buildinfo.h
cycles_bvh.vcxproj -> C:\Users\user_name\ephestos\build_windows_Release_x64_vc15_Release\lib\Release\cycles_bvh.lib
cycles_device.vcxproj -> C:\Users\user_name\ephestos\build_windows_Release_x64_vc15_Release\lib\Release\cycles_device.lib
cycles_graph.vcxproj -> C:\Users\user_name\ephestos\build_windows_Release_x64_vc15_Release\lib\Release\cycles_graph.lib
cycles_kernel.vcxproj -> C:\Users\user_name\ephestos\build_windows_Release_x64_vc15_Release\lib\Release\cycles_kernel.lib
cycles_kernel_osl.vcxproj -> C:\Users\user_name\ephestos\build_windows_Release_x64_vc15_Release\lib\Release\cycles_kernel_osl.lib
cycles_render.vcxproj -> C:\Users\user_name\ephestos\build_windows_Release_x64_vc15_Release\lib\Release\cycles_render.lib
cycles_subd.vcxproj -> C:\Users\user_name\ephestos\build_windows_Release_x64_vc15_Release\lib\Release\cycles_subd.lib
datatoc.vcxproj -> C:\Users\user_name\ephestos\build_windows_Release_x64_vc15_Release\bin\Release\datatoc.exe
cycles_util.vcxproj -> C:\Users\user_name\ephestos\build_windows_Release_x64_vc15_Release\lib\Release\cycles_util.lib
datatoc_icon.vcxproj -> C:\Users\user_name\ephestos\build_windows_Release_x64_vc15_Release\bin\Release\datatoc_icon.exe
bf_intern_opensubdiv.vcxproj -> C:\Users\user_name\ephestos\build_windows_Release_x64_vc15_Release\lib\Release\bf_intern_opensubdiv.lib
bf_intern_opencolorio.vcxproj -> C:\Users\user_name\ephestos\build_windows_Release_x64_vc15_Release\lib\Release\bf_intern_opencolorio.lib
bf_compositor.vcxproj -> C:\Users\user_name\ephestos\build_windows_Release_x64_vc15_Release\lib\Release\bf_compositor.lib
bf_gpu.vcxproj -> C:\Users\user_name\ephestos\build_windows_Release_x64_vc15_Release\lib\Release\bf_gpu.lib
bf_editor_datafiles.vcxproj -> C:\Users\user_name\ephestos\build_windows_Release_x64_vc15_Release\lib\Release\bf_editor_datafiles.lib
buildinfo.c
bf_draw.vcxproj -> C:\Users\user_name\ephestos\build_windows_Release_x64_vc15_Release\lib\Release\bf_draw.lib
extern_bullet.vcxproj -> C:\Users\user_name\ephestos\build_windows_Release_x64_vc15_Release\lib\Release\extern_bullet.lib
buildinfoobj.vcxproj -> C:\Users\user_name\ephestos\build_windows_Release_x64_vc15_Release\source\creator\buildinfoobj.dir\Release\buildinfoobj.lib
extern_clew.vcxproj -> C:\Users\user_name\ephestos\build_windows_Release_x64_vc15_Release\lib\Release\extern_clew.lib
extern_cuew.vcxproj -> C:\Users\user_name\ephestos\build_windows_Release_x64_vc15_Release\lib\Release\extern_cuew.lib
extern_curve_fit_nd.vcxproj -> C:\Users\user_name\ephestos\build_windows_Release_x64_vc15_Release\lib\Release\extern_curve_fit_nd.lib
extern_gflags.vcxproj -> C:\Users\user_name\ephestos\build_windows_Release_x64_vc15_Release\lib\Release\extern_gflags.lib
extern_ceres.vcxproj -> C:\Users\user_name\ephestos\build_windows_Release_x64_vc15_Release\lib\Release\extern_ceres.lib
extern_glew.vcxproj -> C:\Users\user_name\ephestos\build_windows_Release_x64_vc15_Release\lib\Release\extern_glew.lib
extern_glog.vcxproj -> C:\Users\user_name\ephestos\build_windows_Release_x64_vc15_Release\lib\Release\extern_glog.lib
extern_lzma.vcxproj -> C:\Users\user_name\ephestos\build_windows_Release_x64_vc15_Release\lib\Release\extern_lzma.lib
extern_minilzo.vcxproj -> C:\Users\user_name\ephestos\build_windows_Release_x64_vc15_Release\lib\Release\extern_minilzo.lib
extern_rangetree.vcxproj -> C:\Users\user_name\ephestos\build_windows_Release_x64_vc15_Release\lib\Release\extern_rangetree.lib
extern_wcwidth.vcxproj -> C:\Users\user_name\ephestos\build_windows_Release_x64_vc15_Release\lib\Release\extern_wcwidth.lib
cycles_cubin_cc.vcxproj -> C:\Users\user_name\ephestos\build_windows_Release_x64_vc15_Release\bin\Release\cycles_cubin_cc.exe
makesdna.vcxproj -> C:\Users\user_name\ephestos\build_windows_Release_x64_vc15_Release\bin\Release\makesdna.exe
bf_dna.vcxproj -> C:\Users\user_name\ephestos\build_windows_Release_x64_vc15_Release\lib\Release\bf_dna.lib
bf_blenloader.vcxproj -> C:\Users\user_name\ephestos\build_windows_Release_x64_vc15_Release\lib\Release\bf_blenloader.lib
makesrna.vcxproj -> C:\Users\user_name\ephestos\build_windows_Release_x64_vc15_Release\bin\Release\makesrna.exe
bf_rna.vcxproj -> C:\Users\user_name\ephestos\build_windows_Release_x64_vc15_Release\lib\Release\bf_rna.lib
bf_intern_cycles.vcxproj -> C:\Users\user_name\ephestos\build_windows_Release_x64_vc15_Release\lib\Release\bf_intern_cycles.lib
Build FAILED.
c:\users\user_name\ephestos\blender\source\blender\gpu\GPU_batch.h(85): warning C4094: untagged 'union' declared no symbols [C:\Users\user_name\ephestos\build_windows_Release_x64_vc15_Release\source\blender\editors\space_sequencer\bf_editor_space_sequencer.vcxproj]
c:\users\user_name\ephestos\blender\source\blender\gpu\GPU_batch.h(60): error C2332: 'struct': missing tag name [C:\Users\user_name\ephestos\build_windows_Release_x64_vc15_Release\source\blender\editors\space_sequencer\bf_editor_space_sequencer.vcxproj]
c:\users\user_name\ephestos\blender\source\blender\gpu\GPU_batch.h(60): error C2059: syntax error: 'type' [C:\Users\user_name\ephestos\build_windows_Release_x64_vc15_Release\source\blender\editors\space_sequencer\bf_editor_space_sequencer.vcxproj]
c:\users\user_name\ephestos\blender\source\blender\gpu\GPU_batch.h(91): error C2059: syntax error: '}' [C:\Users\user_name\ephestos\build_windows_Release_x64_vc15_Release\source\blender\editors\space_sequencer\bf_editor_space_sequencer.vcxproj]
c:\users\user_name\ephestos\blender\source\blender\gpu\GPU_batch.h(100): error C2143: syntax error: missing '{' before '*' [C:\Users\user_name\ephestos\build_windows_Release_x64_vc15_Release\source\blender\editors\space_sequencer\bf_editor_space_sequencer.vcxproj]
c:\users\user_name\ephestos\blender\source\blender\gpu\GPU_batch.h(100): error C4431: missing type specifier - int assumed. Note: C no longer supports default-int [C:\Users\user_name\ephestos\build_windows_Release_x64_vc15_Release\source\blender\editors\space_sequencer\bf_editor_space_sequencer.vcxproj]
c:\users\user_name\ephestos\blender\source\blender\gpu\GPU_batch.h(101): error C2143: syntax error: missing ')' before '*' [C:\Users\user_name\ephestos\build_windows_Release_x64_vc15_Release\source\blender\editors\space_sequencer\bf_editor_space_sequencer.vcxproj]
c:\users\user_name\ephestos\blender\source\blender\gpu\GPU_batch.h(101): error C2143: syntax error: missing '{' before '*' [C:\Users\user_name\ephestos\build_windows_Release_x64_vc15_Release\source\blender\editors\space_sequencer\bf_editor_space_sequencer.vcxproj]
c:\users\user_name\ephestos\blender\source\blender\gpu\GPU_batch.h(101): error C2059: syntax error: ',' [C:\Users\user_name\ephestos\build_windows_Release_x64_vc15_Release\source\blender\editors\space_sequencer\bf_editor_space_sequencer.vcxproj]
c:\users\user_name\ephestos\blender\source\blender\gpu\GPU_batch.h(101): error C2059: syntax error: ')' [C:\Users\user_name\ephestos\build_windows_Release_x64_vc15_Release\source\blender\editors\space_sequencer\bf_editor_space_sequencer.vcxproj]
c:\users\user_name\ephestos\blender\source\blender\gpu\GPU_batch.h(102): error C2143: syntax error: missing ')' before '*' [C:\Users\user_name\ephestos\build_windows_Release_x64_vc15_Release\source\blender\editors\space_sequencer\bf_editor_space_sequencer.vcxproj]
c:\users\user_name\ephestos\blender\source\blender\gpu\GPU_batch.h(102): error C2143: syntax error: missing '{' before '*' [C:\Users\user_name\ephestos\build_windows_Release_x64_vc15_Release\source\blender\editors\space_sequencer\bf_editor_space_sequencer.vcxproj]
c:\users\user_name\ephestos\blender\source\blender\gpu\GPU_batch.h(102): error C4431: missing type specifier - int assumed. Note: C no longer supports default-int [C:\Users\user_name\ephestos\build_windows_Release_x64_vc15_Release\source\blender\editors\space_sequencer\bf_editor_space_sequencer.vcxproj]
c:\users\user_name\ephestos\blender\source\blender\gpu\GPU_batch.h(102): error C2143: syntax error: missing ';' before '*' [C:\Users\user_name\ephestos\build_windows_Release_x64_vc15_Release\source\blender\editors\space_sequencer\bf_editor_space_sequencer.vcxproj]
c:\users\user_name\ephestos\blender\source\blender\gpu\GPU_batch.h(102): error C2059: syntax error: ')' [C:\Users\user_name\ephestos\build_windows_Release_x64_vc15_Release\source\blender\editors\space_sequencer\bf_editor_space_sequencer.vcxproj]
c:\users\user_name\ephestos\blender\source\blender\gpu\GPU_batch.h(109): error C2143: syntax error: missing ')' before '*' [C:\Users\user_name\ephestos\build_windows_Release_x64_vc15_Release\source\blender\editors\space_sequencer\bf_editor_space_sequencer.vcxproj]
c:\users\user_name\ephestos\blender\source\blender\gpu\GPU_batch.h(109): error C2143: syntax error: missing '{' before '*' [C:\Users\user_name\ephestos\build_windows_Release_x64_vc15_Release\source\blender\editors\space_sequencer\bf_editor_space_sequencer.vcxproj]
c:\users\user_name\ephestos\blender\source\blender\gpu\GPU_batch.h(109): error C2059: syntax error: ')' [C:\Users\user_name\ephestos\build_windows_Release_x64_vc15_Release\source\blender\editors\space_sequencer\bf_editor_space_sequencer.vcxproj]
c:\users\user_name\ephestos\blender\source\blender\gpu\GPU_batch.h(109): error C2059: syntax error: ';' [C:\Users\user_name\ephestos\build_windows_Release_x64_vc15_Release\source\blender\editors\space_sequencer\bf_editor_space_sequencer.vcxproj]
c:\users\user_name\ephestos\blender\source\blender\gpu\GPU_batch.h(110): error C2143: syntax error: missing ')' before '*' [C:\Users\user_name\ephestos\build_windows_Release_x64_vc15_Release\source\blender\editors\space_sequencer\bf_editor_space_sequencer.vcxproj]
c:\users\user_name\ephestos\blender\source\blender\gpu\GPU_batch.h(110): error C2143: syntax error: missing '{' before '*' [C:\Users\user_name\ephestos\build_windows_Release_x64_vc15_Release\source\blender\editors\space_sequencer\bf_editor_space_sequencer.vcxproj]
c:\users\user_name\ephestos\blender\source\blender\gpu\GPU_batch.h(110): error C2059: syntax error: ')' [C:\Users\user_name\ephestos\build_windows_Release_x64_vc15_Release\source\blender\editors\space_sequencer\bf_editor_space_sequencer.vcxproj]
c:\users\user_name\ephestos\blender\source\blender\gpu\GPU_batch.h(110): error C2059: syntax error: ';' [C:\Users\user_name\ephestos\build_windows_Release_x64_vc15_Release\source\blender\editors\space_sequencer\bf_editor_space_sequencer.vcxproj]
c:\users\user_name\ephestos\blender\source\blender\gpu\GPU_batch.h(112): error C2143: syntax error: missing ')' before '*' [C:\Users\user_name\ephestos\build_windows_Release_x64_vc15_Release\source\blender\editors\space_sequencer\bf_editor_space_sequencer.vcxproj]
c:\users\user_name\ephestos\blender\source\blender\gpu\GPU_batch.h(112): error C2143: syntax error: missing '{' before '*' [C:\Users\user_name\ephestos\build_windows_Release_x64_vc15_Release\source\blender\editors\space_sequencer\bf_editor_space_sequencer.vcxproj]
c:\users\user_name\ephestos\blender\source\blender\gpu\GPU_batch.h(112): error C2059: syntax error: ')' [C:\Users\user_name\ephestos\build_windows_Release_x64_vc15_Release\source\blender\editors\space_sequencer\bf_editor_space_sequencer.vcxproj]
c:\users\user_name\ephestos\blender\source\blender\gpu\GPU_batch.h(112): error C2059: syntax error: ';' [C:\Users\user_name\ephestos\build_windows_Release_x64_vc15_Release\source\blender\editors\space_sequencer\bf_editor_space_sequencer.vcxproj]
c:\users\user_name\ephestos\blender\source\blender\gpu\GPU_batch.h(114): error C2143: syntax error: missing ')' before '*' [C:\Users\user_name\ephestos\build_windows_Release_x64_vc15_Release\source\blender\editors\space_sequencer\bf_editor_space_sequencer.vcxproj]
c:\users\user_name\ephestos\blender\source\blender\gpu\GPU_batch.h(114): error C2143: syntax error: missing '{' before '*' [C:\Users\user_name\ephestos\build_windows_Release_x64_vc15_Release\source\blender\editors\space_sequencer\bf_editor_space_sequencer.vcxproj]
c:\users\user_name\ephestos\blender\source\blender\gpu\GPU_batch.h(114): error C2059: syntax error: ',' [C:\Users\user_name\ephestos\build_windows_Release_x64_vc15_Release\source\blender\editors\space_sequencer\bf_editor_space_sequencer.vcxproj]
c:\users\user_name\ephestos\blender\source\blender\gpu\GPU_batch.h(116): error C2143: syntax error: missing ')' before '*' [C:\Users\user_name\ephestos\build_windows_Release_x64_vc15_Release\source\blender\editors\space_sequencer\bf_editor_space_sequencer.vcxproj]
c:\users\user_name\ephestos\blender\source\blender\gpu\GPU_batch.h(116): error C2143: syntax error: missing '{' before '*' [C:\Users\user_name\ephestos\build_windows_Release_x64_vc15_Release\source\blender\editors\space_sequencer\bf_editor_space_sequencer.vcxproj]
c:\users\user_name\ephestos\blender\source\blender\gpu\GPU_batch.h(116): error C2059: syntax error: ',' [C:\Users\user_name\ephestos\build_windows_Release_x64_vc15_Release\source\blender\editors\space_sequencer\bf_editor_space_sequencer.vcxproj]
c:\users\user_name\ephestos\blender\source\blender\gpu\GPU_batch.h(116): error C2059: syntax error: ')' [C:\Users\user_name\ephestos\build_windows_Release_x64_vc15_Release\source\blender\editors\space_sequencer\bf_editor_space_sequencer.vcxproj]
c:\users\user_name\ephestos\blender\source\blender\gpu\GPU_batch.h(118): error C2143: syntax error: missing ')' before '*' [C:\Users\user_name\ephestos\build_windows_Release_x64_vc15_Release\source\blender\editors\space_sequencer\bf_editor_space_sequencer.vcxproj]
c:\users\user_name\ephestos\blender\source\blender\gpu\GPU_batch.h(118): error C2143: syntax error: missing '{' before '*' [C:\Users\user_name\ephestos\build_windows_Release_x64_vc15_Release\source\blender\editors\space_sequencer\bf_editor_space_sequencer.vcxproj]
c:\users\user_name\ephestos\blender\source\blender\gpu\GPU_batch.h(118): error C2059: syntax error: ',' [C:\Users\user_name\ephestos\build_windows_Release_x64_vc15_Release\source\blender\editors\space_sequencer\bf_editor_space_sequencer.vcxproj]
c:\users\user_name\ephestos\blender\source\blender\gpu\GPU_batch.h(118): error C2059: syntax error: ')' [C:\Users\user_name\ephestos\build_windows_Release_x64_vc15_Release\source\blender\editors\space_sequencer\bf_editor_space_sequencer.vcxproj]
c:\users\user_name\ephestos\blender\source\blender\gpu\GPU_batch.h(123): error C2143: syntax error: missing ')' before '*' [C:\Users\user_name\ephestos\build_windows_Release_x64_vc15_Release\source\blender\editors\space_sequencer\bf_editor_space_sequencer.vcxproj]
c:\users\user_name\ephestos\blender\source\blender\gpu\GPU_batch.h(123): error C2143: syntax error: missing '{' before '*' [C:\Users\user_name\ephestos\build_windows_Release_x64_vc15_Release\source\blender\editors\space_sequencer\bf_editor_space_sequencer.vcxproj]
c:\users\user_name\ephestos\blender\source\blender\gpu\GPU_batch.h(123): error C2059: syntax error: ',' [C:\Users\user_name\ephestos\build_windows_Release_x64_vc15_Release\source\blender\editors\space_sequencer\bf_editor_space_sequencer.vcxproj]
c:\users\user_name\ephestos\blender\source\blender\gpu\GPU_batch.h(123): error C2059: syntax error: ')' [C:\Users\user_name\ephestos\build_windows_Release_x64_vc15_Release\source\blender\editors\space_sequencer\bf_editor_space_sequencer.vcxproj]
c:\users\user_name\ephestos\blender\source\blender\gpu\GPU_batch.h(124): error C2143: syntax error: missing ')' before '*' [C:\Users\user_name\ephestos\build_windows_Release_x64_vc15_Release\source\blender\editors\space_sequencer\bf_editor_space_sequencer.vcxproj]
c:\users\user_name\ephestos\blender\source\blender\gpu\GPU_batch.h(124): error C2143: syntax error: missing '{' before '*' [C:\Users\user_name\ephestos\build_windows_Release_x64_vc15_Release\source\blender\editors\space_sequencer\bf_editor_space_sequencer.vcxproj]
c:\users\user_name\ephestos\blender\source\blender\gpu\GPU_batch.h(124): error C2059: syntax error: ',' [C:\Users\user_name\ephestos\build_windows_Release_x64_vc15_Release\source\blender\editors\space_sequencer\bf_editor_space_sequencer.vcxproj]
c:\users\user_name\ephestos\blender\source\blender\gpu\GPU_batch.h(124): error C2059: syntax error: ')' [C:\Users\user_name\ephestos\build_windows_Release_x64_vc15_Release\source\blender\editors\space_sequencer\bf_editor_space_sequencer.vcxproj]
c:\users\user_name\ephestos\blender\source\blender\gpu\GPU_batch.h(125): error C2143: syntax error: missing ')' before '*' [C:\Users\user_name\ephestos\build_windows_Release_x64_vc15_Release\source\blender\editors\space_sequencer\bf_editor_space_sequencer.vcxproj]
c:\users\user_name\ephestos\blender\source\blender\gpu\GPU_batch.h(125): error C2143: syntax error: missing '{' before '*' [C:\Users\user_name\ephestos\build_windows_Release_x64_vc15_Release\source\blender\editors\space_sequencer\bf_editor_space_sequencer.vcxproj]
c:\users\user_name\ephestos\blender\source\blender\gpu\GPU_batch.h(125): error C2059: syntax error: ',' [C:\Users\user_name\ephestos\build_windows_Release_x64_vc15_Release\source\blender\editors\space_sequencer\bf_editor_space_sequencer.vcxproj]
c:\users\user_name\ephestos\blender\source\blender\gpu\GPU_batch.h(125): error C2059: syntax error: ')' [C:\Users\user_name\ephestos\build_windows_Release_x64_vc15_Release\source\blender\editors\space_sequencer\bf_editor_space_sequencer.vcxproj]
c:\users\user_name\ephestos\blender\source\blender\gpu\GPU_batch.h(127): error C2143: syntax error: missing ')' before '*' [C:\Users\user_name\ephestos\build_windows_Release_x64_vc15_Release\source\blender\editors\space_sequencer\bf_editor_space_sequencer.vcxproj]
c:\users\user_name\ephestos\blender\source\blender\gpu\GPU_batch.h(127): error C2143: syntax error: missing '{' before '*' [C:\Users\user_name\ephestos\build_windows_Release_x64_vc15_Release\source\blender\editors\space_sequencer\bf_editor_space_sequencer.vcxproj]
c:\users\user_name\ephestos\blender\source\blender\gpu\GPU_batch.h(127): error C4431: missing type specifier - int assumed. Note: C no longer supports default-int [C:\Users\user_name\ephestos\build_windows_Release_x64_vc15_Release\source\blender\editors\space_sequencer\bf_editor_space_sequencer.vcxproj]
c:\users\user_name\ephestos\blender\source\blender\gpu\GPU_batch.h(127): error C2370: 'eGPUBuiltinShader': redefinition; different storage class [C:\Users\user_name\ephestos\build_windows_Release_x64_vc15_Release\source\blender\editors\space_sequencer\bf_editor_space_sequencer.vcxproj]
c:\users\user_name\ephestos\blender\source\blender\gpu\GPU_batch.h(127): error C2146: syntax error: missing ';' before identifier 'shader_id' [C:\Users\user_name\ephestos\build_windows_Release_x64_vc15_Release\source\blender\editors\space_sequencer\bf_editor_space_sequencer.vcxproj]
c:\users\user_name\ephestos\blender\source\blender\gpu\GPU_batch.h(127): error C2059: syntax error: ')' [C:\Users\user_name\ephestos\build_windows_Release_x64_vc15_Release\source\blender\editors\space_sequencer\bf_editor_space_sequencer.vcxproj]
c:\users\user_name\ephestos\blender\source\blender\gpu\GPU_batch.h(129): error C2143: syntax error: missing ')' before '*' [C:\Users\user_name\ephestos\build_windows_Release_x64_vc15_Release\source\blender\editors\space_sequencer\bf_editor_space_sequencer.vcxproj]
c:\users\user_name\ephestos\blender\source\blender\gpu\GPU_batch.h(129): error C2143: syntax error: missing '{' before '*' [C:\Users\user_name\ephestos\build_windows_Release_x64_vc15_Release\source\blender\editors\space_sequencer\bf_editor_space_sequencer.vcxproj]
c:\users\user_name\ephestos\blender\source\blender\gpu\GPU_batch.h(129): error C4431: missing type specifier - int assumed. Note: C no longer supports default-int [C:\Users\user_name\ephestos\build_windows_Release_x64_vc15_Release\source\blender\editors\space_sequencer\bf_editor_space_sequencer.vcxproj]
c:\users\user_name\ephestos\blender\source\blender\gpu\GPU_batch.h(129): error C2370: 'eGPUBuiltinShader': redefinition; different storage class [C:\Users\user_name\ephestos\build_windows_Release_x64_vc15_Release\source\blender\editors\space_sequencer\bf_editor_space_sequencer.vcxproj]
c:\users\user_name\ephestos\blender\source\blender\gpu\GPU_batch.h(129): error C2146: syntax error: missing ';' before identifier 'shader_id' [C:\Users\user_name\ephestos\build_windows_Release_x64_vc15_Release\source\blender\editors\space_sequencer\bf_editor_space_sequencer.vcxproj]
c:\users\user_name\ephestos\blender\source\blender\gpu\GPU_batch.h(129): error C2370: 'eGPUShaderConfig': redefinition; different storage class [C:\Users\user_name\ephestos\build_windows_Release_x64_vc15_Release\source\blender\editors\space_sequencer\bf_editor_space_sequencer.vcxproj]
c:\users\user_name\ephestos\blender\source\blender\gpu\GPU_batch.h(129): error C2146: syntax error: missing ';' before identifier 'sh_cfg' [C:\Users\user_name\ephestos\build_windows_Release_x64_vc15_Release\source\blender\editors\space_sequencer\bf_editor_space_sequencer.vcxproj]
c:\users\user_name\ephestos\blender\source\blender\gpu\GPU_batch.h(129): error C2059: syntax error: ')' [C:\Users\user_name\ephestos\build_windows_Release_x64_vc15_Release\source\blender\editors\space_sequencer\bf_editor_space_sequencer.vcxproj]
c:\users\user_name\ephestos\blender\source\blender\gpu\GPU_batch.h(133): error C2143: syntax error: missing ')' before '*' [C:\Users\user_name\ephestos\build_windows_Release_x64_vc15_Release\source\blender\editors\space_sequencer\bf_editor_space_sequencer.vcxproj]
c:\users\user_name\ephestos\blender\source\blender\gpu\GPU_batch.h(133): error C2143: syntax error: missing '{' before '*' [C:\Users\user_name\ephestos\build_windows_Release_x64_vc15_Release\source\blender\editors\space_sequencer\bf_editor_space_sequencer.vcxproj]
c:\users\user_name\ephestos\blender\source\blender\gpu\GPU_batch.h(133): error C2059: syntax error: ')' [C:\Users\user_name\ephestos\build_windows_Release_x64_vc15_Release\source\blender\editors\space_sequencer\bf_editor_space_sequencer.vcxproj]
c:\users\user_name\ephestos\blender\source\blender\gpu\GPU_batch.h(133): error C2059: syntax error: ';' [C:\Users\user_name\ephestos\build_windows_Release_x64_vc15_Release\source\blender\editors\space_sequencer\bf_editor_space_sequencer.vcxproj]
c:\users\user_name\ephestos\blender\source\blender\gpu\GPU_batch.h(134): error C2143: syntax error: missing ')' before '*' [C:\Users\user_name\ephestos\build_windows_Release_x64_vc15_Release\source\blender\editors\space_sequencer\bf_editor_space_sequencer.vcxproj]
c:\users\user_name\ephestos\blender\source\blender\gpu\GPU_batch.h(134): error C2143: syntax error: missing '{' before '*' [C:\Users\user_name\ephestos\build_windows_Release_x64_vc15_Release\source\blender\editors\space_sequencer\bf_editor_space_sequencer.vcxproj]
c:\users\user_name\ephestos\blender\source\blender\gpu\GPU_batch.h(134): error C2059: syntax error: ')' [C:\Users\user_name\ephestos\build_windows_Release_x64_vc15_Release\source\blender\editors\space_sequencer\bf_editor_space_sequencer.vcxproj]
c:\users\user_name\ephestos\blender\source\blender\gpu\GPU_batch.h(134): error C2059: syntax error: ';' [C:\Users\user_name\ephestos\build_windows_Release_x64_vc15_Release\source\blender\editors\space_sequencer\bf_editor_space_sequencer.vcxproj]
c:\users\user_name\ephestos\blender\source\blender\gpu\GPU_batch.h(136): error C2143: syntax error: missing ')' before '*' [C:\Users\user_name\ephestos\build_windows_Release_x64_vc15_Release\source\blender\editors\space_sequencer\bf_editor_space_sequencer.vcxproj]
c:\users\user_name\ephestos\blender\source\blender\gpu\GPU_batch.h(136): error C2143: syntax error: missing '{' before '*' [C:\Users\user_name\ephestos\build_windows_Release_x64_vc15_Release\source\blender\editors\space_sequencer\bf_editor_space_sequencer.vcxproj]
c:\users\user_name\ephestos\blender\source\blender\gpu\GPU_batch.h(136): error C2059: syntax error: ',' [C:\Users\user_name\ephestos\build_windows_Release_x64_vc15_Release\source\blender\editors\space_sequencer\bf_editor_space_sequencer.vcxproj]
c:\users\user_name\ephestos\blender\source\blender\gpu\GPU_batch.h(136): error C2059: syntax error: ')' [C:\Users\user_name\ephestos\build_windows_Release_x64_vc15_Release\source\blender\editors\space_sequencer\bf_editor_space_sequencer.vcxproj]
c:\users\user_name\ephestos\blender\source\blender\gpu\GPU_batch.h(137): error C2143: syntax error: missing ')' before '*' [C:\Users\user_name\ephestos\build_windows_Release_x64_vc15_Release\source\blender\editors\space_sequencer\bf_editor_space_sequencer.vcxproj]
c:\users\user_name\ephestos\blender\source\blender\gpu\GPU_batch.h(137): error C2143: syntax error: missing '{' before '*' [C:\Users\user_name\ephestos\build_windows_Release_x64_vc15_Release\source\blender\editors\space_sequencer\bf_editor_space_sequencer.vcxproj]
c:\users\user_name\ephestos\blender\source\blender\gpu\GPU_batch.h(137): error C2059: syntax error: ',' [C:\Users\user_name\ephestos\build_windows_Release_x64_vc15_Release\source\blender\editors\space_sequencer\bf_editor_space_sequencer.vcxproj]
c:\users\user_name\ephestos\blender\source\blender\gpu\GPU_batch.h(137): error C2059: syntax error: ')' [C:\Users\user_name\ephestos\build_windows_Release_x64_vc15_Release\source\blender\editors\space_sequencer\bf_editor_space_sequencer.vcxproj]
c:\users\user_name\ephestos\blender\source\blender\gpu\GPU_batch.h(138): error C2143: syntax error: missing ')' before '*' [C:\Users\user_name\ephestos\build_windows_Release_x64_vc15_Release\source\blender\editors\space_sequencer\bf_editor_space_sequencer.vcxproj]
c:\users\user_name\ephestos\blender\source\blender\gpu\GPU_batch.h(138): error C2143: syntax error: missing '{' before '*' [C:\Users\user_name\ephestos\build_windows_Release_x64_vc15_Release\source\blender\editors\space_sequencer\bf_editor_space_sequencer.vcxproj]
c:\users\user_name\ephestos\blender\source\blender\gpu\GPU_batch.h(138): error C2059: syntax error: ',' [C:\Users\user_name\ephestos\build_windows_Release_x64_vc15_Release\source\blender\editors\space_sequencer\bf_editor_space_sequencer.vcxproj]
c:\users\user_name\ephestos\blender\source\blender\gpu\GPU_batch.h(138): error C2059: syntax error: ')' [C:\Users\user_name\ephestos\build_windows_Release_x64_vc15_Release\source\blender\editors\space_sequencer\bf_editor_space_sequencer.vcxproj]
c:\users\user_name\ephestos\blender\source\blender\gpu\GPU_batch.h(139): error C2143: syntax error: missing ')' before '*' [C:\Users\user_name\ephestos\build_windows_Release_x64_vc15_Release\source\blender\editors\space_sequencer\bf_editor_space_sequencer.vcxproj]
c:\users\user_name\ephestos\blender\source\blender\gpu\GPU_batch.h(139): error C2143: syntax error: missing '{' before '*' [C:\Users\user_name\ephestos\build_windows_Release_x64_vc15_Release\source\blender\editors\space_sequencer\bf_editor_space_sequencer.vcxproj]
c:\users\user_name\ephestos\blender\source\blender\gpu\GPU_batch.h(139): error C2059: syntax error: ',' [C:\Users\user_name\ephestos\build_windows_Release_x64_vc15_Release\source\blender\editors\space_sequencer\bf_editor_space_sequencer.vcxproj]
c:\users\user_name\ephestos\blender\source\blender\gpu\GPU_batch.h(139): error C2059: syntax error: ')' [C:\Users\user_name\ephestos\build_windows_Release_x64_vc15_Release\source\blender\editors\space_sequencer\bf_editor_space_sequencer.vcxproj]
c:\users\user_name\ephestos\blender\source\blender\gpu\GPU_batch.h(140): error C2143: syntax error: missing ')' before '*' [C:\Users\user_name\ephestos\build_windows_Release_x64_vc15_Release\source\blender\editors\space_sequencer\bf_editor_space_sequencer.vcxproj]
c:\users\user_name\ephestos\blender\source\blender\gpu\GPU_batch.h(140): error C2143: syntax error: missing '{' before '*' [C:\Users\user_name\ephestos\build_windows_Release_x64_vc15_Release\source\blender\editors\space_sequencer\bf_editor_space_sequencer.vcxproj]
c:\users\user_name\ephestos\blender\source\blender\gpu\GPU_batch.h(140): error C2059: syntax error: ',' [C:\Users\user_name\ephestos\build_windows_Release_x64_vc15_Release\source\blender\editors\space_sequencer\bf_editor_space_sequencer.vcxproj]
c:\users\user_name\ephestos\blender\source\blender\gpu\GPU_batch.h(140): error C2059: syntax error: ')' [C:\Users\user_name\ephestos\build_windows_Release_x64_vc15_Release\source\blender\editors\space_sequencer\bf_editor_space_sequencer.vcxproj]
c:\users\user_name\ephestos\blender\source\blender\gpu\GPU_batch.h(141): error C2143: syntax error: missing ')' before '*' [C:\Users\user_name\ephestos\build_windows_Release_x64_vc15_Release\source\blender\editors\space_sequencer\bf_editor_space_sequencer.vcxproj]
c:\users\user_name\ephestos\blender\source\blender\gpu\GPU_batch.h(141): error C2143: syntax error: missing '{' before '*' [C:\Users\user_name\ephestos\build_windows_Release_x64_vc15_Release\source\blender\editors\space_sequencer\bf_editor_space_sequencer.vcxproj]
c:\users\user_name\ephestos\blender\source\blender\gpu\GPU_batch.h(141): error C2059: syntax error: ',' [C:\Users\user_name\ephestos\build_windows_Release_x64_vc15_Release\source\blender\editors\space_sequencer\bf_editor_space_sequencer.vcxproj]
c:\users\user_name\ephestos\blender\source\blender\gpu\GPU_batch.h(141): error C2059: syntax error: ')' [C:\Users\user_name\ephestos\build_windows_Release_x64_vc15_Release\source\blender\editors\space_sequencer\bf_editor_space_sequencer.vcxproj]
c:\users\user_name\ephestos\blender\source\blender\gpu\GPU_batch.h(142): error C2143: syntax error: missing ')' before '*' [C:\Users\user_name\ephestos\build_windows_Release_x64_vc15_Release\source\blender\editors\space_sequencer\bf_editor_space_sequencer.vcxproj]
c:\users\user_name\ephestos\blender\source\blender\gpu\GPU_batch.h(142): error C2143: syntax error: missing '{' before '*' [C:\Users\user_name\ephestos\build_windows_Release_x64_vc15_Release\source\blender\editors\space_sequencer\bf_editor_space_sequencer.vcxproj]
c:\users\user_name\ephestos\blender\source\blender\gpu\GPU_batch.h(142): error C2059: syntax error: ',' [C:\Users\user_name\ephestos\build_windows_Release_x64_vc15_Release\source\blender\editors\space_sequencer\bf_editor_space_sequencer.vcxproj]
c:\users\user_name\ephestos\blender\source\blender\gpu\GPU_batch.h(142): error C2059: syntax error: ')' [C:\Users\user_name\ephestos\build_windows_Release_x64_vc15_Release\source\blender\editors\space_sequencer\bf_editor_space_sequencer.vcxproj]
c:\users\user_name\ephestos\blender\source\blender\gpu\GPU_batch.h(143): error C2143: syntax error: missing ')' before '*' [C:\Users\user_name\ephestos\build_windows_Release_x64_vc15_Release\source\blender\editors\space_sequencer\bf_editor_space_sequencer.vcxproj]
c:\users\user_name\ephestos\blender\source\blender\gpu\GPU_batch.h(143): error C2143: syntax error: missing '{' before '*' [C:\Users\user_name\ephestos\build_windows_Release_x64_vc15_Release\source\blender\editors\space_sequencer\bf_editor_space_sequencer.vcxproj]
c:\users\user_name\ephestos\blender\source\blender\gpu\GPU_batch.h(143): error C2059: syntax error: ',' [C:\Users\user_name\ephestos\build_windows_Release_x64_vc15_Release\source\blender\editors\space_sequencer\bf_editor_space_sequencer.vcxproj]
c:\users\user_name\ephestos\blender\source\blender\gpu\GPU_batch.h(143): error C2059: syntax error: ')' [C:\Users\user_name\ephestos\build_windows_Release_x64_vc15_Release\source\blender\editors\space_sequencer\bf_editor_space_sequencer.vcxproj]
c:\users\user_name\ephestos\blender\source\blender\gpu\GPU_batch.h(144): error C2143: syntax error: missing ')' before '*' [C:\Users\user_name\ephestos\build_windows_Release_x64_vc15_Release\source\blender\editors\space_sequencer\bf_editor_space_sequencer.vcxproj]
c:\users\user_name\ephestos\blender\source\blender\gpu\GPU_batch.h(144): error C2143: syntax error: missing '{' before '*' [C:\Users\user_name\ephestos\build_windows_Release_x64_vc15_Release\source\blender\editors\space_sequencer\bf_editor_space_sequencer.vcxproj]
c:\users\user_name\ephestos\blender\source\blender\gpu\GPU_batch.h(144): fatal error C1003: error count exceeds 100; stopping compilation [C:\Users\user_name\ephestos\build_windows_Release_x64_vc15_Release\source\blender\editors\space_sequencer\bf_editor_space_sequencer.vcxproj]
1 Warning(s)
106 Error(s)
Time Elapsed 00:00:39.71
Sign up for free to join this conversation on GitHub. Already have an account? Sign in to comment
You can’t perform that action at this time.