Skip to content

Instantly share code, notes, and snippets.

@kohsuke kohsuke/release.log
Created Aug 6, 2019

Embed
What would you like to do?
2.188 stuck
% mvn test -Dtest=jenkins.triggers.TriggerTest
[WARNING]
[WARNING] Some problems were encountered while building the effective settings
[WARNING] 'servers.server.id' must be unique but found duplicate server with id jenkinsci-cert-snapshot @ /home/kohsuke/.m2/settings.xml
[WARNING]
[WARNING]
[WARNING] Some problems were encountered while building the effective settings
[WARNING] 'servers.server.id' must be unique but found duplicate server with id jenkinsci-cert-snapshot @ /home/kohsuke/.m2/settings.xml
[WARNING]
[INFO] Scanning for projects...
[INFO]
[INFO] ------------------< org.jenkins-ci.main:jenkins-test >------------------
[INFO] Building Tests for Jenkins core 2.188
[INFO] --------------------------------[ jar ]---------------------------------
[INFO]
[INFO] --- maven-enforcer-plugin:3.0.0-M2:display-info (display-info) @ jenkins-test ---
[INFO] Maven Version: 3.5.4
[INFO] JDK Version: 1.8.0_144 normalized as: 1.8.0-144
[INFO] OS Info: Arch: amd64 Family: unix Name: linux Version: 4.4.0-150-generic
[INFO]
[INFO] --- maven-enforcer-plugin:3.0.0-M2:enforce (display-info) @ jenkins-test ---
[INFO] Ignoring requireUpperBoundDeps in org.apache.maven:maven-embedder
[INFO] Ignoring requireUpperBoundDeps in org.codehaus.plexus:plexus-classworlds
[INFO] Ignoring requireUpperBoundDeps in org.apache.maven:maven-core
[INFO] Ignoring requireUpperBoundDeps in org.apache.maven:maven-aether-provider
[INFO] Ignoring requireUpperBoundDeps in org.codehaus.plexus:plexus-utils
[INFO]
[INFO] --- maven-enforcer-plugin:3.0.0-M2:enforce (enforce-banned-dependencies) @ jenkins-test ---
[INFO] Ignoring requireUpperBoundDeps in org.apache.maven:maven-embedder
[INFO] Ignoring requireUpperBoundDeps in org.codehaus.plexus:plexus-classworlds
[INFO] Ignoring requireUpperBoundDeps in org.apache.maven:maven-core
[INFO] Ignoring requireUpperBoundDeps in org.apache.maven:maven-aether-provider
[INFO] Ignoring requireUpperBoundDeps in org.codehaus.plexus:plexus-utils
[INFO]
[INFO] --- maven-remote-resources-plugin:1.6.0:process (default) @ jenkins-test ---
[INFO] Preparing remote bundle org.jvnet.hudson:license:1.0
[INFO] Copying 0 resource from 1 bundle.
[INFO]
[INFO] --- maven-resources-plugin:3.1.0:resources (default-resources) @ jenkins-test ---
[INFO] Using 'UTF-8' encoding to copy filtered resources.
[INFO] skip non existing resourceDirectory /files/kohsuke/ws/jenkins/rc/test/src/main/resources
[INFO] skip non existing resourceDirectory /files/kohsuke/ws/jenkins/rc/test/src/filter/resources
[INFO]
[INFO] --- flatten-maven-plugin:1.0.1:flatten (flatten) @ jenkins-test ---
[INFO] Generating flattened POM of project org.jenkins-ci.main:jenkins-test:jar:2.188...
[INFO]
[INFO] --- maven-compiler-plugin:3.8.0:compile (default-compile) @ jenkins-test ---
[INFO] No sources to compile
[INFO]
[INFO] --- animal-sniffer-maven-plugin:1.17:check (check) @ jenkins-test ---
[INFO] Checking unresolved references to org.codehaus.mojo.signature:java18:1.0
[INFO]
[INFO] --- animal-sniffer-maven-plugin:1.17:check (default) @ jenkins-test ---
[INFO] Checking unresolved references to org.codehaus.mojo.signature:java18:1.0
[INFO]
[INFO] --- maven-dependency-plugin:3.1.1:copy (old-remoting-for-test) @ jenkins-test ---
[INFO] Configured Artifact: org.jenkins-ci.main:remoting:3.4:jar
[INFO] org.jenkins-ci.main:remoting:3.4:jar already exists in /files/kohsuke/ws/jenkins/rc/test/target/classes/old-remoting
[INFO]
[INFO] --- maven-resources-plugin:3.1.0:testResources (default-testResources) @ jenkins-test ---
[INFO] Using 'UTF-8' encoding to copy filtered resources.
[INFO] Copying 295 resources
[INFO]
[INFO] --- maven-compiler-plugin:3.8.0:testCompile (default-testCompile) @ jenkins-test ---
[INFO] Changes detected - recompiling the module!
[INFO] Compiling 357 source files to /files/kohsuke/ws/jenkins/rc/test/target/test-classes
[INFO]
[INFO] --- maven-surefire-plugin:2.20:test (default-test) @ jenkins-test ---
[INFO]
[INFO] -------------------------------------------------------
[INFO] T E S T S
[INFO] -------------------------------------------------------
[INFO] Running jenkins.triggers.TriggerTest
=== Starting testSlowTriggerAdminMonitorMaxExtries(jenkins.triggers.TriggerTest)
0.033 [id=15] INFO o.jvnet.hudson.test.WarExploder#explode: Using jenkins.war resources from /files/kohsuke/ws/jenkins/rc/war/target/jenkins
0.164 [id=15] INFO o.jvnet.hudson.test.JenkinsRule#createWebServer: Running on http://localhost:36483/jenkins/
1.029 [id=23] INFO jenkins.InitReactorRunner$1#onAttained: Started initialization
1.045 [id=21] INFO jenkins.InitReactorRunner$1#onAttained: Listed all plugins
2.232 [id=29] INFO jenkins.InitReactorRunner$1#onAttained: Prepared all plugins
2.241 [id=35] INFO jenkins.InitReactorRunner$1#onAttained: Started all plugins
2.313 [id=31] INFO jenkins.InitReactorRunner$1#onAttained: Augmented all extensions
3.277 [id=31] INFO h.ExtensionFinder$GuiceFinder$FaultTolerantScope$1#error: Failed to instantiate optional component com.cloudbees.hudson.plugins.folder.properties.FolderCredentialsProvider$FolderCredentialsProperty$DescriptorImpl; skipping
3.334 [id=24] INFO jenkins.InitReactorRunner$1#onAttained: Loaded all jobs
3.466 [id=24] INFO jenkins.InitReactorRunner$1#onAttained: Completed initialization
8.646 [id=15] INFO jenkins.model.Jenkins#cleanUp: Stopping Jenkins
8.806 [id=15] INFO jenkins.model.Jenkins#cleanUp: Jenkins stopped
=== Starting testTimerSpentToMuchTime(jenkins.triggers.TriggerTest)
0.015 [id=76] INFO o.jvnet.hudson.test.JenkinsRule#createWebServer: Running on http://localhost:35377/jenkins/
0.050 [id=83] INFO jenkins.InitReactorRunner$1#onAttained: Started initialization
0.056 [id=97] INFO jenkins.InitReactorRunner$1#onAttained: Listed all plugins
0.155 [id=83] INFO jenkins.InitReactorRunner$1#onAttained: Prepared all plugins
0.157 [id=85] INFO jenkins.InitReactorRunner$1#onAttained: Started all plugins
0.159 [id=89] INFO jenkins.InitReactorRunner$1#onAttained: Augmented all extensions
0.531 [id=82] INFO h.ExtensionFinder$GuiceFinder$FaultTolerantScope$1#error: Failed to instantiate optional component com.cloudbees.hudson.plugins.folder.properties.FolderCredentialsProvider$FolderCredentialsProperty$DescriptorImpl; skipping
0.538 [id=87] INFO jenkins.InitReactorRunner$1#onAttained: Loaded all jobs
0.622 [id=88] INFO jenkins.InitReactorRunner$1#onAttained: Completed initialization
89.649 [id=102] WARNING hudson.triggers.Trigger#checkTriggers: Trigger jenkins.triggers.TriggerTest$BadTimerTrigger.run() triggered by hudson.model.FreeStyleProject@1a9c29c6[test] spent too much time (30 sec) in its execution, other timers can be affected
89.649 [id=102] WARNING hudson.triggers.Trigger#checkTriggers: Trigger jenkins.triggers.TriggerTest$BadTimerTrigger.run() triggered by hudson.model.FreeStyleProject@1a9c29c6[test] spent too much time (30 sec) in its execution, other timers can be affected
89.803 [id=99] INFO hudson.model.Run#execute: test #1 main build action completed: SUCCESS
Jenkins is running at http://localhost:35377/jenkins/
[INFO]
[INFO] Results:
[INFO]
[INFO] Tests run: 0, Failures: 0, Errors: 0, Skipped: 0
[INFO]
[INFO] ------------------------------------------------------------------------
[INFO] BUILD FAILURE
[INFO] ------------------------------------------------------------------------
[INFO] Total time: 02:12 min
[INFO] Finished at: 2019-08-05T21:48:52-07:00
[INFO] ------------------------------------------------------------------------
[ERROR] Failed to execute goal org.apache.maven.plugins:maven-surefire-plugin:2.20:test (default-test) on project jenkins-test: There are test failures.
[ERROR]
[ERROR] Please refer to /files/kohsuke/ws/jenkins/rc/test/target/surefire-reports for the individual test results.
[ERROR] Please refer to dump files (if any exist) [date]-jvmRun[N].dump, [date].dumpstream and [date]-jvmRun[N].dumpstream.
[ERROR] ExecutionException The forked VM terminated without properly saying goodbye. VM crash or System.exit called?
[ERROR] Command was /bin/sh -c cd /files/kohsuke/ws/jenkins/rc/test && /usr/local/jdk1.8.0_144/jre/bin/java -Dfile.encoding=UTF-8 -Xmx1g -Djdk.net.URLClassPath.disableClassPathURLCheck=true -jar /files/kohsuke/ws/jenkins/rc/test/target/surefire/surefirebooter406266860425408248.jar /files/kohsuke/ws/jenkins/rc/test/target/surefire 2019-08-05T21-46-51_611-jvmRun1 surefire7647335185900830238tmp surefire_0594069111100091332tmp
[ERROR] Error occurred in starting fork, check output in log
[ERROR] Process Exit Code: 1
[ERROR] Crashed tests:
[ERROR] jenkins.triggers.TriggerTest
[ERROR] org.apache.maven.surefire.booter.SurefireBooterForkException: ExecutionException The forked VM terminated without properly saying goodbye. VM crash or System.exit called?
[ERROR] Command was /bin/sh -c cd /files/kohsuke/ws/jenkins/rc/test && /usr/local/jdk1.8.0_144/jre/bin/java -Dfile.encoding=UTF-8 -Xmx1g -Djdk.net.URLClassPath.disableClassPathURLCheck=true -jar /files/kohsuke/ws/jenkins/rc/test/target/surefire/surefirebooter406266860425408248.jar /files/kohsuke/ws/jenkins/rc/test/target/surefire 2019-08-05T21-46-51_611-jvmRun1 surefire7647335185900830238tmp surefire_0594069111100091332tmp
[ERROR] Error occurred in starting fork, check output in log
[ERROR] Process Exit Code: 1
[ERROR] Crashed tests:
[ERROR] jenkins.triggers.TriggerTest
[ERROR] at org.apache.maven.plugin.surefire.booterclient.ForkStarter.awaitResultsDone(ForkStarter.java:494)
[ERROR] at org.apache.maven.plugin.surefire.booterclient.ForkStarter.runSuitesForkPerTestSet(ForkStarter.java:441)
[ERROR] at org.apache.maven.plugin.surefire.booterclient.ForkStarter.run(ForkStarter.java:292)
[ERROR] at org.apache.maven.plugin.surefire.booterclient.ForkStarter.run(ForkStarter.java:243)
[ERROR] at org.apache.maven.plugin.surefire.AbstractSurefireMojo.executeProvider(AbstractSurefireMojo.java:1077)
[ERROR] at org.apache.maven.plugin.surefire.AbstractSurefireMojo.executeAfterPreconditionsChecked(AbstractSurefireMojo.java:907)
[ERROR] at org.apache.maven.plugin.surefire.AbstractSurefireMojo.execute(AbstractSurefireMojo.java:785)
[ERROR] at org.apache.maven.plugin.DefaultBuildPluginManager.executeMojo(DefaultBuildPluginManager.java:137)
[ERROR] at org.apache.maven.lifecycle.internal.MojoExecutor.execute(MojoExecutor.java:208)
[ERROR] at org.apache.maven.lifecycle.internal.MojoExecutor.execute(MojoExecutor.java:154)
[ERROR] at org.apache.maven.lifecycle.internal.MojoExecutor.execute(MojoExecutor.java:146)
[ERROR] at org.apache.maven.lifecycle.internal.LifecycleModuleBuilder.buildProject(LifecycleModuleBuilder.java:117)
[ERROR] at org.apache.maven.lifecycle.internal.LifecycleModuleBuilder.buildProject(LifecycleModuleBuilder.java:81)
[ERROR] at org.apache.maven.lifecycle.internal.builder.singlethreaded.SingleThreadedBuilder.build(SingleThreadedBuilder.java:56)
[ERROR] at org.apache.maven.lifecycle.internal.LifecycleStarter.execute(LifecycleStarter.java:128)
[ERROR] at org.apache.maven.DefaultMaven.doExecute(DefaultMaven.java:305)
[ERROR] at org.apache.maven.DefaultMaven.doExecute(DefaultMaven.java:192)
[ERROR] at org.apache.maven.DefaultMaven.execute(DefaultMaven.java:105)
[ERROR] at org.apache.maven.cli.MavenCli.execute(MavenCli.java:954)
[ERROR] at org.apache.maven.cli.MavenCli.doMain(MavenCli.java:288)
[ERROR] at org.apache.maven.cli.MavenCli.main(MavenCli.java:192)
[ERROR] at sun.reflect.NativeMethodAccessorImpl.invoke0(Native Method)
[ERROR] at sun.reflect.NativeMethodAccessorImpl.invoke(NativeMethodAccessorImpl.java:62)
[ERROR] at sun.reflect.DelegatingMethodAccessorImpl.invoke(DelegatingMethodAccessorImpl.java:43)
[ERROR] at java.lang.reflect.Method.invoke(Method.java:498)
[ERROR] at org.codehaus.plexus.classworlds.launcher.Launcher.launchEnhanced(Launcher.java:289)
[ERROR] at org.codehaus.plexus.classworlds.launcher.Launcher.launch(Launcher.java:229)
[ERROR] at org.codehaus.plexus.classworlds.launcher.Launcher.mainWithExitCode(Launcher.java:415)
[ERROR] at org.codehaus.plexus.classworlds.launcher.Launcher.main(Launcher.java:356)
[ERROR] Caused by: org.apache.maven.surefire.booter.SurefireBooterForkException: The forked VM terminated without properly saying goodbye. VM crash or System.exit called?
[ERROR] Command was /bin/sh -c cd /files/kohsuke/ws/jenkins/rc/test && /usr/local/jdk1.8.0_144/jre/bin/java -Dfile.encoding=UTF-8 -Xmx1g -Djdk.net.URLClassPath.disableClassPathURLCheck=true -jar /files/kohsuke/ws/jenkins/rc/test/target/surefire/surefirebooter406266860425408248.jar /files/kohsuke/ws/jenkins/rc/test/target/surefire 2019-08-05T21-46-51_611-jvmRun1 surefire7647335185900830238tmp surefire_0594069111100091332tmp
[ERROR] Error occurred in starting fork, check output in log
[ERROR] Process Exit Code: 1
[ERROR] Crashed tests:
[ERROR] jenkins.triggers.TriggerTest
[ERROR] at org.apache.maven.plugin.surefire.booterclient.ForkStarter.fork(ForkStarter.java:679)
[ERROR] at org.apache.maven.plugin.surefire.booterclient.ForkStarter.fork(ForkStarter.java:533)
[ERROR] at org.apache.maven.plugin.surefire.booterclient.ForkStarter.access$600(ForkStarter.java:117)
[ERROR] at org.apache.maven.plugin.surefire.booterclient.ForkStarter$2.call(ForkStarter.java:429)
[ERROR] at org.apache.maven.plugin.surefire.booterclient.ForkStarter$2.call(ForkStarter.java:406)
[ERROR] at java.util.concurrent.FutureTask.run(FutureTask.java:266)
[ERROR] at java.util.concurrent.ThreadPoolExecutor.runWorker(ThreadPoolExecutor.java:1149)
[ERROR] at java.util.concurrent.ThreadPoolExecutor$Worker.run(ThreadPoolExecutor.java:624)
[ERROR] at java.lang.Thread.run(Thread.java:748)
[ERROR]
[ERROR] -> [Help 1]
[ERROR]
[ERROR] To see the full stack trace of the errors, re-run Maven with the -e switch.
[ERROR] Re-run Maven using the -X switch to enable full debug logging.
[ERROR]
[ERROR] For more information about the errors and possible solutions, please read the following articles:
[ERROR] [Help 1] http://cwiki.apache.org/confluence/display/MAVEN/MojoExecutionException
@lloydchang

This comment has been minimized.

Copy link

lloydchang commented Aug 6, 2019

Sign up for free to join this conversation on GitHub. Already have an account? Sign in to comment
You can’t perform that action at this time.