Skip to content

Instantly share code, notes, and snippets.

Embed
What would you like to do?
+ export PATH=/usr/local/sbin:/usr/local/bin:/sbin:/bin:/usr/sbin:/usr/bin
+ PATH=/usr/local/sbin:/usr/local/bin:/sbin:/bin:/usr/sbin:/usr/bin
+ umask 022
+ ARCHS=(['x86_64']='x86_64-linux-gnu-' ['alpha']='alpha-linux-gnu-' ['arm64']='aarch64-linux-gnu-')
+ declare -A ARCHS
+ ARCH=x86_64
+ CROSS_COMPILE=x86_64-linux-gnu-
+ KCFLAGS=-Warray-bounds
++ nproc
+ MAKEFLAGS=-j15
+ export ARCH CROSS_COMPILE KCFLAGS MAKEFLAGS
+ INITRAMFS=/home/kwilczynski/RAMFS.x86_64
+ TARGET=alldefconfig
+ SMATCH='smatch --project=kernel --data=/usr/share/smatch/smatch_data --succeed'
+ [[ ! -f /home/kwilczynski/Projects/Personal/Linux/linux/.config ]]
+ [[ alldefconfig == \c\l\e\a\n ]]
+ [[ -n '' ]]
+ [[ -n '' ]]
+ SPARSE=0
+ [[ -n '' ]]
+ [[ alldefconfig != \i\n\i\t\r\a\m\f\s ]]
+ tee -a /tmp/x86_64.log
+ date -R
Wed, 08 Sep 2021 00:05:21 +0000
+ [[ -n 1 ]]
+ make C=0 W=1 ARCH=x86_64 CROSS_COMPILE=x86_64-linux-gnu- mrproper
CLEAN arch/x86/entry/vdso
CLEAN arch/x86/realmode/rm
CLEAN arch/x86/kernel/cpu
CLEAN arch/x86/kernel
CLEAN certs
CLEAN usr
CLEAN arch/x86/tools
CLEAN scripts/basic
CLEAN scripts/kconfig
CLEAN scripts/mod
CLEAN scripts/selinux/genheaders
CLEAN scripts/selinux/mdp
CLEAN scripts
CLEAN modules-only.symvers
CLEAN include/config include/generated arch/x86/include/generated .config .config.old
+ make C=0 W=1 ARCH=x86_64 CROSS_COMPILE=x86_64-linux-gnu- distclean
+ make C=0 W=1 ARCH=x86_64 CROSS_COMPILE=x86_64-linux-gnu- alldefconfig
HOSTCC scripts/basic/fixdep
HOSTCC scripts/kconfig/conf.o
HOSTCC scripts/kconfig/confdata.o
HOSTCC scripts/kconfig/expr.o
LEX scripts/kconfig/lexer.lex.c
YACC scripts/kconfig/parser.tab.[ch]
HOSTCC scripts/kconfig/menu.o
HOSTCC scripts/kconfig/preprocess.o
HOSTCC scripts/kconfig/symbol.o
HOSTCC scripts/kconfig/util.o
HOSTCC scripts/kconfig/lexer.lex.o
HOSTCC scripts/kconfig/parser.tab.o
HOSTLD scripts/kconfig/conf
#
# configuration written to .config
#
+ [[ x86_64 == \x\8\6\_\6\4 ]]
+ /home/kwilczynski/Projects/Personal/Linux/linux/scripts/kconfig/merge_config.sh .config /home/kwilczynski/defconfig
+ make C=0 W=1 ARCH=x86_64 CROSS_COMPILE=x86_64-linux-gnu- oldconfig
#
# No change to .config
#
+ [[ -z 1 ]]
+ /home/kwilczynski/Projects/Personal/Linux/linux/scripts/config -e CONFIG_LOCALVERSION_AUTO
+ /home/kwilczynski/Projects/Personal/Linux/linux/scripts/config -e CONFIG_EARLY_PRINTK
+ /home/kwilczynski/Projects/Personal/Linux/linux/scripts/config -e CONFIG_STACKTRACE
+ /home/kwilczynski/Projects/Personal/Linux/linux/scripts/config -e CONFIG_KMEMCHECK
+ /home/kwilczynski/Projects/Personal/Linux/linux/scripts/config -e CONFIG_FRAME_POINTER
+ /home/kwilczynski/Projects/Personal/Linux/linux/scripts/config -e CONFIG_CONFIGFS_FS
+ /home/kwilczynski/Projects/Personal/Linux/linux/scripts/config -e CONFIG_DYNAMIC_DEBUG
+ /home/kwilczynski/Projects/Personal/Linux/linux/scripts/config -e CONFIG_PCI_DEBUG
+ /home/kwilczynski/Projects/Personal/Linux/linux/scripts/config -e CONFIG_DEBUG_INFO
+ /home/kwilczynski/Projects/Personal/Linux/linux/scripts/config -e CONFIG_DEBUG_KERNEL
+ [[ -z '' ]]
+ make C=0 W=1 ARCH=x86_64 CROSS_COMPILE=x86_64-linux-gnu-
SYNC include/config/auto.conf.cmd
SYSHDR arch/x86/include/generated/uapi/asm/unistd_32.h
SYSHDR arch/x86/include/generated/uapi/asm/unistd_64.h
SYSHDR arch/x86/include/generated/uapi/asm/unistd_x32.h
SYSTBL arch/x86/include/generated/asm/syscalls_32.h
SYSHDR arch/x86/include/generated/asm/unistd_32_ia32.h
SYSHDR arch/x86/include/generated/asm/unistd_64_x32.h
SYSTBL arch/x86/include/generated/asm/syscalls_64.h
WRAP arch/x86/include/generated/uapi/asm/bpf_perf_event.h
WRAP arch/x86/include/generated/uapi/asm/errno.h
WRAP arch/x86/include/generated/uapi/asm/ioctls.h
WRAP arch/x86/include/generated/uapi/asm/fcntl.h
WRAP arch/x86/include/generated/uapi/asm/ioctl.h
WRAP arch/x86/include/generated/uapi/asm/ipcbuf.h
WRAP arch/x86/include/generated/uapi/asm/param.h
WRAP arch/x86/include/generated/uapi/asm/resource.h
WRAP arch/x86/include/generated/uapi/asm/socket.h
WRAP arch/x86/include/generated/uapi/asm/sockios.h
WRAP arch/x86/include/generated/uapi/asm/termbits.h
WRAP arch/x86/include/generated/uapi/asm/poll.h
WRAP arch/x86/include/generated/uapi/asm/termios.h
WRAP arch/x86/include/generated/uapi/asm/types.h
HOSTCC arch/x86/tools/relocs_32.o
HOSTCC arch/x86/tools/relocs_64.o
HOSTCC arch/x86/tools/relocs_common.o
WRAP arch/x86/include/generated/asm/early_ioremap.h
WRAP arch/x86/include/generated/asm/export.h
WRAP arch/x86/include/generated/asm/mcs_spinlock.h
WRAP arch/x86/include/generated/asm/irq_regs.h
WRAP arch/x86/include/generated/asm/kmap_size.h
WRAP arch/x86/include/generated/asm/local64.h
WRAP arch/x86/include/generated/asm/mmiowb.h
WRAP arch/x86/include/generated/asm/module.lds.h
WRAP arch/x86/include/generated/asm/rwonce.h
WRAP arch/x86/include/generated/asm/unaligned.h
UPD include/generated/uapi/linux/version.h
HOSTCC scripts/kallsyms
HOSTCC scripts/sorttable
HOSTCC scripts/asn1_compiler
HOSTCC scripts/selinux/genheaders/genheaders
HOSTCC scripts/selinux/mdp/mdp
HOSTCC scripts/extract-cert
DESCEND objtool
HOSTCC /home/kwilczynski/Development/Projects/Personal/Linux/linux/tools/objtool/fixdep.o
HOSTLD /home/kwilczynski/Development/Projects/Personal/Linux/linux/tools/objtool/fixdep-in.o
LINK /home/kwilczynski/Development/Projects/Personal/Linux/linux/tools/objtool/fixdep
CC /home/kwilczynski/Development/Projects/Personal/Linux/linux/tools/objtool/exec-cmd.o
CC /home/kwilczynski/Development/Projects/Personal/Linux/linux/tools/objtool/weak.o
CC /home/kwilczynski/Development/Projects/Personal/Linux/linux/tools/objtool/check.o
CC /home/kwilczynski/Development/Projects/Personal/Linux/linux/tools/objtool/help.o
CC /home/kwilczynski/Development/Projects/Personal/Linux/linux/tools/objtool/pager.o
CC /home/kwilczynski/Development/Projects/Personal/Linux/linux/tools/objtool/special.o
CC /home/kwilczynski/Development/Projects/Personal/Linux/linux/tools/objtool/parse-options.o
CC /home/kwilczynski/Development/Projects/Personal/Linux/linux/tools/objtool/arch/x86/special.o
CC /home/kwilczynski/Development/Projects/Personal/Linux/linux/tools/objtool/arch/x86/decode.o
CC /home/kwilczynski/Development/Projects/Personal/Linux/linux/tools/objtool/run-command.o
HOSTLD arch/x86/tools/relocs
CC /home/kwilczynski/Development/Projects/Personal/Linux/linux/tools/objtool/orc_gen.o
CC /home/kwilczynski/Development/Projects/Personal/Linux/linux/tools/objtool/orc_dump.o
CC /home/kwilczynski/Development/Projects/Personal/Linux/linux/tools/objtool/builtin-check.o
CC /home/kwilczynski/Development/Projects/Personal/Linux/linux/tools/objtool/sigchain.o
CC /home/kwilczynski/Development/Projects/Personal/Linux/linux/tools/objtool/subcmd-config.o
CC /home/kwilczynski/Development/Projects/Personal/Linux/linux/tools/objtool/builtin-orc.o
CC /home/kwilczynski/Development/Projects/Personal/Linux/linux/tools/objtool/elf.o
CC /home/kwilczynski/Development/Projects/Personal/Linux/linux/tools/objtool/objtool.o
CC /home/kwilczynski/Development/Projects/Personal/Linux/linux/tools/objtool/libstring.o
CC /home/kwilczynski/Development/Projects/Personal/Linux/linux/tools/objtool/libctype.o
CC /home/kwilczynski/Development/Projects/Personal/Linux/linux/tools/objtool/str_error_r.o
CC /home/kwilczynski/Development/Projects/Personal/Linux/linux/tools/objtool/librbtree.o
UPD include/config/kernel.release
UPD include/generated/utsrelease.h
CC scripts/mod/empty.o
HOSTCC scripts/mod/mk_elfconfig
CC scripts/mod/devicetable-offsets.s
UPD scripts/mod/devicetable-offsets.h
MKELF scripts/mod/elfconfig.h
HOSTCC scripts/mod/modpost.o
HOSTCC scripts/mod/file2alias.o
HOSTCC scripts/mod/sumversion.o
LD /home/kwilczynski/Development/Projects/Personal/Linux/linux/tools/objtool/libsubcmd-in.o
AR /home/kwilczynski/Development/Projects/Personal/Linux/linux/tools/objtool/libsubcmd.a
LD /home/kwilczynski/Development/Projects/Personal/Linux/linux/tools/objtool/arch/x86/objtool-in.o
HOSTLD scripts/mod/modpost
CC kernel/bounds.s
CALL scripts/atomic/check-atomics.sh
UPD include/generated/timeconst.h
UPD include/generated/bounds.h
CC arch/x86/kernel/asm-offsets.s
LD /home/kwilczynski/Development/Projects/Personal/Linux/linux/tools/objtool/objtool-in.o
LINK /home/kwilczynski/Development/Projects/Personal/Linux/linux/tools/objtool/objtool
UPD include/generated/asm-offsets.h
CALL scripts/checksyscalls.sh
CC init/main.o
CHK include/generated/compile.h
CC init/do_mounts.o
CC init/do_mounts_initrd.o
CC init/initramfs.o
CC init/calibrate.o
HOSTCC usr/gen_init_cpio
CC init/init_task.o
UPD include/generated/compile.h
CC arch/x86/realmode/init.o
CC certs/system_keyring.o
CC arch/x86/events/amd/core.o
CC arch/x86/mm/pat/set_memory.o
CC arch/x86/kernel/fpu/init.o
CC mm/filemap.o
CC kernel/sched/core.o
CC arch/x86/entry/vdso/vma.o
GEN usr/initramfs_data.cpio
SHIPPED usr/initramfs_inc_data
AS usr/initramfs_data.o
CC kernel/locking/mutex.o
AR usr/built-in.a
CC kernel/power/qos.o
certs/system_keyring.c:43: warning: Function parameter or member 'dest_keyring' not described in 'restrict_link_by_builtin_trusted'
certs/system_keyring.c:43: warning: Function parameter or member 'type' not described in 'restrict_link_by_builtin_trusted'
certs/system_keyring.c:43: warning: Function parameter or member 'payload' not described in 'restrict_link_by_builtin_trusted'
certs/system_keyring.c:43: warning: Function parameter or member 'restriction_key' not described in 'restrict_link_by_builtin_trusted'
certs/system_keyring.c:43: warning: expecting prototype for restrict_link_to_builtin_trusted(). Prototype was for restrict_link_by_builtin_trusted() instead
certs/system_keyring.c:62: warning: Function parameter or member 'dest_keyring' not described in 'restrict_link_by_builtin_and_secondary_trusted'
certs/system_keyring.c:62: warning: Function parameter or member 'type' not described in 'restrict_link_by_builtin_and_secondary_trusted'
certs/system_keyring.c:62: warning: Function parameter or member 'payload' not described in 'restrict_link_by_builtin_and_secondary_trusted'
certs/system_keyring.c:62: warning: Function parameter or member 'restrict_key' not described in 'restrict_link_by_builtin_and_secondary_trusted'
certs/system_keyring.c:77: warning: This comment starts with '/**', but isn't a kernel-doc comment. Refer Documentation/doc-guide/kernel-doc.rst
* Allocate a struct key_restriction for the "builtin and secondary trust"
EXTRACT_CERTS
CC certs/common.o
AS certs/system_certificates.o
AS arch/x86/realmode/rm/header.o
AR certs/built-in.a
CC kernel/power/main.o
AS arch/x86/realmode/rm/trampoline_64.o
CC arch/x86/kernel/fpu/bugs.o
AS arch/x86/realmode/rm/stack.o
AS arch/x86/realmode/rm/reboot.o
CC arch/x86/mm/init.o
AS arch/x86/realmode/rm/wakeup_asm.o
CC arch/x86/realmode/rm/wakemain.o
CC arch/x86/entry/vdso/extable.o
init/main.c:774:20: error: no previous prototype for ‘mem_encrypt_init’ [-Werror=missing-prototypes]
774 | void __init __weak mem_encrypt_init(void) { }
| ^~~~~~~~~~~~~~~~
kernel/sched/core.c:3416:6: error: no previous prototype for ‘sched_set_stop_task’ [-Werror=missing-prototypes]
3416 | void sched_set_stop_task(int cpu, struct task_struct *stop)
| ^~~~~~~~~~~~~~~~~~~
CC arch/x86/realmode/rm/video-mode.o
CC arch/x86/entry/vdso/vdso32-setup.o
AS arch/x86/realmode/rm/copy.o
CC arch/x86/events/amd/ibs.o
CC arch/x86/events/amd/uncore.o
AS arch/x86/realmode/rm/bioscall.o
CC arch/x86/realmode/rm/regs.o
CC arch/x86/realmode/rm/video-vga.o
LDS arch/x86/entry/vdso/vdso.lds
AS arch/x86/entry/vdso/vdso-note.o
CC kernel/locking/semaphore.o
CC arch/x86/entry/vdso/vclock_gettime.o
CC arch/x86/realmode/rm/video-vesa.o
CC kernel/locking/rwsem.o
CC arch/x86/realmode/rm/video-bios.o
CC arch/x86/kernel/fpu/core.o
cc1: all warnings being treated as errors
make[1]: *** [scripts/Makefile.build:277: init/main.o] Error 1
make[1]: *** Waiting for unfinished jobs....
CC arch/x86/kernel/fpu/regset.o
make: *** [Makefile:1872: init] Error 2
make: *** Waiting for unfinished jobs....
CC arch/x86/kernel/fpu/signal.o
PASYMS arch/x86/realmode/rm/pasyms.h
LDS arch/x86/realmode/rm/realmode.lds
LD arch/x86/realmode/rm/realmode.elf
RELOCS arch/x86/realmode/rm/realmode.relocs
OBJCOPY arch/x86/realmode/rm/realmode.bin
AS arch/x86/realmode/rmpiggy.o
AR arch/x86/realmode/built-in.a
CC arch/x86/entry/vdso/vgetcpu.o
AR arch/x86/crypto/built-in.a
CC arch/x86/events/amd/iommu.o
HOSTCC arch/x86/entry/vdso/vdso2c
CC kernel/power/console.o
CC arch/x86/mm/pat/memtype.o
arch/x86/entry/vdso/vgetcpu.c:14:1: error: no previous prototype for ‘__vdso_getcpu’ [-Werror=missing-prototypes]
14 | __vdso_getcpu(unsigned *cpu, unsigned *node, struct getcpu_cache *unused)
| ^~~~~~~~~~~~~
CC arch/x86/mm/init_64.o
cc1: all warnings being treated as errors
make[3]: *** [scripts/Makefile.build:277: arch/x86/entry/vdso/vgetcpu.o] Error 1
make[3]: *** Waiting for unfinished jobs....
CC kernel/locking/percpu-rwsem.o
CC arch/x86/entry/vsyscall/vsyscall_64.o
CC kernel/power/process.o
make[2]: *** [scripts/Makefile.build:540: arch/x86/entry/vdso] Error 2
make[2]: *** Waiting for unfinished jobs....
CC kernel/power/suspend.o
CC kernel/locking/spinlock.o
CC kernel/locking/osq_lock.o
CC arch/x86/kernel/fpu/xstate.o
AS arch/x86/entry/vsyscall/vsyscall_emu_64.o
CC kernel/locking/qspinlock.o
CC kernel/locking/rtmutex_api.o
AR arch/x86/events/amd/built-in.a
CC arch/x86/events/intel/core.o
CC kernel/power/hibernate.o
CC arch/x86/ia32/ia32_signal.o
CC kernel/printk/printk.o
CC arch/x86/ia32/audit.o
CC arch/x86/mm/pat/memtype_interval.o
arch/x86/mm/pat/memtype.c:744: warning: Function parameter or member 'pfn' not described in 'pat_pfn_immune_to_uc_mtrr'
CC kernel/locking/qrwlock.o
CC kernel/printk/printk_safe.o
AR arch/x86/entry/vsyscall/built-in.a
make[1]: *** [scripts/Makefile.build:540: arch/x86/entry] Error 2
make[1]: *** Waiting for unfinished jobs....
CC kernel/printk/printk_ringbuffer.o
CC kernel/power/snapshot.o
CC kernel/power/swap.o
CC kernel/power/user.o
kernel/printk/printk.c: In function ‘printk_sprint’:
kernel/printk/printk.c:2075:2: error: function ‘printk_sprint’ might be a candidate for ‘gnu_printf’ format attribute [-Werror=suggest-attribute=format]
2075 | text_len = vscnprintf(text, size, fmt, args);
| ^~~~~~~~
kernel/power/hibernate.c:275:12: error: no previous prototype for ‘arch_resume_nosmt’ [-Werror=missing-prototypes]
275 | __weak int arch_resume_nosmt(void)
| ^~~~~~~~~~~~~~~~~
CC kernel/power/poweroff.o
AR kernel/locking/built-in.a
CC kernel/irq/irqdesc.o
AR arch/x86/mm/pat/built-in.a
CC arch/x86/kernel/cpu/mce/core.o
AR arch/x86/kernel/fpu/built-in.a
AR arch/x86/ia32/built-in.a
CC arch/x86/kernel/cpu/mtrr/mtrr.o
CC arch/x86/mm/fault.o
CC arch/x86/kernel/cpu/mtrr/if.o
CC arch/x86/kernel/cpu/mtrr/generic.o
CC arch/x86/kernel/cpu/mtrr/cleanup.o
cc1: all warnings being treated as errors
make[2]: *** [scripts/Makefile.build:277: kernel/power/hibernate.o] Error 1
make[2]: *** Waiting for unfinished jobs....
CC arch/x86/kernel/cpu/mce/severity.o
CC mm/mempool.o
CC mm/oom_kill.o
CC mm/fadvise.o
CC kernel/irq/handle.o
CC kernel/irq/manage.o
cc1: all warnings being treated as errors
make[2]: *** [scripts/Makefile.build:277: kernel/printk/printk.o] Error 1
make[1]: *** [scripts/Makefile.build:540: kernel/printk] Error 2
make[1]: *** Waiting for unfinished jobs....
CC kernel/irq/spurious.o
CC kernel/irq/resend.o
arch/x86/kernel/cpu/mtrr/generic.c:120: warning: Function parameter or member 'start' not described in 'mtrr_type_lookup_fixed'
arch/x86/kernel/cpu/mtrr/generic.c:120: warning: Function parameter or member 'end' not described in 'mtrr_type_lookup_fixed'
arch/x86/kernel/cpu/mtrr/generic.c:161: warning: Function parameter or member 'start' not described in 'mtrr_type_lookup_variable'
arch/x86/kernel/cpu/mtrr/generic.c:161: warning: Function parameter or member 'end' not described in 'mtrr_type_lookup_variable'
arch/x86/kernel/cpu/mtrr/generic.c:161: warning: Function parameter or member 'partial_end' not described in 'mtrr_type_lookup_variable'
arch/x86/kernel/cpu/mtrr/generic.c:161: warning: Function parameter or member 'repeat' not described in 'mtrr_type_lookup_variable'
arch/x86/kernel/cpu/mtrr/generic.c:161: warning: Function parameter or member 'uniform' not described in 'mtrr_type_lookup_variable'
arch/x86/kernel/cpu/mtrr/generic.c:255: warning: Function parameter or member 'start' not described in 'mtrr_type_lookup'
arch/x86/kernel/cpu/mtrr/generic.c:255: warning: Function parameter or member 'end' not described in 'mtrr_type_lookup'
arch/x86/kernel/cpu/mtrr/generic.c:255: warning: Function parameter or member 'uniform' not described in 'mtrr_type_lookup'
CC arch/x86/kernel/cpu/mce/genpool.o
AR arch/x86/kernel/cpu/mtrr/built-in.a
CC arch/x86/kernel/cpu/microcode/core.o
CC arch/x86/kernel/cpu/mce/intel.o
kernel/power/swap.c:91: warning: This comment starts with '/**', but isn't a kernel-doc comment. Refer Documentation/doc-guide/kernel-doc.rst
* The swap_map_handle structure is used for handling swap in
kernel/power/swap.c:118: warning: This comment starts with '/**', but isn't a kernel-doc comment. Refer Documentation/doc-guide/kernel-doc.rst
* The following functions are used for tracing the allocated
kernel/power/swap.c:177: warning: Function parameter or member 'swap' not described in 'alloc_swapdev_block'
kernel/power/swap.c:197: warning: Function parameter or member 'swap' not described in 'free_all_swap_pages'
kernel/power/swap.c:541: warning: Function parameter or member 'handle' not described in 'save_image'
kernel/power/swap.c:541: warning: Function parameter or member 'snapshot' not described in 'save_image'
kernel/power/swap.c:541: warning: Function parameter or member 'nr_to_write' not described in 'save_image'
kernel/power/swap.c:583: warning: This comment starts with '/**', but isn't a kernel-doc comment. Refer Documentation/doc-guide/kernel-doc.rst
* Structure used for CRC32.
kernel/power/swap.c:598: warning: This comment starts with '/**', but isn't a kernel-doc comment. Refer Documentation/doc-guide/kernel-doc.rst
* CRC32 update function that runs in its own thread.
kernel/power/swap.c:625: warning: This comment starts with '/**', but isn't a kernel-doc comment. Refer Documentation/doc-guide/kernel-doc.rst
* Structure used for LZO data compression.
kernel/power/swap.c:642: warning: This comment starts with '/**', but isn't a kernel-doc comment. Refer Documentation/doc-guide/kernel-doc.rst
* Compression function that runs in its own thread.
kernel/power/swap.c:891: warning: Function parameter or member 'nr_pages' not described in 'enough_swap'
kernel/power/swap.c:953: warning: This comment starts with '/**', but isn't a kernel-doc comment. Refer Documentation/doc-guide/kernel-doc.rst
* The following functions allow us to read data using a swap map
kernel/power/swap.c:1062: warning: Function parameter or member 'handle' not described in 'load_image'
kernel/power/swap.c:1062: warning: Function parameter or member 'snapshot' not described in 'load_image'
kernel/power/swap.c:1062: warning: Function parameter or member 'nr_to_read' not described in 'load_image'
kernel/power/swap.c:1112: warning: This comment starts with '/**', but isn't a kernel-doc comment. Refer Documentation/doc-guide/kernel-doc.rst
* Structure used for LZO data decompression.
kernel/power/swap.c:1128: warning: This comment starts with '/**', but isn't a kernel-doc comment. Refer Documentation/doc-guide/kernel-doc.rst
* Decompression function that runs in its own thread.
kernel/power/swap.c:1566: warning: Function parameter or member 'mode' not described in 'swsusp_close'
CC arch/x86/kernel/cpu/microcode/intel.o
cc1: all warnings being treated as errors
make[2]: *** [scripts/Makefile.build:277: kernel/sched/core.o] Error 1
make[1]: *** [scripts/Makefile.build:540: kernel/sched] Error 2
CC arch/x86/kernel/cpu/mce/amd.o
kernel/power/snapshot.c:330: warning: This comment starts with '/**', but isn't a kernel-doc comment. Refer Documentation/doc-guide/kernel-doc.rst
* Data types related to memory bitmaps.
kernel/power/snapshot.c:438: warning: Function parameter or member 'gfp_mask' not described in 'alloc_rtree_node'
kernel/power/snapshot.c:438: warning: Function parameter or member 'safe_needed' not described in 'alloc_rtree_node'
kernel/power/snapshot.c:438: warning: Function parameter or member 'ca' not described in 'alloc_rtree_node'
kernel/power/snapshot.c:438: warning: Function parameter or member 'list' not described in 'alloc_rtree_node'
kernel/power/snapshot.c:463: warning: Function parameter or member 'zone' not described in 'add_rtree_block'
kernel/power/snapshot.c:463: warning: Function parameter or member 'gfp_mask' not described in 'add_rtree_block'
kernel/power/snapshot.c:463: warning: Function parameter or member 'safe_needed' not described in 'add_rtree_block'
kernel/power/snapshot.c:463: warning: Function parameter or member 'ca' not described in 'add_rtree_block'
kernel/power/snapshot.c:536: warning: Function parameter or member 'gfp_mask' not described in 'create_zone_bm_rtree'
kernel/power/snapshot.c:536: warning: Function parameter or member 'safe_needed' not described in 'create_zone_bm_rtree'
kernel/power/snapshot.c:536: warning: Function parameter or member 'ca' not described in 'create_zone_bm_rtree'
kernel/power/snapshot.c:536: warning: Function parameter or member 'start' not described in 'create_zone_bm_rtree'
kernel/power/snapshot.c:536: warning: Function parameter or member 'end' not described in 'create_zone_bm_rtree'
kernel/power/snapshot.c:571: warning: Function parameter or member 'zone' not described in 'free_zone_bm_rtree'
kernel/power/snapshot.c:571: warning: Function parameter or member 'clear_nosave_free' not described in 'free_zone_bm_rtree'
kernel/power/snapshot.c:678: warning: Function parameter or member 'bm' not described in 'memory_bm_create'
kernel/power/snapshot.c:678: warning: Function parameter or member 'gfp_mask' not described in 'memory_bm_create'
kernel/power/snapshot.c:678: warning: Function parameter or member 'safe_needed' not described in 'memory_bm_create'
kernel/power/snapshot.c:720: warning: Function parameter or member 'clear_nosave_free' not described in 'memory_bm_free'
kernel/power/snapshot.c:742: warning: Function parameter or member 'bm' not described in 'memory_bm_find_bit'
kernel/power/snapshot.c:742: warning: Function parameter or member 'pfn' not described in 'memory_bm_find_bit'
kernel/power/snapshot.c:742: warning: Function parameter or member 'addr' not described in 'memory_bm_find_bit'
kernel/power/snapshot.c:742: warning: Function parameter or member 'bit_nr' not described in 'memory_bm_find_bit'
kernel/power/snapshot.c:916: warning: expecting prototype for memory_bm_rtree_next_pfn(). Prototype was for memory_bm_next_pfn() instead
kernel/power/snapshot.c:983: warning: Function parameter or member 'start_pfn' not described in '__register_nosave_region'
kernel/power/snapshot.c:983: warning: Function parameter or member 'end_pfn' not described in '__register_nosave_region'
kernel/power/snapshot.c:983: warning: Function parameter or member 'use_kmalloc' not described in '__register_nosave_region'
kernel/power/snapshot.c:983: warning: expecting prototype for register_nosave_region(). Prototype was for __register_nosave_region() instead
kernel/power/snapshot.c:1261: warning: Function parameter or member 'zone' not described in 'saveable_highmem_page'
kernel/power/snapshot.c:1261: warning: Function parameter or member 'pfn' not described in 'saveable_highmem_page'
kernel/power/snapshot.c:1325: warning: Function parameter or member 'zone' not described in 'saveable_page'
kernel/power/snapshot.c:1325: warning: Function parameter or member 'pfn' not described in 'saveable_page'
kernel/power/snapshot.c:1396: warning: Function parameter or member 'dst' not described in 'safe_copy_page'
kernel/power/snapshot.c:1396: warning: Function parameter or member 's_page' not described in 'safe_copy_page'
kernel/power/snapshot.c:1609: warning: Function parameter or member 'x' not described in '__fraction'
kernel/power/snapshot.c:1609: warning: Function parameter or member 'multiplier' not described in '__fraction'
kernel/power/snapshot.c:1609: warning: Function parameter or member 'base' not described in '__fraction'
kernel/power/snapshot.c:1900: warning: Function parameter or member 'nr_highmem' not described in 'count_pages_for_highmem'
CC kernel/irq/chip.o
kernel/power/snapshot.c:1918: warning: Function parameter or member 'nr_pages' not described in 'enough_free_mem'
kernel/power/snapshot.c:1918: warning: Function parameter or member 'nr_highmem' not described in 'enough_free_mem'
kernel/power/snapshot.c:1941: warning: Function parameter or member 'safe_needed' not described in 'get_highmem_buffer'
kernel/power/snapshot.c:1954: warning: Function parameter or member 'bm' not described in 'alloc_highmem_pages'
kernel/power/snapshot.c:1954: warning: Function parameter or member 'nr_highmem' not described in 'alloc_highmem_pages'
kernel/power/snapshot.c:1954: warning: expecting prototype for alloc_highmem_image_pages(). Prototype was for alloc_highmem_pages() instead
kernel/power/snapshot.c:1989: warning: Function parameter or member 'copy_bm' not described in 'swsusp_alloc'
kernel/power/snapshot.c:1989: warning: Function parameter or member 'nr_pages' not described in 'swsusp_alloc'
kernel/power/snapshot.c:1989: warning: Function parameter or member 'nr_highmem' not described in 'swsusp_alloc'
kernel/power/snapshot.c:2202: warning: Function parameter or member 'bm' not described in 'mark_unsafe_pages'
kernel/power/snapshot.c:2237: warning: Function parameter or member 'info' not described in 'load_header'
kernel/power/snapshot.c:2237: warning: expecting prototype for load header(). Prototype was for load_header() instead
kernel/power/snapshot.c:2391: warning: Function parameter or member 'page' not described in 'get_highmem_page_buffer'
kernel/power/snapshot.c:2391: warning: Function parameter or member 'ca' not described in 'get_highmem_page_buffer'
kernel/power/snapshot.c:2576: warning: Function parameter or member 'bm' not described in 'get_buffer'
kernel/power/snapshot.c:2576: warning: Function parameter or member 'ca' not described in 'get_buffer'
kernel/power/snapshot.c:2700: warning: Function parameter or member 'handle' not described in 'snapshot_write_finalize'
make[1]: *** [scripts/Makefile.build:540: kernel/power] Error 2
CC kernel/irq/dummychip.o
CC kernel/irq/devres.o
CC mm/maccess.o
CC kernel/irq/autoprobe.o
CC arch/x86/mm/ioremap.o
CC arch/x86/kernel/cpu/mce/threshold.o
CC arch/x86/events/intel/bts.o
CC arch/x86/events/zhaoxin/core.o
CC kernel/irq/irqdomain.o
CC kernel/irq/proc.o
CC arch/x86/events/intel/ds.o
CC kernel/irq/migration.o
CC kernel/irq/cpuhotplug.o
CC arch/x86/kernel/cpu/microcode/amd.o
CC mm/page-writeback.o
arch/x86/mm/ioremap.c:720:17: error: no previous prototype for ‘early_memremap_pgprot_adjust’ [-Werror=missing-prototypes]
720 | pgprot_t __init early_memremap_pgprot_adjust(resource_size_t phys_addr,
| ^~~~~~~~~~~~~~~~~~~~~~~~~~~~
CC mm/readahead.o
CC kernel/irq/pm.o
cc1: all warnings being treated as errors
CC mm/swap.o
make[2]: *** [scripts/Makefile.build:277: arch/x86/mm/ioremap.o] Error 1
make[1]: *** [scripts/Makefile.build:540: arch/x86/mm] Error 2
CC kernel/irq/msi.o
CC arch/x86/kernel/acpi/boot.o
CC kernel/irq/affinity.o
CC arch/x86/kernel/cpu/cacheinfo.o
CC kernel/irq/matrix.o
AR arch/x86/events/zhaoxin/built-in.a
CC arch/x86/events/core.o
CC arch/x86/events/intel/knc.o
AR arch/x86/kernel/cpu/mce/built-in.a
CC arch/x86/kernel/cpu/scattered.o
AR arch/x86/kernel/cpu/microcode/built-in.a
CC arch/x86/kernel/acpi/sleep.o
kernel/irq/irqdomain.c:114: warning: Function parameter or member 'fwnode' not described in 'irq_domain_free_fwnode'
kernel/irq/irqdomain.c:945: warning: Function parameter or member 'd' not described in 'irq_domain_xlate_onecell'
kernel/irq/irqdomain.c:945: warning: Function parameter or member 'ctrlr' not described in 'irq_domain_xlate_onecell'
kernel/irq/irqdomain.c:945: warning: Function parameter or member 'intspec' not described in 'irq_domain_xlate_onecell'
kernel/irq/irqdomain.c:945: warning: Function parameter or member 'intsize' not described in 'irq_domain_xlate_onecell'
kernel/irq/irqdomain.c:945: warning: Function parameter or member 'out_hwirq' not described in 'irq_domain_xlate_onecell'
kernel/irq/irqdomain.c:945: warning: Function parameter or member 'out_type' not described in 'irq_domain_xlate_onecell'
kernel/irq/irqdomain.c:964: warning: Function parameter or member 'd' not described in 'irq_domain_xlate_twocell'
kernel/irq/irqdomain.c:964: warning: Function parameter or member 'ctrlr' not described in 'irq_domain_xlate_twocell'
kernel/irq/irqdomain.c:964: warning: Function parameter or member 'intspec' not described in 'irq_domain_xlate_twocell'
kernel/irq/irqdomain.c:964: warning: Function parameter or member 'intsize' not described in 'irq_domain_xlate_twocell'
kernel/irq/irqdomain.c:964: warning: Function parameter or member 'out_hwirq' not described in 'irq_domain_xlate_twocell'
kernel/irq/irqdomain.c:964: warning: Function parameter or member 'out_type' not described in 'irq_domain_xlate_twocell'
kernel/irq/irqdomain.c:987: warning: Function parameter or member 'd' not described in 'irq_domain_xlate_onetwocell'
kernel/irq/irqdomain.c:987: warning: Function parameter or member 'ctrlr' not described in 'irq_domain_xlate_onetwocell'
kernel/irq/irqdomain.c:987: warning: Function parameter or member 'intspec' not described in 'irq_domain_xlate_onetwocell'
kernel/irq/irqdomain.c:987: warning: Function parameter or member 'intsize' not described in 'irq_domain_xlate_onetwocell'
kernel/irq/irqdomain.c:987: warning: Function parameter or member 'out_hwirq' not described in 'irq_domain_xlate_onetwocell'
kernel/irq/irqdomain.c:987: warning: Function parameter or member 'out_type' not described in 'irq_domain_xlate_onetwocell'
kernel/irq/irqdomain.c:1012: warning: Function parameter or member 'd' not described in 'irq_domain_translate_onecell'
kernel/irq/irqdomain.c:1012: warning: Function parameter or member 'fwspec' not described in 'irq_domain_translate_onecell'
kernel/irq/irqdomain.c:1012: warning: Function parameter or member 'out_hwirq' not described in 'irq_domain_translate_onecell'
kernel/irq/irqdomain.c:1012: warning: Function parameter or member 'out_type' not described in 'irq_domain_translate_onecell'
kernel/irq/irqdomain.c:1033: warning: Function parameter or member 'd' not described in 'irq_domain_translate_twocell'
kernel/irq/irqdomain.c:1033: warning: Function parameter or member 'fwspec' not described in 'irq_domain_translate_twocell'
kernel/irq/irqdomain.c:1033: warning: Function parameter or member 'out_hwirq' not described in 'irq_domain_translate_twocell'
kernel/irq/irqdomain.c:1033: warning: Function parameter or member 'out_type' not described in 'irq_domain_translate_twocell'
AS arch/x86/kernel/acpi/wakeup_64.o
CC arch/x86/kernel/acpi/cppc_msr.o
CC arch/x86/kernel/acpi/cstate.o
CC arch/x86/kernel/cpu/topology.o
CC arch/x86/kernel/cpu/common.o
CC arch/x86/kernel/cpu/rdrand.o
CC arch/x86/kernel/cpu/match.o
CC arch/x86/events/intel/lbr.o
CC mm/truncate.o
CC mm/vmscan.o
CC mm/shmem.o
CC mm/util.o
CC arch/x86/events/intel/p4.o
CC arch/x86/events/intel/p6.o
CC arch/x86/events/intel/pt.o
AR arch/x86/kernel/acpi/built-in.a
CC arch/x86/kernel/apic/apic.o
CC arch/x86/kernel/cpu/bugs.o
AR kernel/irq/built-in.a
make: *** [Makefile:1872: kernel] Error 2
CC arch/x86/kernel/cpu/aperfmperf.o
CC mm/mmzone.o
mm/vmscan.c: In function ‘demote_page_list’:
mm/vmscan.c:1340:6: error: variable ‘err’ set but not used [-Werror=unused-but-set-variable]
1340 | int err;
| ^~~
CC arch/x86/events/intel/uncore.o
CC mm/vmstat.o
CC arch/x86/kernel/cpu/cpuid-deps.o
CC arch/x86/events/intel/uncore_nhmex.o
CC arch/x86/events/intel/uncore_snb.o
CC mm/backing-dev.o
CC mm/mm_init.o
CC arch/x86/kernel/cpu/umwait.o
CC arch/x86/kernel/cpu/proc.o
CC arch/x86/events/probe.o
CC arch/x86/events/intel/uncore_snbep.o
MKCAP arch/x86/kernel/cpu/capflags.c
arch/x86/events/intel/pt.c:729: warning: Function parameter or member 'cpu' not described in 'topa_insert_pages'
arch/x86/events/intel/pt.c:1196: warning: Function parameter or member 'cpu' not described in 'pt_buffer_init_topa'
arch/x86/events/intel/pt.c:1196: warning: Function parameter or member 'nr_pages' not described in 'pt_buffer_init_topa'
arch/x86/events/intel/pt.c:1196: warning: Excess function parameter 'size' description in 'pt_buffer_init_topa'
arch/x86/events/intel/pt.c:1269: warning: Function parameter or member 'event' not described in 'pt_buffer_setup_aux'
arch/x86/events/intel/pt.c:1269: warning: Excess function parameter 'cpu' description in 'pt_buffer_setup_aux'
CC arch/x86/events/intel/uncore_discovery.o
CC arch/x86/kernel/cpu/powerflags.o
CC mm/percpu.o
CC arch/x86/kernel/cpu/feat_ctl.o
CC arch/x86/kernel/cpu/intel.o
arch/x86/kernel/cpu/feat_ctl.c:105:6: error: no previous prototype for ‘init_ia32_feat_ctl’ [-Werror=missing-prototypes]
105 | void init_ia32_feat_ctl(struct cpuinfo_x86 *c)
| ^~~~~~~~~~~~~~~~~~
CC arch/x86/kernel/cpu/intel_pconfig.o
cc1: all warnings being treated as errors
make[3]: *** [scripts/Makefile.build:277: arch/x86/kernel/cpu/feat_ctl.o] Error 1
make[3]: *** Waiting for unfinished jobs....
CC mm/slab_common.o
arch/x86/kernel/apic/apic.c:2187: warning: Function parameter or member 'spurious_interrupt' not described in 'DEFINE_IDTENTRY_IRQ'
arch/x86/kernel/apic/apic.c:2187: warning: expecting prototype for spurious_interrupt(). Prototype was for DEFINE_IDTENTRY_IRQ() instead
CC arch/x86/kernel/apic/apic_common.o
CC arch/x86/events/intel/cstate.o
CC arch/x86/kernel/apic/apic_noop.o
CC mm/compaction.o
CC mm/vmacache.o
CC arch/x86/kernel/apic/ipi.o
CC arch/x86/kernel/apic/vector.o
CC mm/interval_tree.o
CC mm/list_lru.o
CC arch/x86/kernel/kprobes/core.o
CC mm/workingset.o
CC arch/x86/kernel/apic/hw_nmi.o
CC arch/x86/kernel/kprobes/opt.o
CC arch/x86/kernel/apic/io_apic.o
CC arch/x86/kernel/apic/msi.o
arch/x86/kernel/kprobes/core.c:1057:24: error: no previous prototype for ‘trampoline_handler’ [-Werror=missing-prototypes]
1057 | __used __visible void *trampoline_handler(struct pt_regs *regs)
| ^~~~~~~~~~~~~~~~~~
cc1: all warnings being treated as errors
make[1]: *** [scripts/Makefile.build:277: mm/vmscan.o] Error 1
make[1]: *** Waiting for unfinished jobs....
CC arch/x86/kernel/apic/apic_flat_64.o
CC arch/x86/kernel/apic/probe_64.o
CC arch/x86/events/rapl.o
CC arch/x86/events/msr.o
cc1: all warnings being treated as errors
make[3]: *** [scripts/Makefile.build:277: arch/x86/kernel/kprobes/core.o] Error 1
make[3]: *** Waiting for unfinished jobs....
AS arch/x86/kernel/head_64.o
CC arch/x86/kernel/head64.o
CC arch/x86/kernel/ebda.o
CC arch/x86/kernel/platform-quirks.o
AR arch/x86/events/intel/built-in.a
LDS arch/x86/kernel/vmlinux.lds
CC arch/x86/kernel/process_64.o
CC arch/x86/kernel/signal.o
make[2]: *** [scripts/Makefile.build:540: arch/x86/kernel/kprobes] Error 2
make[2]: *** Waiting for unfinished jobs....
make[2]: *** [scripts/Makefile.build:540: arch/x86/kernel/cpu] Error 2
AR arch/x86/events/built-in.a
AR arch/x86/kernel/apic/built-in.a
make[1]: *** [scripts/Makefile.build:540: arch/x86/kernel] Error 2
make: *** [Makefile:1872: arch/x86] Error 2
make: *** [Makefile:1872: mm] Error 2
+ make C=0 W=1 ARCH=x86_64 CROSS_COMPILE=x86_64-linux-gnu- modules
DESCEND objtool
CALL scripts/atomic/check-atomics.sh
CALL scripts/checksyscalls.sh
CC [M] fs/efivarfs/inode.o
CC [M] fs/efivarfs/file.o
CC [M] fs/efivarfs/super.o
CC [M] net/netfilter/nf_log_syslog.o
CC [M] net/ipv4/netfilter/iptable_nat.o
CC [M] net/netfilter/xt_mark.o
CC [M] net/netfilter/xt_nat.o
CC [M] net/netfilter/xt_LOG.o
CC [M] net/netfilter/xt_MASQUERADE.o
CC [M] net/netfilter/xt_addrtype.o
LDS scripts/module.lds
LD [M] fs/efivarfs/efivarfs.o
CC [M] drivers/thermal/intel/x86_pkg_temp_thermal.o
WARNING: Symbol version dump "vmlinux.symvers" is missing.
Modules may not have dependencies or modversions.
You may get many unresolved symbol warnings.
MODPOST modules-only.symvers
WARNING: modpost: "unregister_pernet_subsys" [net/ipv4/netfilter/iptable_nat.ko] undefined!
WARNING: modpost: "xt_unregister_template" [net/ipv4/netfilter/iptable_nat.ko] undefined!
WARNING: modpost: "register_pernet_subsys" [net/ipv4/netfilter/iptable_nat.ko] undefined!
WARNING: modpost: "xt_register_template" [net/ipv4/netfilter/iptable_nat.ko] undefined!
WARNING: modpost: "ipt_do_table" [net/ipv4/netfilter/iptable_nat.ko] undefined!
WARNING: modpost: "nf_nat_ipv4_register_fn" [net/ipv4/netfilter/iptable_nat.ko] undefined!
WARNING: modpost: "kmemdup" [net/ipv4/netfilter/iptable_nat.ko] undefined!
WARNING: modpost: "xt_find_table" [net/ipv4/netfilter/iptable_nat.ko] undefined!
WARNING: modpost: "ipt_register_table" [net/ipv4/netfilter/iptable_nat.ko] undefined!
WARNING: modpost: "ipt_alloc_initial_table" [net/ipv4/netfilter/iptable_nat.ko] undefined!
WARNING: modpost: suppressed 167 unresolved symbol warnings because there were too many)
CC [M] drivers/thermal/intel/x86_pkg_temp_thermal.mod.o
CC [M] fs/efivarfs/efivarfs.mod.o
CC [M] net/ipv4/netfilter/iptable_nat.mod.o
CC [M] net/netfilter/nf_log_syslog.mod.o
CC [M] net/netfilter/xt_LOG.mod.o
CC [M] net/netfilter/xt_MASQUERADE.mod.o
CC [M] net/netfilter/xt_addrtype.mod.o
CC [M] net/netfilter/xt_mark.mod.o
CC [M] net/netfilter/xt_nat.mod.o
LD [M] drivers/thermal/intel/x86_pkg_temp_thermal.ko
LD [M] net/netfilter/nf_log_syslog.ko
LD [M] net/netfilter/xt_addrtype.ko
LD [M] fs/efivarfs/efivarfs.ko
LD [M] net/netfilter/xt_nat.ko
LD [M] net/netfilter/xt_MASQUERADE.ko
LD [M] net/netfilter/xt_LOG.ko
LD [M] net/ipv4/netfilter/iptable_nat.ko
LD [M] net/netfilter/xt_mark.ko
+ rm -Rf /home/kwilczynski/RAMFS.x86_64/lib/modules
+ [[ -z '' ]]
+ make C=0 W=1 ARCH=x86_64 CROSS_COMPILE=x86_64-linux-gnu- INSTALL_MOD_PATH=/home/kwilczynski/RAMFS.x86_64 modules_install
cp: cannot stat 'modules.builtin': No such file or directory
make: *** [Makefile:1506: __modinst_pre] Error 1
+ cd /home/kwilczynski/RAMFS.x86_64
+ echo /home/kwilczynski/RAMFS.x86_64
/home/kwilczynski/RAMFS.x86_64
+ find .
+ fakeroot cpio -oHnewc
+ gzip
13917 blocks
+ cd -
+ mv -v /tmp/initramfs.gz /home/kwilczynski/Projects/Personal/Linux/linux
renamed '/tmp/initramfs.gz' -> '/home/kwilczynski/Projects/Personal/Linux/linux/initramfs.gz'
+ date -R
Wed, 08 Sep 2021 00:05:21 +0000
+ [[ -n 1 ]]
+ make C=0 W=1 ARCH=x86_64 CROSS_COMPILE=x86_64-linux-gnu- mrproper
CLEAN arch/x86/entry/vdso
CLEAN arch/x86/realmode/rm
CLEAN arch/x86/kernel/cpu
CLEAN arch/x86/kernel
CLEAN certs
CLEAN usr
CLEAN arch/x86/tools
CLEAN scripts/basic
CLEAN scripts/kconfig
CLEAN scripts/mod
CLEAN scripts/selinux/genheaders
CLEAN scripts/selinux/mdp
CLEAN scripts
CLEAN modules-only.symvers
CLEAN include/config include/generated arch/x86/include/generated .config .config.old
+ make C=0 W=1 ARCH=x86_64 CROSS_COMPILE=x86_64-linux-gnu- distclean
+ make C=0 W=1 ARCH=x86_64 CROSS_COMPILE=x86_64-linux-gnu- alldefconfig
HOSTCC scripts/basic/fixdep
HOSTCC scripts/kconfig/conf.o
HOSTCC scripts/kconfig/confdata.o
HOSTCC scripts/kconfig/expr.o
LEX scripts/kconfig/lexer.lex.c
YACC scripts/kconfig/parser.tab.[ch]
HOSTCC scripts/kconfig/menu.o
HOSTCC scripts/kconfig/preprocess.o
HOSTCC scripts/kconfig/symbol.o
HOSTCC scripts/kconfig/util.o
HOSTCC scripts/kconfig/lexer.lex.o
HOSTCC scripts/kconfig/parser.tab.o
HOSTLD scripts/kconfig/conf
#
# configuration written to .config
#
+ [[ x86_64 == \x\8\6\_\6\4 ]]
+ /home/kwilczynski/Projects/Personal/Linux/linux/scripts/kconfig/merge_config.sh .config /home/kwilczynski/defconfig
+ make C=0 W=1 ARCH=x86_64 CROSS_COMPILE=x86_64-linux-gnu- oldconfig
#
# No change to .config
#
+ [[ -z 1 ]]
+ /home/kwilczynski/Projects/Personal/Linux/linux/scripts/config -e CONFIG_LOCALVERSION_AUTO
+ /home/kwilczynski/Projects/Personal/Linux/linux/scripts/config -e CONFIG_EARLY_PRINTK
+ /home/kwilczynski/Projects/Personal/Linux/linux/scripts/config -e CONFIG_STACKTRACE
+ /home/kwilczynski/Projects/Personal/Linux/linux/scripts/config -e CONFIG_KMEMCHECK
+ /home/kwilczynski/Projects/Personal/Linux/linux/scripts/config -e CONFIG_FRAME_POINTER
+ /home/kwilczynski/Projects/Personal/Linux/linux/scripts/config -e CONFIG_CONFIGFS_FS
+ /home/kwilczynski/Projects/Personal/Linux/linux/scripts/config -e CONFIG_DYNAMIC_DEBUG
+ /home/kwilczynski/Projects/Personal/Linux/linux/scripts/config -e CONFIG_PCI_DEBUG
+ /home/kwilczynski/Projects/Personal/Linux/linux/scripts/config -e CONFIG_DEBUG_INFO
+ /home/kwilczynski/Projects/Personal/Linux/linux/scripts/config -e CONFIG_DEBUG_KERNEL
+ [[ -z '' ]]
+ make C=0 W=1 ARCH=x86_64 CROSS_COMPILE=x86_64-linux-gnu-
SYNC include/config/auto.conf.cmd
SYSHDR arch/x86/include/generated/uapi/asm/unistd_32.h
SYSHDR arch/x86/include/generated/uapi/asm/unistd_64.h
SYSHDR arch/x86/include/generated/uapi/asm/unistd_x32.h
SYSTBL arch/x86/include/generated/asm/syscalls_32.h
SYSHDR arch/x86/include/generated/asm/unistd_32_ia32.h
SYSHDR arch/x86/include/generated/asm/unistd_64_x32.h
SYSTBL arch/x86/include/generated/asm/syscalls_64.h
WRAP arch/x86/include/generated/uapi/asm/bpf_perf_event.h
WRAP arch/x86/include/generated/uapi/asm/errno.h
WRAP arch/x86/include/generated/uapi/asm/ioctls.h
WRAP arch/x86/include/generated/uapi/asm/fcntl.h
WRAP arch/x86/include/generated/uapi/asm/ioctl.h
WRAP arch/x86/include/generated/uapi/asm/ipcbuf.h
WRAP arch/x86/include/generated/uapi/asm/param.h
WRAP arch/x86/include/generated/uapi/asm/resource.h
WRAP arch/x86/include/generated/uapi/asm/socket.h
WRAP arch/x86/include/generated/uapi/asm/sockios.h
WRAP arch/x86/include/generated/uapi/asm/termbits.h
WRAP arch/x86/include/generated/uapi/asm/poll.h
WRAP arch/x86/include/generated/uapi/asm/termios.h
WRAP arch/x86/include/generated/uapi/asm/types.h
HOSTCC arch/x86/tools/relocs_32.o
HOSTCC arch/x86/tools/relocs_64.o
HOSTCC arch/x86/tools/relocs_common.o
WRAP arch/x86/include/generated/asm/early_ioremap.h
WRAP arch/x86/include/generated/asm/export.h
WRAP arch/x86/include/generated/asm/mcs_spinlock.h
WRAP arch/x86/include/generated/asm/irq_regs.h
WRAP arch/x86/include/generated/asm/kmap_size.h
WRAP arch/x86/include/generated/asm/local64.h
WRAP arch/x86/include/generated/asm/mmiowb.h
WRAP arch/x86/include/generated/asm/module.lds.h
WRAP arch/x86/include/generated/asm/rwonce.h
WRAP arch/x86/include/generated/asm/unaligned.h
UPD include/generated/uapi/linux/version.h
HOSTCC scripts/kallsyms
HOSTCC scripts/sorttable
HOSTCC scripts/asn1_compiler
HOSTCC scripts/selinux/genheaders/genheaders
HOSTCC scripts/selinux/mdp/mdp
HOSTCC scripts/extract-cert
DESCEND objtool
HOSTCC /home/kwilczynski/Development/Projects/Personal/Linux/linux/tools/objtool/fixdep.o
HOSTLD /home/kwilczynski/Development/Projects/Personal/Linux/linux/tools/objtool/fixdep-in.o
LINK /home/kwilczynski/Development/Projects/Personal/Linux/linux/tools/objtool/fixdep
CC /home/kwilczynski/Development/Projects/Personal/Linux/linux/tools/objtool/exec-cmd.o
CC /home/kwilczynski/Development/Projects/Personal/Linux/linux/tools/objtool/weak.o
CC /home/kwilczynski/Development/Projects/Personal/Linux/linux/tools/objtool/check.o
CC /home/kwilczynski/Development/Projects/Personal/Linux/linux/tools/objtool/help.o
CC /home/kwilczynski/Development/Projects/Personal/Linux/linux/tools/objtool/pager.o
CC /home/kwilczynski/Development/Projects/Personal/Linux/linux/tools/objtool/special.o
CC /home/kwilczynski/Development/Projects/Personal/Linux/linux/tools/objtool/parse-options.o
CC /home/kwilczynski/Development/Projects/Personal/Linux/linux/tools/objtool/arch/x86/special.o
CC /home/kwilczynski/Development/Projects/Personal/Linux/linux/tools/objtool/arch/x86/decode.o
CC /home/kwilczynski/Development/Projects/Personal/Linux/linux/tools/objtool/run-command.o
HOSTLD arch/x86/tools/relocs
CC /home/kwilczynski/Development/Projects/Personal/Linux/linux/tools/objtool/orc_gen.o
CC /home/kwilczynski/Development/Projects/Personal/Linux/linux/tools/objtool/orc_dump.o
CC /home/kwilczynski/Development/Projects/Personal/Linux/linux/tools/objtool/builtin-check.o
CC /home/kwilczynski/Development/Projects/Personal/Linux/linux/tools/objtool/sigchain.o
CC /home/kwilczynski/Development/Projects/Personal/Linux/linux/tools/objtool/subcmd-config.o
CC /home/kwilczynski/Development/Projects/Personal/Linux/linux/tools/objtool/builtin-orc.o
CC /home/kwilczynski/Development/Projects/Personal/Linux/linux/tools/objtool/elf.o
CC /home/kwilczynski/Development/Projects/Personal/Linux/linux/tools/objtool/objtool.o
CC /home/kwilczynski/Development/Projects/Personal/Linux/linux/tools/objtool/libstring.o
CC /home/kwilczynski/Development/Projects/Personal/Linux/linux/tools/objtool/libctype.o
CC /home/kwilczynski/Development/Projects/Personal/Linux/linux/tools/objtool/str_error_r.o
CC /home/kwilczynski/Development/Projects/Personal/Linux/linux/tools/objtool/librbtree.o
UPD include/config/kernel.release
UPD include/generated/utsrelease.h
CC scripts/mod/empty.o
HOSTCC scripts/mod/mk_elfconfig
CC scripts/mod/devicetable-offsets.s
UPD scripts/mod/devicetable-offsets.h
MKELF scripts/mod/elfconfig.h
HOSTCC scripts/mod/modpost.o
HOSTCC scripts/mod/file2alias.o
HOSTCC scripts/mod/sumversion.o
LD /home/kwilczynski/Development/Projects/Personal/Linux/linux/tools/objtool/libsubcmd-in.o
AR /home/kwilczynski/Development/Projects/Personal/Linux/linux/tools/objtool/libsubcmd.a
LD /home/kwilczynski/Development/Projects/Personal/Linux/linux/tools/objtool/arch/x86/objtool-in.o
HOSTLD scripts/mod/modpost
CC kernel/bounds.s
CALL scripts/atomic/check-atomics.sh
UPD include/generated/timeconst.h
UPD include/generated/bounds.h
CC arch/x86/kernel/asm-offsets.s
LD /home/kwilczynski/Development/Projects/Personal/Linux/linux/tools/objtool/objtool-in.o
LINK /home/kwilczynski/Development/Projects/Personal/Linux/linux/tools/objtool/objtool
UPD include/generated/asm-offsets.h
CALL scripts/checksyscalls.sh
CC init/main.o
CHK include/generated/compile.h
CC init/do_mounts.o
CC init/do_mounts_initrd.o
CC init/initramfs.o
CC init/calibrate.o
HOSTCC usr/gen_init_cpio
CC init/init_task.o
UPD include/generated/compile.h
CC arch/x86/realmode/init.o
CC certs/system_keyring.o
CC arch/x86/events/amd/core.o
CC arch/x86/mm/pat/set_memory.o
CC arch/x86/kernel/fpu/init.o
CC mm/filemap.o
CC kernel/sched/core.o
CC arch/x86/entry/vdso/vma.o
GEN usr/initramfs_data.cpio
SHIPPED usr/initramfs_inc_data
AS usr/initramfs_data.o
CC kernel/locking/mutex.o
AR usr/built-in.a
CC kernel/power/qos.o
certs/system_keyring.c:43: warning: Function parameter or member 'dest_keyring' not described in 'restrict_link_by_builtin_trusted'
certs/system_keyring.c:43: warning: Function parameter or member 'type' not described in 'restrict_link_by_builtin_trusted'
certs/system_keyring.c:43: warning: Function parameter or member 'payload' not described in 'restrict_link_by_builtin_trusted'
certs/system_keyring.c:43: warning: Function parameter or member 'restriction_key' not described in 'restrict_link_by_builtin_trusted'
certs/system_keyring.c:43: warning: expecting prototype for restrict_link_to_builtin_trusted(). Prototype was for restrict_link_by_builtin_trusted() instead
certs/system_keyring.c:62: warning: Function parameter or member 'dest_keyring' not described in 'restrict_link_by_builtin_and_secondary_trusted'
certs/system_keyring.c:62: warning: Function parameter or member 'type' not described in 'restrict_link_by_builtin_and_secondary_trusted'
certs/system_keyring.c:62: warning: Function parameter or member 'payload' not described in 'restrict_link_by_builtin_and_secondary_trusted'
certs/system_keyring.c:62: warning: Function parameter or member 'restrict_key' not described in 'restrict_link_by_builtin_and_secondary_trusted'
certs/system_keyring.c:77: warning: This comment starts with '/**', but isn't a kernel-doc comment. Refer Documentation/doc-guide/kernel-doc.rst
* Allocate a struct key_restriction for the "builtin and secondary trust"
EXTRACT_CERTS
CC certs/common.o
AS certs/system_certificates.o
AS arch/x86/realmode/rm/header.o
AR certs/built-in.a
CC kernel/power/main.o
AS arch/x86/realmode/rm/trampoline_64.o
CC arch/x86/kernel/fpu/bugs.o
AS arch/x86/realmode/rm/stack.o
AS arch/x86/realmode/rm/reboot.o
CC arch/x86/mm/init.o
AS arch/x86/realmode/rm/wakeup_asm.o
CC arch/x86/realmode/rm/wakemain.o
CC arch/x86/entry/vdso/extable.o
init/main.c:774:20: error: no previous prototype for ‘mem_encrypt_init’ [-Werror=missing-prototypes]
774 | void __init __weak mem_encrypt_init(void) { }
| ^~~~~~~~~~~~~~~~
kernel/sched/core.c:3416:6: error: no previous prototype for ‘sched_set_stop_task’ [-Werror=missing-prototypes]
3416 | void sched_set_stop_task(int cpu, struct task_struct *stop)
| ^~~~~~~~~~~~~~~~~~~
CC arch/x86/realmode/rm/video-mode.o
CC arch/x86/entry/vdso/vdso32-setup.o
AS arch/x86/realmode/rm/copy.o
CC arch/x86/events/amd/ibs.o
CC arch/x86/events/amd/uncore.o
AS arch/x86/realmode/rm/bioscall.o
CC arch/x86/realmode/rm/regs.o
CC arch/x86/realmode/rm/video-vga.o
LDS arch/x86/entry/vdso/vdso.lds
AS arch/x86/entry/vdso/vdso-note.o
CC kernel/locking/semaphore.o
CC arch/x86/entry/vdso/vclock_gettime.o
CC arch/x86/realmode/rm/video-vesa.o
CC kernel/locking/rwsem.o
CC arch/x86/realmode/rm/video-bios.o
CC arch/x86/kernel/fpu/core.o
cc1: all warnings being treated as errors
make[1]: *** [scripts/Makefile.build:277: init/main.o] Error 1
make[1]: *** Waiting for unfinished jobs....
CC arch/x86/kernel/fpu/regset.o
make: *** [Makefile:1872: init] Error 2
make: *** Waiting for unfinished jobs....
CC arch/x86/kernel/fpu/signal.o
PASYMS arch/x86/realmode/rm/pasyms.h
LDS arch/x86/realmode/rm/realmode.lds
LD arch/x86/realmode/rm/realmode.elf
RELOCS arch/x86/realmode/rm/realmode.relocs
OBJCOPY arch/x86/realmode/rm/realmode.bin
AS arch/x86/realmode/rmpiggy.o
AR arch/x86/realmode/built-in.a
CC arch/x86/entry/vdso/vgetcpu.o
AR arch/x86/crypto/built-in.a
CC arch/x86/events/amd/iommu.o
HOSTCC arch/x86/entry/vdso/vdso2c
CC kernel/power/console.o
CC arch/x86/mm/pat/memtype.o
arch/x86/entry/vdso/vgetcpu.c:14:1: error: no previous prototype for ‘__vdso_getcpu’ [-Werror=missing-prototypes]
14 | __vdso_getcpu(unsigned *cpu, unsigned *node, struct getcpu_cache *unused)
| ^~~~~~~~~~~~~
CC arch/x86/mm/init_64.o
cc1: all warnings being treated as errors
make[3]: *** [scripts/Makefile.build:277: arch/x86/entry/vdso/vgetcpu.o] Error 1
make[3]: *** Waiting for unfinished jobs....
CC kernel/locking/percpu-rwsem.o
CC arch/x86/entry/vsyscall/vsyscall_64.o
CC kernel/power/process.o
make[2]: *** [scripts/Makefile.build:540: arch/x86/entry/vdso] Error 2
make[2]: *** Waiting for unfinished jobs....
CC kernel/power/suspend.o
CC kernel/locking/spinlock.o
CC kernel/locking/osq_lock.o
CC arch/x86/kernel/fpu/xstate.o
AS arch/x86/entry/vsyscall/vsyscall_emu_64.o
CC kernel/locking/qspinlock.o
CC kernel/locking/rtmutex_api.o
AR arch/x86/events/amd/built-in.a
CC arch/x86/events/intel/core.o
CC kernel/power/hibernate.o
CC arch/x86/ia32/ia32_signal.o
CC kernel/printk/printk.o
CC arch/x86/ia32/audit.o
CC arch/x86/mm/pat/memtype_interval.o
arch/x86/mm/pat/memtype.c:744: warning: Function parameter or member 'pfn' not described in 'pat_pfn_immune_to_uc_mtrr'
CC kernel/locking/qrwlock.o
CC kernel/printk/printk_safe.o
AR arch/x86/entry/vsyscall/built-in.a
make[1]: *** [scripts/Makefile.build:540: arch/x86/entry] Error 2
make[1]: *** Waiting for unfinished jobs....
CC kernel/printk/printk_ringbuffer.o
CC kernel/power/snapshot.o
CC kernel/power/swap.o
CC kernel/power/user.o
kernel/printk/printk.c: In function ‘printk_sprint’:
kernel/printk/printk.c:2075:2: error: function ‘printk_sprint’ might be a candidate for ‘gnu_printf’ format attribute [-Werror=suggest-attribute=format]
2075 | text_len = vscnprintf(text, size, fmt, args);
| ^~~~~~~~
kernel/power/hibernate.c:275:12: error: no previous prototype for ‘arch_resume_nosmt’ [-Werror=missing-prototypes]
275 | __weak int arch_resume_nosmt(void)
| ^~~~~~~~~~~~~~~~~
CC kernel/power/poweroff.o
AR kernel/locking/built-in.a
CC kernel/irq/irqdesc.o
AR arch/x86/mm/pat/built-in.a
CC arch/x86/kernel/cpu/mce/core.o
AR arch/x86/kernel/fpu/built-in.a
AR arch/x86/ia32/built-in.a
CC arch/x86/kernel/cpu/mtrr/mtrr.o
CC arch/x86/mm/fault.o
CC arch/x86/kernel/cpu/mtrr/if.o
CC arch/x86/kernel/cpu/mtrr/generic.o
CC arch/x86/kernel/cpu/mtrr/cleanup.o
cc1: all warnings being treated as errors
make[2]: *** [scripts/Makefile.build:277: kernel/power/hibernate.o] Error 1
make[2]: *** Waiting for unfinished jobs....
CC arch/x86/kernel/cpu/mce/severity.o
CC mm/mempool.o
CC mm/oom_kill.o
CC mm/fadvise.o
CC kernel/irq/handle.o
CC kernel/irq/manage.o
cc1: all warnings being treated as errors
make[2]: *** [scripts/Makefile.build:277: kernel/printk/printk.o] Error 1
make[1]: *** [scripts/Makefile.build:540: kernel/printk] Error 2
make[1]: *** Waiting for unfinished jobs....
CC kernel/irq/spurious.o
CC kernel/irq/resend.o
arch/x86/kernel/cpu/mtrr/generic.c:120: warning: Function parameter or member 'start' not described in 'mtrr_type_lookup_fixed'
arch/x86/kernel/cpu/mtrr/generic.c:120: warning: Function parameter or member 'end' not described in 'mtrr_type_lookup_fixed'
arch/x86/kernel/cpu/mtrr/generic.c:161: warning: Function parameter or member 'start' not described in 'mtrr_type_lookup_variable'
arch/x86/kernel/cpu/mtrr/generic.c:161: warning: Function parameter or member 'end' not described in 'mtrr_type_lookup_variable'
arch/x86/kernel/cpu/mtrr/generic.c:161: warning: Function parameter or member 'partial_end' not described in 'mtrr_type_lookup_variable'
arch/x86/kernel/cpu/mtrr/generic.c:161: warning: Function parameter or member 'repeat' not described in 'mtrr_type_lookup_variable'
arch/x86/kernel/cpu/mtrr/generic.c:161: warning: Function parameter or member 'uniform' not described in 'mtrr_type_lookup_variable'
arch/x86/kernel/cpu/mtrr/generic.c:255: warning: Function parameter or member 'start' not described in 'mtrr_type_lookup'
arch/x86/kernel/cpu/mtrr/generic.c:255: warning: Function parameter or member 'end' not described in 'mtrr_type_lookup'
arch/x86/kernel/cpu/mtrr/generic.c:255: warning: Function parameter or member 'uniform' not described in 'mtrr_type_lookup'
CC arch/x86/kernel/cpu/mce/genpool.o
AR arch/x86/kernel/cpu/mtrr/built-in.a
CC arch/x86/kernel/cpu/microcode/core.o
CC arch/x86/kernel/cpu/mce/intel.o
kernel/power/swap.c:91: warning: This comment starts with '/**', but isn't a kernel-doc comment. Refer Documentation/doc-guide/kernel-doc.rst
* The swap_map_handle structure is used for handling swap in
kernel/power/swap.c:118: warning: This comment starts with '/**', but isn't a kernel-doc comment. Refer Documentation/doc-guide/kernel-doc.rst
* The following functions are used for tracing the allocated
kernel/power/swap.c:177: warning: Function parameter or member 'swap' not described in 'alloc_swapdev_block'
kernel/power/swap.c:197: warning: Function parameter or member 'swap' not described in 'free_all_swap_pages'
kernel/power/swap.c:541: warning: Function parameter or member 'handle' not described in 'save_image'
kernel/power/swap.c:541: warning: Function parameter or member 'snapshot' not described in 'save_image'
kernel/power/swap.c:541: warning: Function parameter or member 'nr_to_write' not described in 'save_image'
kernel/power/swap.c:583: warning: This comment starts with '/**', but isn't a kernel-doc comment. Refer Documentation/doc-guide/kernel-doc.rst
* Structure used for CRC32.
kernel/power/swap.c:598: warning: This comment starts with '/**', but isn't a kernel-doc comment. Refer Documentation/doc-guide/kernel-doc.rst
* CRC32 update function that runs in its own thread.
kernel/power/swap.c:625: warning: This comment starts with '/**', but isn't a kernel-doc comment. Refer Documentation/doc-guide/kernel-doc.rst
* Structure used for LZO data compression.
kernel/power/swap.c:642: warning: This comment starts with '/**', but isn't a kernel-doc comment. Refer Documentation/doc-guide/kernel-doc.rst
* Compression function that runs in its own thread.
kernel/power/swap.c:891: warning: Function parameter or member 'nr_pages' not described in 'enough_swap'
kernel/power/swap.c:953: warning: This comment starts with '/**', but isn't a kernel-doc comment. Refer Documentation/doc-guide/kernel-doc.rst
* The following functions allow us to read data using a swap map
kernel/power/swap.c:1062: warning: Function parameter or member 'handle' not described in 'load_image'
kernel/power/swap.c:1062: warning: Function parameter or member 'snapshot' not described in 'load_image'
kernel/power/swap.c:1062: warning: Function parameter or member 'nr_to_read' not described in 'load_image'
kernel/power/swap.c:1112: warning: This comment starts with '/**', but isn't a kernel-doc comment. Refer Documentation/doc-guide/kernel-doc.rst
* Structure used for LZO data decompression.
kernel/power/swap.c:1128: warning: This comment starts with '/**', but isn't a kernel-doc comment. Refer Documentation/doc-guide/kernel-doc.rst
* Decompression function that runs in its own thread.
kernel/power/swap.c:1566: warning: Function parameter or member 'mode' not described in 'swsusp_close'
CC arch/x86/kernel/cpu/microcode/intel.o
cc1: all warnings being treated as errors
make[2]: *** [scripts/Makefile.build:277: kernel/sched/core.o] Error 1
make[1]: *** [scripts/Makefile.build:540: kernel/sched] Error 2
CC arch/x86/kernel/cpu/mce/amd.o
kernel/power/snapshot.c:330: warning: This comment starts with '/**', but isn't a kernel-doc comment. Refer Documentation/doc-guide/kernel-doc.rst
* Data types related to memory bitmaps.
kernel/power/snapshot.c:438: warning: Function parameter or member 'gfp_mask' not described in 'alloc_rtree_node'
kernel/power/snapshot.c:438: warning: Function parameter or member 'safe_needed' not described in 'alloc_rtree_node'
kernel/power/snapshot.c:438: warning: Function parameter or member 'ca' not described in 'alloc_rtree_node'
kernel/power/snapshot.c:438: warning: Function parameter or member 'list' not described in 'alloc_rtree_node'
kernel/power/snapshot.c:463: warning: Function parameter or member 'zone' not described in 'add_rtree_block'
kernel/power/snapshot.c:463: warning: Function parameter or member 'gfp_mask' not described in 'add_rtree_block'
kernel/power/snapshot.c:463: warning: Function parameter or member 'safe_needed' not described in 'add_rtree_block'
kernel/power/snapshot.c:463: warning: Function parameter or member 'ca' not described in 'add_rtree_block'
kernel/power/snapshot.c:536: warning: Function parameter or member 'gfp_mask' not described in 'create_zone_bm_rtree'
kernel/power/snapshot.c:536: warning: Function parameter or member 'safe_needed' not described in 'create_zone_bm_rtree'
kernel/power/snapshot.c:536: warning: Function parameter or member 'ca' not described in 'create_zone_bm_rtree'
kernel/power/snapshot.c:536: warning: Function parameter or member 'start' not described in 'create_zone_bm_rtree'
kernel/power/snapshot.c:536: warning: Function parameter or member 'end' not described in 'create_zone_bm_rtree'
kernel/power/snapshot.c:571: warning: Function parameter or member 'zone' not described in 'free_zone_bm_rtree'
kernel/power/snapshot.c:571: warning: Function parameter or member 'clear_nosave_free' not described in 'free_zone_bm_rtree'
kernel/power/snapshot.c:678: warning: Function parameter or member 'bm' not described in 'memory_bm_create'
kernel/power/snapshot.c:678: warning: Function parameter or member 'gfp_mask' not described in 'memory_bm_create'
kernel/power/snapshot.c:678: warning: Function parameter or member 'safe_needed' not described in 'memory_bm_create'
kernel/power/snapshot.c:720: warning: Function parameter or member 'clear_nosave_free' not described in 'memory_bm_free'
kernel/power/snapshot.c:742: warning: Function parameter or member 'bm' not described in 'memory_bm_find_bit'
kernel/power/snapshot.c:742: warning: Function parameter or member 'pfn' not described in 'memory_bm_find_bit'
kernel/power/snapshot.c:742: warning: Function parameter or member 'addr' not described in 'memory_bm_find_bit'
kernel/power/snapshot.c:742: warning: Function parameter or member 'bit_nr' not described in 'memory_bm_find_bit'
kernel/power/snapshot.c:916: warning: expecting prototype for memory_bm_rtree_next_pfn(). Prototype was for memory_bm_next_pfn() instead
kernel/power/snapshot.c:983: warning: Function parameter or member 'start_pfn' not described in '__register_nosave_region'
kernel/power/snapshot.c:983: warning: Function parameter or member 'end_pfn' not described in '__register_nosave_region'
kernel/power/snapshot.c:983: warning: Function parameter or member 'use_kmalloc' not described in '__register_nosave_region'
kernel/power/snapshot.c:983: warning: expecting prototype for register_nosave_region(). Prototype was for __register_nosave_region() instead
kernel/power/snapshot.c:1261: warning: Function parameter or member 'zone' not described in 'saveable_highmem_page'
kernel/power/snapshot.c:1261: warning: Function parameter or member 'pfn' not described in 'saveable_highmem_page'
kernel/power/snapshot.c:1325: warning: Function parameter or member 'zone' not described in 'saveable_page'
kernel/power/snapshot.c:1325: warning: Function parameter or member 'pfn' not described in 'saveable_page'
kernel/power/snapshot.c:1396: warning: Function parameter or member 'dst' not described in 'safe_copy_page'
kernel/power/snapshot.c:1396: warning: Function parameter or member 's_page' not described in 'safe_copy_page'
kernel/power/snapshot.c:1609: warning: Function parameter or member 'x' not described in '__fraction'
kernel/power/snapshot.c:1609: warning: Function parameter or member 'multiplier' not described in '__fraction'
kernel/power/snapshot.c:1609: warning: Function parameter or member 'base' not described in '__fraction'
kernel/power/snapshot.c:1900: warning: Function parameter or member 'nr_highmem' not described in 'count_pages_for_highmem'
CC kernel/irq/chip.o
kernel/power/snapshot.c:1918: warning: Function parameter or member 'nr_pages' not described in 'enough_free_mem'
kernel/power/snapshot.c:1918: warning: Function parameter or member 'nr_highmem' not described in 'enough_free_mem'
kernel/power/snapshot.c:1941: warning: Function parameter or member 'safe_needed' not described in 'get_highmem_buffer'
kernel/power/snapshot.c:1954: warning: Function parameter or member 'bm' not described in 'alloc_highmem_pages'
kernel/power/snapshot.c:1954: warning: Function parameter or member 'nr_highmem' not described in 'alloc_highmem_pages'
kernel/power/snapshot.c:1954: warning: expecting prototype for alloc_highmem_image_pages(). Prototype was for alloc_highmem_pages() instead
kernel/power/snapshot.c:1989: warning: Function parameter or member 'copy_bm' not described in 'swsusp_alloc'
kernel/power/snapshot.c:1989: warning: Function parameter or member 'nr_pages' not described in 'swsusp_alloc'
kernel/power/snapshot.c:1989: warning: Function parameter or member 'nr_highmem' not described in 'swsusp_alloc'
kernel/power/snapshot.c:2202: warning: Function parameter or member 'bm' not described in 'mark_unsafe_pages'
kernel/power/snapshot.c:2237: warning: Function parameter or member 'info' not described in 'load_header'
kernel/power/snapshot.c:2237: warning: expecting prototype for load header(). Prototype was for load_header() instead
kernel/power/snapshot.c:2391: warning: Function parameter or member 'page' not described in 'get_highmem_page_buffer'
kernel/power/snapshot.c:2391: warning: Function parameter or member 'ca' not described in 'get_highmem_page_buffer'
kernel/power/snapshot.c:2576: warning: Function parameter or member 'bm' not described in 'get_buffer'
kernel/power/snapshot.c:2576: warning: Function parameter or member 'ca' not described in 'get_buffer'
kernel/power/snapshot.c:2700: warning: Function parameter or member 'handle' not described in 'snapshot_write_finalize'
make[1]: *** [scripts/Makefile.build:540: kernel/power] Error 2
CC kernel/irq/dummychip.o
CC kernel/irq/devres.o
CC mm/maccess.o
CC kernel/irq/autoprobe.o
CC arch/x86/mm/ioremap.o
CC arch/x86/kernel/cpu/mce/threshold.o
CC arch/x86/events/intel/bts.o
CC arch/x86/events/zhaoxin/core.o
CC kernel/irq/irqdomain.o
CC kernel/irq/proc.o
CC arch/x86/events/intel/ds.o
CC kernel/irq/migration.o
CC kernel/irq/cpuhotplug.o
CC arch/x86/kernel/cpu/microcode/amd.o
CC mm/page-writeback.o
arch/x86/mm/ioremap.c:720:17: error: no previous prototype for ‘early_memremap_pgprot_adjust’ [-Werror=missing-prototypes]
720 | pgprot_t __init early_memremap_pgprot_adjust(resource_size_t phys_addr,
| ^~~~~~~~~~~~~~~~~~~~~~~~~~~~
CC mm/readahead.o
CC kernel/irq/pm.o
cc1: all warnings being treated as errors
CC mm/swap.o
make[2]: *** [scripts/Makefile.build:277: arch/x86/mm/ioremap.o] Error 1
make[1]: *** [scripts/Makefile.build:540: arch/x86/mm] Error 2
CC kernel/irq/msi.o
CC arch/x86/kernel/acpi/boot.o
CC kernel/irq/affinity.o
CC arch/x86/kernel/cpu/cacheinfo.o
CC kernel/irq/matrix.o
AR arch/x86/events/zhaoxin/built-in.a
CC arch/x86/events/core.o
CC arch/x86/events/intel/knc.o
AR arch/x86/kernel/cpu/mce/built-in.a
CC arch/x86/kernel/cpu/scattered.o
AR arch/x86/kernel/cpu/microcode/built-in.a
CC arch/x86/kernel/acpi/sleep.o
kernel/irq/irqdomain.c:114: warning: Function parameter or member 'fwnode' not described in 'irq_domain_free_fwnode'
kernel/irq/irqdomain.c:945: warning: Function parameter or member 'd' not described in 'irq_domain_xlate_onecell'
kernel/irq/irqdomain.c:945: warning: Function parameter or member 'ctrlr' not described in 'irq_domain_xlate_onecell'
kernel/irq/irqdomain.c:945: warning: Function parameter or member 'intspec' not described in 'irq_domain_xlate_onecell'
kernel/irq/irqdomain.c:945: warning: Function parameter or member 'intsize' not described in 'irq_domain_xlate_onecell'
kernel/irq/irqdomain.c:945: warning: Function parameter or member 'out_hwirq' not described in 'irq_domain_xlate_onecell'
kernel/irq/irqdomain.c:945: warning: Function parameter or member 'out_type' not described in 'irq_domain_xlate_onecell'
kernel/irq/irqdomain.c:964: warning: Function parameter or member 'd' not described in 'irq_domain_xlate_twocell'
kernel/irq/irqdomain.c:964: warning: Function parameter or member 'ctrlr' not described in 'irq_domain_xlate_twocell'
kernel/irq/irqdomain.c:964: warning: Function parameter or member 'intspec' not described in 'irq_domain_xlate_twocell'
kernel/irq/irqdomain.c:964: warning: Function parameter or member 'intsize' not described in 'irq_domain_xlate_twocell'
kernel/irq/irqdomain.c:964: warning: Function parameter or member 'out_hwirq' not described in 'irq_domain_xlate_twocell'
kernel/irq/irqdomain.c:964: warning: Function parameter or member 'out_type' not described in 'irq_domain_xlate_twocell'
kernel/irq/irqdomain.c:987: warning: Function parameter or member 'd' not described in 'irq_domain_xlate_onetwocell'
kernel/irq/irqdomain.c:987: warning: Function parameter or member 'ctrlr' not described in 'irq_domain_xlate_onetwocell'
kernel/irq/irqdomain.c:987: warning: Function parameter or member 'intspec' not described in 'irq_domain_xlate_onetwocell'
kernel/irq/irqdomain.c:987: warning: Function parameter or member 'intsize' not described in 'irq_domain_xlate_onetwocell'
kernel/irq/irqdomain.c:987: warning: Function parameter or member 'out_hwirq' not described in 'irq_domain_xlate_onetwocell'
kernel/irq/irqdomain.c:987: warning: Function parameter or member 'out_type' not described in 'irq_domain_xlate_onetwocell'
kernel/irq/irqdomain.c:1012: warning: Function parameter or member 'd' not described in 'irq_domain_translate_onecell'
kernel/irq/irqdomain.c:1012: warning: Function parameter or member 'fwspec' not described in 'irq_domain_translate_onecell'
kernel/irq/irqdomain.c:1012: warning: Function parameter or member 'out_hwirq' not described in 'irq_domain_translate_onecell'
kernel/irq/irqdomain.c:1012: warning: Function parameter or member 'out_type' not described in 'irq_domain_translate_onecell'
kernel/irq/irqdomain.c:1033: warning: Function parameter or member 'd' not described in 'irq_domain_translate_twocell'
kernel/irq/irqdomain.c:1033: warning: Function parameter or member 'fwspec' not described in 'irq_domain_translate_twocell'
kernel/irq/irqdomain.c:1033: warning: Function parameter or member 'out_hwirq' not described in 'irq_domain_translate_twocell'
kernel/irq/irqdomain.c:1033: warning: Function parameter or member 'out_type' not described in 'irq_domain_translate_twocell'
AS arch/x86/kernel/acpi/wakeup_64.o
CC arch/x86/kernel/acpi/cppc_msr.o
CC arch/x86/kernel/acpi/cstate.o
CC arch/x86/kernel/cpu/topology.o
CC arch/x86/kernel/cpu/common.o
CC arch/x86/kernel/cpu/rdrand.o
CC arch/x86/kernel/cpu/match.o
CC arch/x86/events/intel/lbr.o
CC mm/truncate.o
CC mm/vmscan.o
CC mm/shmem.o
CC mm/util.o
CC arch/x86/events/intel/p4.o
CC arch/x86/events/intel/p6.o
CC arch/x86/events/intel/pt.o
AR arch/x86/kernel/acpi/built-in.a
CC arch/x86/kernel/apic/apic.o
CC arch/x86/kernel/cpu/bugs.o
AR kernel/irq/built-in.a
make: *** [Makefile:1872: kernel] Error 2
CC arch/x86/kernel/cpu/aperfmperf.o
CC mm/mmzone.o
mm/vmscan.c: In function ‘demote_page_list’:
mm/vmscan.c:1340:6: error: variable ‘err’ set but not used [-Werror=unused-but-set-variable]
1340 | int err;
| ^~~
CC arch/x86/events/intel/uncore.o
CC mm/vmstat.o
CC arch/x86/kernel/cpu/cpuid-deps.o
CC arch/x86/events/intel/uncore_nhmex.o
CC arch/x86/events/intel/uncore_snb.o
CC mm/backing-dev.o
CC mm/mm_init.o
CC arch/x86/kernel/cpu/umwait.o
CC arch/x86/kernel/cpu/proc.o
CC arch/x86/events/probe.o
CC arch/x86/events/intel/uncore_snbep.o
MKCAP arch/x86/kernel/cpu/capflags.c
arch/x86/events/intel/pt.c:729: warning: Function parameter or member 'cpu' not described in 'topa_insert_pages'
arch/x86/events/intel/pt.c:1196: warning: Function parameter or member 'cpu' not described in 'pt_buffer_init_topa'
arch/x86/events/intel/pt.c:1196: warning: Function parameter or member 'nr_pages' not described in 'pt_buffer_init_topa'
arch/x86/events/intel/pt.c:1196: warning: Excess function parameter 'size' description in 'pt_buffer_init_topa'
arch/x86/events/intel/pt.c:1269: warning: Function parameter or member 'event' not described in 'pt_buffer_setup_aux'
arch/x86/events/intel/pt.c:1269: warning: Excess function parameter 'cpu' description in 'pt_buffer_setup_aux'
CC arch/x86/events/intel/uncore_discovery.o
CC arch/x86/kernel/cpu/powerflags.o
CC mm/percpu.o
CC arch/x86/kernel/cpu/feat_ctl.o
CC arch/x86/kernel/cpu/intel.o
arch/x86/kernel/cpu/feat_ctl.c:105:6: error: no previous prototype for ‘init_ia32_feat_ctl’ [-Werror=missing-prototypes]
105 | void init_ia32_feat_ctl(struct cpuinfo_x86 *c)
| ^~~~~~~~~~~~~~~~~~
CC arch/x86/kernel/cpu/intel_pconfig.o
cc1: all warnings being treated as errors
make[3]: *** [scripts/Makefile.build:277: arch/x86/kernel/cpu/feat_ctl.o] Error 1
make[3]: *** Waiting for unfinished jobs....
CC mm/slab_common.o
arch/x86/kernel/apic/apic.c:2187: warning: Function parameter or member 'spurious_interrupt' not described in 'DEFINE_IDTENTRY_IRQ'
arch/x86/kernel/apic/apic.c:2187: warning: expecting prototype for spurious_interrupt(). Prototype was for DEFINE_IDTENTRY_IRQ() instead
CC arch/x86/kernel/apic/apic_common.o
CC arch/x86/events/intel/cstate.o
CC arch/x86/kernel/apic/apic_noop.o
CC mm/compaction.o
CC mm/vmacache.o
CC arch/x86/kernel/apic/ipi.o
CC arch/x86/kernel/apic/vector.o
CC mm/interval_tree.o
CC mm/list_lru.o
CC arch/x86/kernel/kprobes/core.o
CC mm/workingset.o
CC arch/x86/kernel/apic/hw_nmi.o
CC arch/x86/kernel/kprobes/opt.o
CC arch/x86/kernel/apic/io_apic.o
CC arch/x86/kernel/apic/msi.o
arch/x86/kernel/kprobes/core.c:1057:24: error: no previous prototype for ‘trampoline_handler’ [-Werror=missing-prototypes]
1057 | __used __visible void *trampoline_handler(struct pt_regs *regs)
| ^~~~~~~~~~~~~~~~~~
cc1: all warnings being treated as errors
make[1]: *** [scripts/Makefile.build:277: mm/vmscan.o] Error 1
make[1]: *** Waiting for unfinished jobs....
CC arch/x86/kernel/apic/apic_flat_64.o
CC arch/x86/kernel/apic/probe_64.o
CC arch/x86/events/rapl.o
CC arch/x86/events/msr.o
cc1: all warnings being treated as errors
make[3]: *** [scripts/Makefile.build:277: arch/x86/kernel/kprobes/core.o] Error 1
make[3]: *** Waiting for unfinished jobs....
AS arch/x86/kernel/head_64.o
CC arch/x86/kernel/head64.o
CC arch/x86/kernel/ebda.o
CC arch/x86/kernel/platform-quirks.o
AR arch/x86/events/intel/built-in.a
LDS arch/x86/kernel/vmlinux.lds
CC arch/x86/kernel/process_64.o
CC arch/x86/kernel/signal.o
make[2]: *** [scripts/Makefile.build:540: arch/x86/kernel/kprobes] Error 2
make[2]: *** Waiting for unfinished jobs....
make[2]: *** [scripts/Makefile.build:540: arch/x86/kernel/cpu] Error 2
AR arch/x86/events/built-in.a
AR arch/x86/kernel/apic/built-in.a
make[1]: *** [scripts/Makefile.build:540: arch/x86/kernel] Error 2
make: *** [Makefile:1872: arch/x86] Error 2
make: *** [Makefile:1872: mm] Error 2
+ make C=0 W=1 ARCH=x86_64 CROSS_COMPILE=x86_64-linux-gnu- modules
DESCEND objtool
CALL scripts/atomic/check-atomics.sh
CALL scripts/checksyscalls.sh
CC [M] fs/efivarfs/inode.o
CC [M] fs/efivarfs/file.o
CC [M] fs/efivarfs/super.o
CC [M] net/netfilter/nf_log_syslog.o
CC [M] net/ipv4/netfilter/iptable_nat.o
CC [M] net/netfilter/xt_mark.o
CC [M] net/netfilter/xt_nat.o
CC [M] net/netfilter/xt_LOG.o
CC [M] net/netfilter/xt_MASQUERADE.o
CC [M] net/netfilter/xt_addrtype.o
LDS scripts/module.lds
LD [M] fs/efivarfs/efivarfs.o
CC [M] drivers/thermal/intel/x86_pkg_temp_thermal.o
WARNING: Symbol version dump "vmlinux.symvers" is missing.
Modules may not have dependencies or modversions.
You may get many unresolved symbol warnings.
MODPOST modules-only.symvers
WARNING: modpost: "unregister_pernet_subsys" [net/ipv4/netfilter/iptable_nat.ko] undefined!
WARNING: modpost: "xt_unregister_template" [net/ipv4/netfilter/iptable_nat.ko] undefined!
WARNING: modpost: "register_pernet_subsys" [net/ipv4/netfilter/iptable_nat.ko] undefined!
WARNING: modpost: "xt_register_template" [net/ipv4/netfilter/iptable_nat.ko] undefined!
WARNING: modpost: "ipt_do_table" [net/ipv4/netfilter/iptable_nat.ko] undefined!
WARNING: modpost: "nf_nat_ipv4_register_fn" [net/ipv4/netfilter/iptable_nat.ko] undefined!
WARNING: modpost: "kmemdup" [net/ipv4/netfilter/iptable_nat.ko] undefined!
WARNING: modpost: "xt_find_table" [net/ipv4/netfilter/iptable_nat.ko] undefined!
WARNING: modpost: "ipt_register_table" [net/ipv4/netfilter/iptable_nat.ko] undefined!
WARNING: modpost: "ipt_alloc_initial_table" [net/ipv4/netfilter/iptable_nat.ko] undefined!
WARNING: modpost: suppressed 167 unresolved symbol warnings because there were too many)
CC [M] drivers/thermal/intel/x86_pkg_temp_thermal.mod.o
CC [M] fs/efivarfs/efivarfs.mod.o
CC [M] net/ipv4/netfilter/iptable_nat.mod.o
CC [M] net/netfilter/nf_log_syslog.mod.o
CC [M] net/netfilter/xt_LOG.mod.o
CC [M] net/netfilter/xt_MASQUERADE.mod.o
CC [M] net/netfilter/xt_addrtype.mod.o
CC [M] net/netfilter/xt_mark.mod.o
CC [M] net/netfilter/xt_nat.mod.o
LD [M] drivers/thermal/intel/x86_pkg_temp_thermal.ko
LD [M] net/netfilter/nf_log_syslog.ko
LD [M] net/netfilter/xt_addrtype.ko
LD [M] fs/efivarfs/efivarfs.ko
LD [M] net/netfilter/xt_nat.ko
LD [M] net/netfilter/xt_MASQUERADE.ko
LD [M] net/netfilter/xt_LOG.ko
LD [M] net/ipv4/netfilter/iptable_nat.ko
LD [M] net/netfilter/xt_mark.ko
+ rm -Rf /home/kwilczynski/RAMFS.x86_64/lib/modules
+ [[ -z '' ]]
+ make C=0 W=1 ARCH=x86_64 CROSS_COMPILE=x86_64-linux-gnu- INSTALL_MOD_PATH=/home/kwilczynski/RAMFS.x86_64 modules_install
cp: cannot stat 'modules.builtin': No such file or directory
make: *** [Makefile:1506: __modinst_pre] Error 1
Sign up for free to join this conversation on GitHub. Already have an account? Sign in to comment