Skip to content

Instantly share code, notes, and snippets.

Avatar
🖥️
Coding

Manuel de la Pena mandel-macaque

🖥️
Coding
View GitHub Profile
View ide.log
INFO [2020-02-20 16:55:37Z]: Starting Visual Studio 2019 for Mac 8.1 (build 2742)
INFO [2020-02-20 16:55:37Z]: Build Information
Release ID: 801002742
Git revision: ed27233de1b33083ea2234bc66a3b7824b99bbc7
Build date: 2019-06-12 10:18:51+00
Build branch: release-8.1
Xamarin extensions: 98dc4d7de2257c9b7342dee023910e16d02f8e65
INFO [2020-02-20 16:55:37Z]: Running on Mono 6.6.0.117 (2019-08/617f399efca) (64-bit)
INFO [2020-02-20 16:55:37Z]: Operating System: Mac OS X 10.15.3
View build_error.xml
This file has been truncated, but you can view the full file.
<?xml version="1.0" encoding="utf-8"?>
<test-run name="AppBuild" testcasecount="1" result="Failed" time="0" total="1" passed="0" failed="1" inconclusive="0" skipped="0" asserts="1" date="2020-02-14">
<test-suite type="Assembly" id="1" name="mscorlib Part 1 " testcasecount="1" result="Failed" time="0" total="1" passed="0" failed="1" inconclusive="0" skipped="0" asserts="0" fullname="mscorlib Part 1 ">
<failure>
<message><![CDATA[Child test failed]]></message>
</failure>
<test-suite name="AppBuild" fullname="AppBuild" type="TestFixture" testcasecount="1" result="Failed" time="0" total="1" passed="0" failed="1" inconclusive="0" skipped="0" asserts="1">
<test-case id="1" name="Crash Report" fullname="Crash Report" result="Failed" time="0" asserts="1">
<failure>
View install-failure.xml
<?xml version="1.0" encoding="utf-8"?>
<test-run name="AppInstallation" testcasecount="1" result="Failed" time="0" total="1" passed="0" failed="1" inconclusive="0" skipped="0" asserts="1" date="2020-02-14">
<test-suite type="Assembly" id="1" name="link sdk Debug" testcasecount="1" result="Failed" time="0" total="1" passed="0" failed="1" inconclusive="0" skipped="0" asserts="0" fullname="link sdk Debug">
<failure>
<message><![CDATA[Child test failed]]></message>
</failure>
<test-suite name="AppInstallation" fullname="AppInstallation" type="TestFixture" testcasecount="1" result="Failed" time="0" total="1" passed="0" failed="1" inconclusive="0" skipped="0" asserts="1">
<test-case id="1" name="Crash Report" fullname="Crash Report" result="Failed" time="0" asserts="1">
<failure>
<message><![CDATA[Install failed, exit code: 0]]><stack-trace><![CDATA[11:04:30.1102810 Installing '/Users/mandel/Xamarin/xamarin-macios/master/xamarin-macios/tests/xharness/tmp-test-dir/link sdk
View xunit.xml
<?xml version="1.0" encoding="utf-8"?>
<assemblies>
<assembly name="My custom failure" environment="64-bit .NET Standard [collection-per-class, non-parallel]" test-framework="xUnit.net 2.4.1.0" run-date="2020-02-12" total="1" passed="0" failed="1" skipped="0" time="0" errors="0">
<collection total="1" passed="0" failed="1" skipped="0" name="Crash Report" time="0">
<test name="Crash Report" type="TestApp" method="Run" time="0" result="Fail">
<failure>
<message><![CDATA[Crash!]]><stack-trace><![CDATA[This is a sample output from stderr.
]]></stack-trace></message>
</failure>
</test>
View nunitv3.xml
<?xml version="1.0" encoding="utf-8"?>
<test-run name="My custom failure" testcasecount="1" result="Failed" time="0" total="1" passed="0" failed="1" inconclusive="0" skipped="0" asserts="0" date="2020-02-12">
<test-suite type="Assembly" id="1" name="Test Crash" testcasecount="11" result="Failed" time="0" total="1" passed="0" failed="1" inconclusive="0" skipped="0" asserts="0">
<failure>
<message><![CDATA[Child test failed]]></message>
</failure>
<test-suite name="My custom failure" fullname="My custom failure" type="TestFixture" testcasecount="1" result="Failed" time="0" total="1" passed="0" failed="1" inconclusive="0" skipped="0" asserts="1">
<test-case id="1" name="Crash Report" fullname="Crash Report" result="Failed" time="0" asserts="1">
<failure>
<message><![CDATA[Crash!]]><stack-trace><![CDATA[This is a sample output from stderr.
View nunitv2.xml
<?xml version="1.0" encoding="utf-8"?>
<test-results name="My custom failure" total="1" errors="1" failures="1" not-run="0" inconclusive="0" ignored="0" skipped="0" invalid="0" date="2020-02-12">
<test-suite type="Assembly" name="My custom failure" executed="True" result="Failure" success="False" time="0" asserts="0">
<results>
<test-suite type="TestFixture" name="My custom failure" executed="True" result="Failure" success="False" time="0" asserts="0">
<results>
<test-case name="Crash Report" executed="True" result="Failure" success="False" time="0" asserts="0">
<failure>
<message><![CDATA[Crash!]]></message>
<stack-trace><![CDATA[This is a sample output from stderr.
View result.xml
<?xml version="1.0" encoding="utf-8"?>
<test-run id="2" name="" fullname="" testcasecount="2698" result="Skipped" label="Ignored" time="00:00:58.5750000" total="2698" passed="2583" failed="0" inconclusive="41" skipped="74" asserts="24013" run-date="2020-02-06" start-time="23:24:58" random-seed="1457456674">
<environment nunit-version="1.0.0.0" clr-version="4.0.50524.0" os-version="Unix 19.0.0.0" platform="Unix" cwd="/Users/mandel/Library/Developer/CoreSimulator/Devices/96EBF3D8-393E-4166-B1AF-4A3BDEAC5021/data/Containers/Bundle/Application/C3A97716-71BA-4EBC-9486-BBB8A4C18C7B/monotouchtest.app" machine-name="iMac" user="somebody" user-domain="iMac" culture="en-US" uiculture="en-US" />
<test-suite type="TestSuite" id="1000" name="" fullname="" testcasecount="2698" result="Skipped" time="00:00:58.5750000" total="2698" passed="2583" failed="0" inconclusive="41" skipped="74" asserts="24013">
<reason>
<message><![CDATA[One or more child tests were ignored]]></message>
</reason>
<test-suite ty
View build-error.txt
/Users/mandel/Xamarin/xamarin-macios/master/xamarin-macios/builds/downloads/ios-release-Darwin-2edccc52a78d90fea7bcbd37844164663e712397/ios-sources/external/nunit-lite/NUnitLite-1.0.0/src/framework/Api/ResultState.cs(34,15): warning CS0659: 'ResultState' overrides Object.Equals(object o) but does not override Object.GetHashCode()
/Users/mandel/Xamarin/xamarin-macios/master/xamarin-macios/builds/downloads/ios-release-Darwin-2edccc52a78d90fea7bcbd37844164663e712397/ios-sources/external/nunit-lite/NUnitLite-1.0.0/src/framework/Runner/TextUI.cs(257,34): error CS0234: The type or namespace name 'BabysitterSupport' does not exist in the namespace 'Xamarin' (are you missing an assembly reference?)
/Users/mandel/Xamarin/xamarin-macios/master/xamarin-macios/builds/downloads/ios-release-Darwin-2edccc52a78d90fea7bcbd37844164663e712397/ios-sources/external/nunit-lite/NUnitLite-1.0.0/src/framework/Runner/TextUI.cs(377,25): error CS0246: The type or namespace name 'XunitXmlOutputWriter' could not be found (are you missing
View sample-result.xml
This file has been truncated, but you can view the full file.
<?xml version="1.0" encoding="utf-8" standalone="no"?>
<test-run id="2" name="com.xamarin.bcltests.BCL tests group 2" fullname="com.xamarin.bcltests.BCL tests group 2" testcasecount="16422" result="Skipped" label="Ignored" time="00:00:00" total="15072" passed="14627" failed="0" inconclusive="0" skipped="445" asserts="2765065" run-date="2020-02-06" start-time="04:49:16" random-seed="198555239">
<environment nunit-version="0.0.0.0" clr-version="4.0.50524.0" os-version="Unix 19.0.0.0" platform="Unix" cwd="/Users/mandel/Library/Developer/CoreSimulator/Devices/96EBF3D8-393E-4166-B1AF-4A3BDEAC5021/data/Containers/Bundle/Application/3668756A-C2EE-4CEE-A492-C4838853447E/com.xamarin.bcltests.BCL tests group 2.app" machine-name="iMac" user="somebody" user-domain="iMac" culture="en-US" uiculture="en-US" />
View segfault.txt
at <unknown> <0xffffffff>
at CoreFoundation.DispatchObject:dispatch_release <0x000e3>
at CoreFoundation.DispatchObject:Release <0x000a2>
at CoreFoundation.NativeObject:Dispose <0x000fb>
at CoreFoundation.NativeObject:Dispose <0x00074>
at MonoTouchFixtures.CoreFoundation.DispatchDataTest:FromReadOnlySpanTest <0x002f7>
at System.Object:runtime_invoke_void__this__ <0x001a5>
at <unknown> <0xffffffff>
at System.Reflection.RuntimeMethodInfo:InternalInvoke <0x0012c>
at System.Reflection.RuntimeMethodInfo:Invoke <0x0055a>