Skip to content

Instantly share code, notes, and snippets.

Embed
What would you like to do?
make[2]: Entering directory '/home/user/builder-R4.0'
INFO: mock.py version 1.4.9 starting (python version = 3.6.5)...
Start: init plugins
DEBUG: ensuring that dir exists: /home/user/builder-R4.0/cache/fc25/fedora-25-x86_64/dnf_cache/
INFO: selinux disabled
Finish: init plugins
Start: run
DEBUG: mock final configuration:
DEBUG: version: 1.4.9
DEBUG: basedir: /home/user/builder-R4.0/chroot-fc25/mock
DEBUG: resultdir: /home/user/builder-R4.0/chroot-fc25//home/user/qubes-src/installer-qubes-os/pkgs/fc25
DEBUG: cache_topdir: /home/user/builder-R4.0/cache/fc25
DEBUG: clean: True
DEBUG: check: True
DEBUG: post_install: False
DEBUG: chroothome: /builddir
DEBUG: log_config_file: logging.ini
DEBUG: rpmbuild_timeout: 0
DEBUG: chrootuid: 1000
DEBUG: chrootgid: 135
DEBUG: chrootgroup: mock
DEBUG: build_log_fmt_name: unadorned
DEBUG: root_log_fmt_name: detailed
DEBUG: state_log_fmt_name: state
DEBUG: online: True
DEBUG: use_nspawn: True
DEBUG: rpmbuild_networking: False
DEBUG: nspawn_args: []
DEBUG: use_container_host_hostname: True
DEBUG: use_bootstrap_container: False
DEBUG: internal_dev_setup: True
DEBUG: cleanup_on_success: True
DEBUG: cleanup_on_failure: True
DEBUG: exclude_from_homedir_cleanup: ['build/SOURCES', '.bash_history', '.bashrc']
DEBUG: createrepo_on_rpms: False
DEBUG: createrepo_command: /usr/bin/createrepo_c -d -q -x *.src.rpm
DEBUG: backup_on_clean: False
DEBUG: backup_base_dir: /var/lib/mock/backup
DEBUG: plugins: ['tmpfs', 'root_cache', 'yum_cache', 'bind_mount', 'ccache', 'selinux', 'package_state', 'chroot_scan', 'lvm_root', 'compress_logs', 'sign', 'pm_request', 'hw_info', 'mount']
DEBUG: plugin_dir: /usr/lib/python3.6/site-packages/mockbuild/plugins
DEBUG: plugin_conf: {'ccache_enable': False, 'ccache_opts': {'max_cache_size': '4G', 'compress': None, 'dir': '%(cache_topdir)s/%(root)s/ccache/u%(chrootuid)s/', 'basedir': '/home/user/builder-R4.0/chroot-fc25/mock/fedora-25-x86_64', 'cache_topdir': '/home/user/builder-R4.0/cache/fc25', 'cachedir': '/home/user/builder-R4.0/cache/fc25/fedora-25-x86_64', 'root': 'fedora-25-x86_64', 'resultdir': '/home/user/builder-R4.0/chroot-fc25//home/user/qubes-src/installer-qubes-os/pkgs/fc25'}, 'yum_cache_enable': True, 'yum_cache_opts': {'max_age_days': 30, 'max_metadata_age_days': 30, 'dir': '%(cache_topdir)s/%(root)s/%(package_manager)s_cache/', 'target_dir': '/var/cache/%(package_manager)s/', 'online': True, 'basedir': '/home/user/builder-R4.0/chroot-fc25/mock/fedora-25-x86_64', 'cache_topdir': '/home/user/builder-R4.0/cache/fc25', 'cachedir': '/home/user/builder-R4.0/cache/fc25/fedora-25-x86_64', 'root': 'fedora-25-x86_64', 'resultdir': '/home/user/builder-R4.0/chroot-fc25//home/user/qubes-src/installer-qubes-os/pkgs/fc25', 'package_manager': 'dnf'}, 'root_cache_enable': True, 'root_cache_opts': {'age_check': True, 'max_age_days': 15, 'dir': '%(cache_topdir)s/%(root)s/root_cache/', 'compress_program': 'pigz', 'exclude_dirs': ['./proc', './sys', './dev', './tmp/ccache', './var/cache/yum', './var/cache/dnf'], 'extension': '.gz', 'basedir': '/home/user/builder-R4.0/chroot-fc25/mock/fedora-25-x86_64', 'cache_topdir': '/home/user/builder-R4.0/cache/fc25', 'cachedir': '/home/user/builder-R4.0/cache/fc25/fedora-25-x86_64', 'root': 'fedora-25-x86_64', 'resultdir': '/home/user/builder-R4.0/chroot-fc25//home/user/qubes-src/installer-qubes-os/pkgs/fc25'}, 'bind_mount_enable': True, 'bind_mount_opts': {'dirs': [], 'create_dirs': False, 'basedir': '/home/user/builder-R4.0/chroot-fc25/mock/fedora-25-x86_64', 'cache_topdir': '/home/user/builder-R4.0/cache/fc25', 'cachedir': '/home/user/builder-R4.0/cache/fc25/fedora-25-x86_64', 'root': 'fedora-25-x86_64', 'resultdir': '/home/user/builder-R4.0/chroot-fc25//home/user/qubes-src/installer-qubes-os/pkgs/fc25'}, 'mount_enable': False, 'mount_opts': {'basedir': '/home/user/builder-R4.0/chroot-fc25/mock/fedora-25-x86_64', 'cache_topdir': '/home/user/builder-R4.0/cache/fc25', 'cachedir': '/home/user/builder-R4.0/cache/fc25/fedora-25-x86_64', 'root': 'fedora-25-x86_64', 'resultdir': '/home/user/builder-R4.0/chroot-fc25//home/user/qubes-src/installer-qubes-os/pkgs/fc25'}, 'tmpfs_enable': False, 'tmpfs_opts': {'required_ram_mb': 900, 'max_fs_size': None, 'mode': '0755', 'keep_mounted': False, 'basedir': '/home/user/builder-R4.0/chroot-fc25/mock/fedora-25-x86_64', 'cache_topdir': '/home/user/builder-R4.0/cache/fc25', 'cachedir': '/home/user/builder-R4.0/cache/fc25/fedora-25-x86_64', 'root': 'fedora-25-x86_64', 'resultdir': '/home/user/builder-R4.0/chroot-fc25//home/user/qubes-src/installer-qubes-os/pkgs/fc25'}, 'selinux_enable': True, 'selinux_opts': {'basedir': '/home/user/builder-R4.0/chroot-fc25/mock/fedora-25-x86_64', 'cache_topdir': '/home/user/builder-R4.0/cache/fc25', 'cachedir': '/home/user/builder-R4.0/cache/fc25/fedora-25-x86_64', 'root': 'fedora-25-x86_64', 'resultdir': '/home/user/builder-R4.0/chroot-fc25//home/user/qubes-src/installer-qubes-os/pkgs/fc25'}, 'package_state_enable': True, 'package_state_opts': {'available_pkgs': False, 'installed_pkgs': True, 'basedir': '/home/user/builder-R4.0/chroot-fc25/mock/fedora-25-x86_64', 'cache_topdir': '/home/user/builder-R4.0/cache/fc25', 'cachedir': '/home/user/builder-R4.0/cache/fc25/fedora-25-x86_64', 'root': 'fedora-25-x86_64', 'resultdir': '/home/user/builder-R4.0/chroot-fc25//home/user/qubes-src/installer-qubes-os/pkgs/fc25'}, 'pm_request_enable': False, 'pm_request_opts': {'basedir': '/home/user/builder-R4.0/chroot-fc25/mock/fedora-25-x86_64', 'cache_topdir': '/home/user/builder-R4.0/cache/fc25', 'cachedir': '/home/user/builder-R4.0/cache/fc25/fedora-25-x86_64', 'root': 'fedora-25-x86_64', 'resultdir': '/home/user/builder-R4.0/chroot-fc25//home/user/qubes-src/installer-qubes-os/pkgs/fc25'}, 'lvm_root_enable': False, 'lvm_root_opts': {'pool_name': 'mockbuild', 'basedir': '/home/user/builder-R4.0/chroot-fc25/mock/fedora-25-x86_64', 'cache_topdir': '/home/user/builder-R4.0/cache/fc25', 'cachedir': '/home/user/builder-R4.0/cache/fc25/fedora-25-x86_64', 'root': 'fedora-25-x86_64', 'resultdir': '/home/user/builder-R4.0/chroot-fc25//home/user/qubes-src/installer-qubes-os/pkgs/fc25'}, 'chroot_scan_enable': False, 'chroot_scan_opts': {'regexes': ['^[^k]?core(\\.\\d+)?$', '\\.log$'], 'only_failed': True, 'basedir': '/home/user/builder-R4.0/chroot-fc25/mock/fedora-25-x86_64', 'cache_topdir': '/home/user/builder-R4.0/cache/fc25', 'cachedir': '/home/user/builder-R4.0/cache/fc25/fedora-25-x86_64', 'root': 'fedora-25-x86_64', 'resultdir': '/home/user/builder-R4.0/chroot-fc25//home/user/qubes-src/installer-qubes-os/pkgs/fc25'}, 'sign_enable': False, 'sign_opts': {'cmd': 'rpmsign', 'opts': '--addsign %(rpms)s', 'basedir': '/home/user/builder-R4.0/chroot-fc25/mock/fedora-25-x86_64', 'cache_topdir': '/home/user/builder-R4.0/cache/fc25', 'cachedir': '/home/user/builder-R4.0/cache/fc25/fedora-25-x86_64', 'root': 'fedora-25-x86_64', 'resultdir': '/home/user/builder-R4.0/chroot-fc25//home/user/qubes-src/installer-qubes-os/pkgs/fc25'}, 'hw_info_enable': True, 'hw_info_opts': {'basedir': '/home/user/builder-R4.0/chroot-fc25/mock/fedora-25-x86_64', 'cache_topdir': '/home/user/builder-R4.0/cache/fc25', 'cachedir': '/home/user/builder-R4.0/cache/fc25/fedora-25-x86_64', 'root': 'fedora-25-x86_64', 'resultdir': '/home/user/builder-R4.0/chroot-fc25//home/user/qubes-src/installer-qubes-os/pkgs/fc25'}}
DEBUG: environment: {'TERM': 'vt100', 'SHELL': '/bin/bash', 'HOME': '/builddir', 'HOSTNAME': 'mock', 'PATH': '/usr/bin:/bin:/usr/sbin:/sbin', 'PROMPT_COMMAND': 'printf "\\033]0;<mock-chroot>\\007"', 'PS1': '<mock-chroot> \\s-\\v\\$ ', 'LANG': 'en_US.UTF-8'}
DEBUG: scm: False
DEBUG: scm_opts: {'method': 'git', 'cvs_get': 'cvs -d /srv/cvs co SCM_BRN SCM_PKG', 'git_get': 'git clone SCM_BRN git://localhost/SCM_PKG.git SCM_PKG', 'svn_get': 'svn co file:///srv/svn/SCM_PKG/SCM_BRN SCM_PKG', 'distgit_get': 'rpkg clone -a --branch SCM_BRN SCM_PKG SCM_PKG', 'distgit_src_get': 'rpkg sources', 'spec': 'SCM_PKG.spec', 'ext_src_dir': '/dev/null', 'write_tar': False, 'git_timestamps': False, 'exclude_vcs': True}
DEBUG: useradd: /usr/sbin/useradd -o -m -u %(uid)s -g %(gid)s -d %(home)s -n %(user)s
DEBUG: use_host_resolv: True
DEBUG: chroot_setup_cmd: install @buildsys-build
DEBUG: target_arch: x86_64
DEBUG: releasever: 25
DEBUG: rpmbuild_arch: x86_64
DEBUG: yum.conf:
[main]
keepcache=1
debuglevel=2
reposdir=/dev/null
logfile=/var/log/yum.log
retries=20
obsoletes=1
gpgcheck=0
assumeyes=1
syslog_ident=mock
syslog_device=
install_weak_deps=0
metadata_expire=0
mdpolicy=group:primary
best=1
# repos
[fedora]
name=fedora
metalink=https://mirrors.fedoraproject.org/metalink?repo=fedora-$releasever&arch=$basearch
failovermethod=priority
gpgkey=file:///usr/share/distribution-gpg-keys/fedora/RPM-GPG-KEY-fedora-$releasever-primary
gpgcheck=1
[updates]
name=updates
metalink=https://mirrors.fedoraproject.org/metalink?repo=updates-released-f$releasever&arch=$basearch
failovermethod=priority
gpgkey=file:///usr/share/distribution-gpg-keys/fedora/RPM-GPG-KEY-fedora-$releasever-primary
gpgcheck=1
[builder-local]
name=builder-local
baseurl=file:///home/user/builder-R4.0/qubes-packages-mirror-repo/fc25
gpgcheck=0
exclude=qubes-release
[qubes-current]
name=qubes-dom0-current
baseurl=https://yum.qubes-os.org/r4.0/current/dom0/fc$releasever
failovermethod=priority
gpgkey=file:///home/user/builder-R4.0/qubes-src/builder-rpm//keys/RPM-GPG-KEY-qubes-4.0-primary
gpgcheck=1
exclude=qubes-release
enabled=0
[qubes-current-testing]
name=qubes-dom0-testing
baseurl=https://yum.qubes-os.org/r4.0/current-testing/dom0/fc$releasever
failovermethod=priority
gpgkey=file:///home/user/builder-R4.0/qubes-src/builder-rpm//keys/RPM-GPG-KEY-qubes-4.0-primary
gpgcheck=1
exclude=qubes-release
enabled=0
DEBUG: yum_builddep_opts: []
DEBUG: yum_common_opts: []
DEBUG: update_before_build: True
DEBUG: priorities.conf:
[main]
enabled=0
DEBUG: rhnplugin.conf:
[main]
enabled=0
DEBUG: subscription-manager.conf:
DEBUG: more_buildreqs: {}
DEBUG: nosync: False
DEBUG: nosync_force: False
DEBUG: files: {}
DEBUG: macros: {'%_topdir': '/builddir/build', '%_rpmfilename': '%%{NAME}-%%{VERSION}-%%{RELEASE}.%%{ARCH}.rpm', '%_buildhost': 'localhost.localdomain', '%dist': '.51.fc25', '%fedora': '25'}
DEBUG: hostname: None
DEBUG: module_enable: []
DEBUG: module_install: []
DEBUG: no_root_shells: False
DEBUG: extra_chroot_dirs: ['/run/lock']
DEBUG: package_manager: dnf
DEBUG: yum_command: /usr/bin/yum
DEBUG: system_yum_command: /usr/bin/yum
DEBUG: yum_install_command: install yum yum-utils shadow-utils distribution-gpg-keys
DEBUG: yum_builddep_command: /usr/bin/yum-builddep
DEBUG: dnf_command: /usr/bin/dnf
DEBUG: system_dnf_command: /usr/bin/dnf
DEBUG: dnf_install_command: install dnf dnf-plugins-core distribution-gpg-keys
DEBUG: rpm_command: /bin/rpm
DEBUG: rpmbuild_command: /usr/bin/rpmbuild
DEBUG: opstimeout: 0
DEBUG: config_paths: ['/etc/mock/site-defaults.cfg', '/etc/mock/site-defaults.cfg', '/home/user/builder-R4.0/qubes-src/builder-rpm//mock-fedora.cfg', '/home/user/src/builder-rpm/mock-fedora.cfg']
DEBUG: chroot_name: mock-fedora
DEBUG: config_file: /home/user/builder-R4.0/qubes-src/builder-rpm//mock-fedora.cfg
DEBUG: bootstrap_chroot_additional_packages: []
DEBUG: bootstrap_module_enable: []
DEBUG: bootstrap_module_install: []
DEBUG: root: fedora-25-x86_64
DEBUG: legal_host_arches: ('x86_64',)
DEBUG: dist: fc25
DEBUG: verbose: 2
DEBUG: print_main_output: False
DEBUG: cache_alterations: False
DEBUG: enable_disable_repos: []
DEBUG: build_log_fmt_str: %(message)s
DEBUG: root_log_fmt_str: %(levelname)s %(filename)s:%(lineno)d: %(message)s
DEBUG: state_log_fmt_str: %(asctime)s - %(message)s
DEBUG: Unsharing. Flags: 67239936
INFO: Start(pykickstart/pykickstart.spec) Config(fedora-25-x86_64)
Start: clean chroot
DEBUG: ensuring that dir exists: /home/user/builder-R4.0/chroot-fc25/mock/fedora-25-x86_64
DEBUG: kill orphans
DEBUG: child environment: None
DEBUG: Executing command: ['btrfs', 'subv', 'list', '/home/user/builder-R4.0/chroot-fc25/mock'] with env {'TERM': 'vt100', 'SHELL': '/bin/sh', 'HOME': '/builddir', 'HOSTNAME': 'mock', 'PATH': '/usr/bin:/bin:/usr/sbin:/sbin', 'LANG': 'en_US.UTF-8'} and shell False
DEBUG: BUILDSTDERR: ERROR: not a btrfs filesystem: /home/user/builder-R4.0/chroot-fc25/mock
DEBUG: BUILDSTDERR: ERROR: can't access '/home/user/builder-R4.0/chroot-fc25/mock'
DEBUG: Child return code was: 1
DEBUG: Please ignore the error above above about btrfs.
Finish: clean chroot
DEBUG: ensuring that dir exists: /home/user/builder-R4.0/chroot-fc25/mock/fedora-25-x86_64
DEBUG: creating dir: /home/user/builder-R4.0/chroot-fc25/mock/fedora-25-x86_64
Start: chroot init
DEBUG: ensuring that dir exists: /home/user/builder-R4.0/chroot-fc25/mock/fedora-25-x86_64
DEBUG: ensuring that dir exists: /home/user/builder-R4.0/chroot-fc25/mock/fedora-25-x86_64/root
DEBUG: creating dir: /home/user/builder-R4.0/chroot-fc25/mock/fedora-25-x86_64/root
DEBUG: ensuring that dir exists: /home/user/builder-R4.0/chroot-fc25//home/user/qubes-src/installer-qubes-os/pkgs/fc25
INFO: calling preinit hooks
INFO: enabled root cache
DEBUG: ensuring that dir exists: /home/user/builder-R4.0/cache/fc25/fedora-25-x86_64/root_cache/
Start: unpacking root cache
DEBUG: ensuring that dir exists: /home/user/builder-R4.0/chroot-fc25/mock/fedora-25-x86_64/root
DEBUG: child environment: None
DEBUG: Executing command: ['tar', '--use-compress-program', 'pigz', '-xf', '/home/user/builder-R4.0/cache/fc25/fedora-25-x86_64/root_cache/cache.tar.gz', '-C', '/home/user/builder-R4.0/chroot-fc25/mock/fedora-25-x86_64/root'] with env {'TERM': 'vt100', 'SHELL': '/bin/sh', 'HOME': '/builddir', 'HOSTNAME': 'mock', 'PATH': '/usr/bin:/bin:/usr/sbin:/sbin', 'LANG': 'en_US.UTF-8'} and shell False
DEBUG: Child return code was: 0
DEBUG: ensuring that dir exists: /home/user/builder-R4.0/chroot-fc25/mock/fedora-25-x86_64/root/./proc
DEBUG: creating dir: /home/user/builder-R4.0/chroot-fc25/mock/fedora-25-x86_64/root/./proc
DEBUG: ensuring that dir exists: /home/user/builder-R4.0/chroot-fc25/mock/fedora-25-x86_64/root/./sys
DEBUG: creating dir: /home/user/builder-R4.0/chroot-fc25/mock/fedora-25-x86_64/root/./sys
DEBUG: ensuring that dir exists: /home/user/builder-R4.0/chroot-fc25/mock/fedora-25-x86_64/root/./dev
DEBUG: creating dir: /home/user/builder-R4.0/chroot-fc25/mock/fedora-25-x86_64/root/./dev
DEBUG: ensuring that dir exists: /home/user/builder-R4.0/chroot-fc25/mock/fedora-25-x86_64/root/./tmp/ccache
DEBUG: creating dir: /home/user/builder-R4.0/chroot-fc25/mock/fedora-25-x86_64/root/./tmp/ccache
DEBUG: ensuring that dir exists: /home/user/builder-R4.0/chroot-fc25/mock/fedora-25-x86_64/root/./var/cache/yum
DEBUG: creating dir: /home/user/builder-R4.0/chroot-fc25/mock/fedora-25-x86_64/root/./var/cache/yum
DEBUG: ensuring that dir exists: /home/user/builder-R4.0/chroot-fc25/mock/fedora-25-x86_64/root/./var/cache/dnf
DEBUG: creating dir: /home/user/builder-R4.0/chroot-fc25/mock/fedora-25-x86_64/root/./var/cache/dnf
Finish: unpacking root cache
INFO: enabled dnf cache
DEBUG: ensuring that dir exists: /home/user/builder-R4.0/chroot-fc25/mock/fedora-25-x86_64/root/var/cache/dnf/
Start: cleaning dnf metadata
Finish: cleaning dnf metadata
INFO: enabled HW Info plugin
DEBUG: child environment: None
DEBUG: Executing command: ['/usr/bin/lscpu'] with env {'TERM': 'vt100', 'SHELL': '/bin/sh', 'HOME': '/builddir', 'HOSTNAME': 'mock', 'PATH': '/usr/bin:/bin:/usr/sbin:/sbin', 'LANG': 'en_US.UTF-8'} and shell False
DEBUG: Architecture: x86_64
DEBUG: CPU op-mode(s): 32-bit, 64-bit
DEBUG: Byte Order: Little Endian
DEBUG: CPU(s): 8
DEBUG: On-line CPU(s) list: 0-7
DEBUG: Thread(s) per core: 8
DEBUG: Core(s) per socket: 1
DEBUG: Socket(s): 1
DEBUG: NUMA node(s): 1
DEBUG: Vendor ID: GenuineIntel
DEBUG: CPU family: 6
DEBUG: Model: 60
DEBUG: Model name: Intel(R) Core(TM) i7-4770 CPU @ 3.40GHz
DEBUG: Stepping: 3
DEBUG: CPU MHz: 3399.996
DEBUG: BogoMIPS: 6800.17
DEBUG: Hypervisor vendor: Xen
DEBUG: Virtualization type: para
DEBUG: L1d cache: 32K
DEBUG: L1i cache: 32K
DEBUG: L2 cache: 256K
DEBUG: L3 cache: 8192K
DEBUG: NUMA node0 CPU(s): 0-7
DEBUG: Flags: fpu de tsc msr pae cx8 apic sep cmov pat clflush mmx fxsr sse sse2 ss ht syscall nx lm constant_tsc rep_good nopl cpuid pni pclmulqdq ssse3 sdbg fma cx16 sse4_1 sse4_2 movbe popcnt tsc_deadline_timer aes xsave avx f16c rdrand hypervisor lahf_lm abm fsgsbase bmi1 avx2 bmi2 erms xsaveopt dtherm ida arat pln pts
DEBUG: Child return code was: 0
DEBUG: child environment: None
DEBUG: Executing command: ['/usr/bin/free'] with env {'TERM': 'vt100', 'SHELL': '/bin/sh', 'HOME': '/builddir', 'HOSTNAME': 'mock', 'PATH': '/usr/bin:/bin:/usr/sbin:/sbin', 'LANG': 'en_US.UTF-8'} and shell False
DEBUG: total used free shared buff/cache available
DEBUG: Mem: 3969376 1802300 214116 1464 1952960 2121780
DEBUG: Swap: 1048572 37120 1011452
DEBUG: Child return code was: 0
DEBUG: child environment: None
DEBUG: Executing command: ['/usr/bin/df', '-H', '/home/user/builder-R4.0/chroot-fc25/mock/fedora-25-x86_64/root'] with env {'TERM': 'vt100', 'SHELL': '/bin/sh', 'HOME': '/builddir', 'HOSTNAME': 'mock', 'PATH': '/usr/bin:/bin:/usr/sbin:/sbin', 'LANG': 'en_US.UTF-8'} and shell False
DEBUG: Filesystem Size Used Avail Use% Mounted on
DEBUG: /dev/xvdb 265G 258G 7.0G 98% /home
DEBUG: Child return code was: 0
DEBUG: create skeleton dirs
DEBUG: ensuring that dir exists: /home/user/builder-R4.0/chroot-fc25/mock/fedora-25-x86_64/root/var/lib/rpm
DEBUG: ensuring that dir exists: /home/user/builder-R4.0/chroot-fc25/mock/fedora-25-x86_64/root/var/lib/yum
DEBUG: ensuring that dir exists: /home/user/builder-R4.0/chroot-fc25/mock/fedora-25-x86_64/root/var/lib/dbus
DEBUG: ensuring that dir exists: /home/user/builder-R4.0/chroot-fc25/mock/fedora-25-x86_64/root/var/log
DEBUG: ensuring that dir exists: /home/user/builder-R4.0/chroot-fc25/mock/fedora-25-x86_64/root/var/cache/yum
DEBUG: ensuring that dir exists: /home/user/builder-R4.0/chroot-fc25/mock/fedora-25-x86_64/root/etc/rpm
DEBUG: ensuring that dir exists: /home/user/builder-R4.0/chroot-fc25/mock/fedora-25-x86_64/root/tmp
DEBUG: ensuring that dir exists: /home/user/builder-R4.0/chroot-fc25/mock/fedora-25-x86_64/root/tmp/ccache
DEBUG: ensuring that dir exists: /home/user/builder-R4.0/chroot-fc25/mock/fedora-25-x86_64/root/var/tmp
DEBUG: ensuring that dir exists: /home/user/builder-R4.0/chroot-fc25/mock/fedora-25-x86_64/root/etc/dnf
DEBUG: ensuring that dir exists: /home/user/builder-R4.0/chroot-fc25/mock/fedora-25-x86_64/root/etc/yum.repos.d
DEBUG: ensuring that dir exists: /home/user/builder-R4.0/chroot-fc25/mock/fedora-25-x86_64/root/etc/yum
DEBUG: ensuring that dir exists: /home/user/builder-R4.0/chroot-fc25/mock/fedora-25-x86_64/root/proc
DEBUG: ensuring that dir exists: /home/user/builder-R4.0/chroot-fc25/mock/fedora-25-x86_64/root/sys
DEBUG: ensuring that dir exists: /home/user/builder-R4.0/chroot-fc25/mock/fedora-25-x86_64/root/run/lock
DEBUG: ensuring that dir exists: /home/user/builder-R4.0/chroot-fc25//home/user/qubes-src/installer-qubes-os/pkgs/fc25
Mock Version: 1.4.9
INFO: Mock Version: 1.4.9
INFO: Mock Version: 1.4.9
DEBUG: ensuring that dir exists: /home/user/builder-R4.0/chroot-fc25/mock/fedora-25-x86_64/root/dev/pts
DEBUG: creating dir: /home/user/builder-R4.0/chroot-fc25/mock/fedora-25-x86_64/root/dev/pts
DEBUG: ensuring that dir exists: /home/user/builder-R4.0/chroot-fc25/mock/fedora-25-x86_64/root/dev/shm
DEBUG: creating dir: /home/user/builder-R4.0/chroot-fc25/mock/fedora-25-x86_64/root/dev/shm
DEBUG: kernel version == 4.14.13-3.pvops.qubes.x86_64
DEBUG: touching file: /home/user/builder-R4.0/chroot-fc25/mock/fedora-25-x86_64/root/etc/fstab
DEBUG: touching file: /home/user/builder-R4.0/chroot-fc25/mock/fedora-25-x86_64/root/etc/yum/yum.conf
DEBUG: touching file: /home/user/builder-R4.0/chroot-fc25/mock/fedora-25-x86_64/root/etc/dnf/dnf.conf
DEBUG: touching file: /home/user/builder-R4.0/chroot-fc25/mock/fedora-25-x86_64/root/var/log/yum.log
DEBUG: ensuring that dir exists: /home/user/builder-R4.0/chroot-fc25/mock/fedora-25-x86_64/root/var/cache/dnf/
DEBUG: child environment: None
DEBUG: Executing command: ['/bin/mount', '-n', '--bind', '/home/user/builder-R4.0/cache/fc25/fedora-25-x86_64/dnf_cache/', '/home/user/builder-R4.0/chroot-fc25/mock/fedora-25-x86_64/root/var/cache/dnf/'] with env {'TERM': 'vt100', 'SHELL': '/bin/sh', 'HOME': '/builddir', 'HOSTNAME': 'mock', 'PATH': '/usr/bin:/bin:/usr/sbin:/sbin', 'LANG': 'en_US.UTF-8'} and shell False
DEBUG: Child return code was: 0
DEBUG: rootdir = /home/user/builder-R4.0/chroot-fc25/mock/fedora-25-x86_64/root
DEBUG: resultdir = /home/user/builder-R4.0/chroot-fc25//home/user/qubes-src/installer-qubes-os/pkgs/fc25
DEBUG: ensuring that dir exists: /home/user/builder-R4.0/chroot-fc25/mock/fedora-25-x86_64/root/etc/pki/mock
DEBUG: ensuring that dir exists: /home/user/builder-R4.0/chroot-fc25/mock/fedora-25-x86_64/root/etc/dnf
DEBUG: child environment: None
DEBUG: Executing command: ['/usr/bin/systemd-nspawn', '-q', '-M', '3bd8b1dc98f143fb849707d902521854', '-D', '/home/user/builder-R4.0/chroot-fc25/mock/fedora-25-x86_64/root', '-a', '--setenv=TERM=vt100', '--setenv=SHELL=/bin/bash', '--setenv=HOME=/builddir', '--setenv=HOSTNAME=mock', '--setenv=PATH=/usr/bin:/bin:/usr/sbin:/sbin', '--setenv=PROMPT_COMMAND=printf "\\033]0;<mock-chroot>\\007"', '--setenv=PS1=<mock-chroot> \\s-\\v\\$ ', '--setenv=LANG=en_US.UTF-8', '/usr/sbin/userdel', '-r', '-f', 'mockbuild'] with env {'TERM': 'vt100', 'SHELL': '/bin/bash', 'HOME': '/builddir', 'HOSTNAME': 'mock', 'PATH': '/usr/bin:/bin:/usr/sbin:/sbin', 'PROMPT_COMMAND': 'printf "\\033]0;<mock-chroot>\\007"', 'PS1': '<mock-chroot> \\s-\\v\\$ ', 'LANG': 'en_US.UTF-8'} and shell False
DEBUG: BUILDSTDERR: DEBUG: Unsharing. Flags: 134217728
DEBUG: Child return code was: 0
DEBUG: child environment: None
DEBUG: Executing command: ['/usr/bin/systemd-nspawn', '-q', '-M', 'c766824ae1f249d3953bcd6a72683076', '-D', '/home/user/builder-R4.0/chroot-fc25/mock/fedora-25-x86_64/root', '-a', '--setenv=TERM=vt100', '--setenv=SHELL=/bin/bash', '--setenv=HOME=/builddir', '--setenv=HOSTNAME=mock', '--setenv=PATH=/usr/bin:/bin:/usr/sbin:/sbin', '--setenv=PROMPT_COMMAND=printf "\\033]0;<mock-chroot>\\007"', '--setenv=PS1=<mock-chroot> \\s-\\v\\$ ', '--setenv=LANG=en_US.UTF-8', '/usr/sbin/groupdel', 'mock'] with env {'TERM': 'vt100', 'SHELL': '/bin/bash', 'HOME': '/builddir', 'HOSTNAME': 'mock', 'PATH': '/usr/bin:/bin:/usr/sbin:/sbin', 'PROMPT_COMMAND': 'printf "\\033]0;<mock-chroot>\\007"', 'PS1': '<mock-chroot> \\s-\\v\\$ ', 'LANG': 'en_US.UTF-8'} and shell False
DEBUG: BUILDSTDERR: DEBUG: Unsharing. Flags: 134217728
DEBUG: Child return code was: 0
DEBUG: child environment: None
DEBUG: Executing command: ['/usr/bin/systemd-nspawn', '-q', '-M', '8aa3df46026d4287a13a0bd3ac1867a2', '-D', '/home/user/builder-R4.0/chroot-fc25/mock/fedora-25-x86_64/root', '-a', '--setenv=TERM=vt100', '--setenv=SHELL=/bin/bash', '--setenv=HOME=/builddir', '--setenv=HOSTNAME=mock', '--setenv=PATH=/usr/bin:/bin:/usr/sbin:/sbin', '--setenv=PROMPT_COMMAND=printf "\\033]0;<mock-chroot>\\007"', '--setenv=PS1=<mock-chroot> \\s-\\v\\$ ', '--setenv=LANG=en_US.UTF-8', '/usr/sbin/groupadd', '-g', '135', 'mock'] with env {'TERM': 'vt100', 'SHELL': '/bin/bash', 'HOME': '/builddir', 'HOSTNAME': 'mock', 'PATH': '/usr/bin:/bin:/usr/sbin:/sbin', 'PROMPT_COMMAND': 'printf "\\033]0;<mock-chroot>\\007"', 'PS1': '<mock-chroot> \\s-\\v\\$ ', 'LANG': 'en_US.UTF-8'} and shell False
DEBUG: BUILDSTDERR: DEBUG: Unsharing. Flags: 134217728
DEBUG: Child return code was: 0
DEBUG: child environment: None
DEBUG: Executing command: ['/usr/bin/systemd-nspawn', '-q', '-M', 'd9f82f8e9b874d85b6034312269fd46c', '-D', '/home/user/builder-R4.0/chroot-fc25/mock/fedora-25-x86_64/root', '-a', '--setenv=TERM=vt100', '--setenv=SHELL=/bin/bash', '--setenv=HOME=/builddir', '--setenv=HOSTNAME=mock', '--setenv=PATH=/usr/bin:/bin:/usr/sbin:/sbin', '--setenv=PROMPT_COMMAND=printf "\\033]0;<mock-chroot>\\007"', '--setenv=PS1=<mock-chroot> \\s-\\v\\$ ', '--setenv=LANG=en_US.UTF-8', '/usr/sbin/useradd', '-o', '-m', '-u', '1000', '-g', '135', '-d', '/builddir', '-n', 'mockbuild'] with env {'TERM': 'vt100', 'SHELL': '/bin/bash', 'HOME': '/builddir', 'HOSTNAME': 'mock', 'PATH': '/usr/bin:/bin:/usr/sbin:/sbin', 'PROMPT_COMMAND': 'printf "\\033]0;<mock-chroot>\\007"', 'PS1': '<mock-chroot> \\s-\\v\\$ ', 'LANG': 'en_US.UTF-8'} and shell False
DEBUG: BUILDSTDERR: DEBUG: Unsharing. Flags: 134217728
DEBUG: Child return code was: 0
DEBUG: ensuring that dir exists: /home/user/builder-R4.0/chroot-fc25/mock/fedora-25-x86_64/root/builddir/build/RPMS
DEBUG: creating dir: /home/user/builder-R4.0/chroot-fc25/mock/fedora-25-x86_64/root/builddir/build/RPMS
DEBUG: ensuring that dir exists: /home/user/builder-R4.0/chroot-fc25/mock/fedora-25-x86_64/root/builddir/build/SPECS
DEBUG: creating dir: /home/user/builder-R4.0/chroot-fc25/mock/fedora-25-x86_64/root/builddir/build/SPECS
DEBUG: ensuring that dir exists: /home/user/builder-R4.0/chroot-fc25/mock/fedora-25-x86_64/root/builddir/build/SRPMS
DEBUG: creating dir: /home/user/builder-R4.0/chroot-fc25/mock/fedora-25-x86_64/root/builddir/build/SRPMS
DEBUG: ensuring that dir exists: /home/user/builder-R4.0/chroot-fc25/mock/fedora-25-x86_64/root/builddir/build/SOURCES
DEBUG: creating dir: /home/user/builder-R4.0/chroot-fc25/mock/fedora-25-x86_64/root/builddir/build/SOURCES
DEBUG: ensuring that dir exists: /home/user/builder-R4.0/chroot-fc25/mock/fedora-25-x86_64/root/builddir/build/BUILD
DEBUG: creating dir: /home/user/builder-R4.0/chroot-fc25/mock/fedora-25-x86_64/root/builddir/build/BUILD
DEBUG: ensuring that dir exists: /home/user/builder-R4.0/chroot-fc25/mock/fedora-25-x86_64/root/builddir/build/BUILDROOT
DEBUG: creating dir: /home/user/builder-R4.0/chroot-fc25/mock/fedora-25-x86_64/root/builddir/build/BUILDROOT
DEBUG: ensuring that dir exists: /home/user/builder-R4.0/chroot-fc25/mock/fedora-25-x86_64/root/builddir/build/originals
DEBUG: creating dir: /home/user/builder-R4.0/chroot-fc25/mock/fedora-25-x86_64/root/builddir/build/originals
Start: dnf update
DEBUG: ensuring that dir exists: /home/user/builder-R4.0/chroot-fc25/mock/fedora-25-x86_64/root/proc
DEBUG: child environment: None
DEBUG: Executing command: ['/bin/mount', '-n', '-t', 'proc', 'proc', '/home/user/builder-R4.0/chroot-fc25/mock/fedora-25-x86_64/root/proc'] with env {'TERM': 'vt100', 'SHELL': '/bin/sh', 'HOME': '/builddir', 'HOSTNAME': 'mock', 'PATH': '/usr/bin:/bin:/usr/sbin:/sbin', 'LANG': 'en_US.UTF-8'} and shell False
DEBUG: Child return code was: 0
DEBUG: ensuring that dir exists: /home/user/builder-R4.0/chroot-fc25/mock/fedora-25-x86_64/root/sys
DEBUG: child environment: None
DEBUG: Executing command: ['/bin/mount', '-n', '-t', 'sysfs', 'sysfs', '/home/user/builder-R4.0/chroot-fc25/mock/fedora-25-x86_64/root/sys'] with env {'TERM': 'vt100', 'SHELL': '/bin/sh', 'HOME': '/builddir', 'HOSTNAME': 'mock', 'PATH': '/usr/bin:/bin:/usr/sbin:/sbin', 'LANG': 'en_US.UTF-8'} and shell False
DEBUG: Child return code was: 0
DEBUG: ensuring that dir exists: /home/user/builder-R4.0/chroot-fc25/mock/fedora-25-x86_64/root/dev/shm
DEBUG: child environment: None
DEBUG: Executing command: ['/bin/mount', '-n', '-t', 'tmpfs', 'tmpfs', '/home/user/builder-R4.0/chroot-fc25/mock/fedora-25-x86_64/root/dev/shm'] with env {'TERM': 'vt100', 'SHELL': '/bin/sh', 'HOME': '/builddir', 'HOSTNAME': 'mock', 'PATH': '/usr/bin:/bin:/usr/sbin:/sbin', 'LANG': 'en_US.UTF-8'} and shell False
DEBUG: Child return code was: 0
DEBUG: ensuring that dir exists: /home/user/builder-R4.0/chroot-fc25/mock/fedora-25-x86_64/root/dev/pts
DEBUG: child environment: None
DEBUG: Executing command: ['/bin/mount', '-n', '-t', 'devpts', '-o', 'gid=5,mode=0620,ptmxmode=0666,newinstance', 'devpts', '/home/user/builder-R4.0/chroot-fc25/mock/fedora-25-x86_64/root/dev/pts'] with env {'TERM': 'vt100', 'SHELL': '/bin/sh', 'HOME': '/builddir', 'HOSTNAME': 'mock', 'PATH': '/usr/bin:/bin:/usr/sbin:/sbin', 'LANG': 'en_US.UTF-8'} and shell False
DEBUG: Child return code was: 0
DEBUG: ['/usr/bin/dnf', '--installroot', '/home/user/builder-R4.0/chroot-fc25/mock/fedora-25-x86_64/root/', '-y', '--releasever', '25', '--disableplugin=local', '--setopt=deltarpm=False', 'update']
DEBUG: child environment: None
DEBUG: Executing command: ['/usr/bin/dnf', '--installroot', '/home/user/builder-R4.0/chroot-fc25/mock/fedora-25-x86_64/root/', '-y', '--releasever', '25', '--disableplugin=local', '--setopt=deltarpm=False', 'update'] with env {'TERM': 'vt100', 'SHELL': '/bin/bash', 'HOME': '/builddir', 'HOSTNAME': 'mock', 'PATH': '/usr/bin:/bin:/usr/sbin:/sbin', 'PROMPT_COMMAND': 'printf "\\033]0;<mock-chroot>\\007"', 'PS1': '<mock-chroot> \\s-\\v\\$ ', 'LANG': 'en_US.UTF-8', 'LC_MESSAGES': 'C.UTF-8'} and shell False
DEBUG: builder-local 192 MB/s | 4.4 MB 00:00
DEBUG: Last metadata expiration check: 0:00:01 ago on Tue 15 May 2018 01:41:56 AM CEST.
DEBUG: Dependencies resolved.
DEBUG: Nothing to do.
DEBUG: Complete!
DEBUG: Child return code was: 0
DEBUG: child environment: None
DEBUG: Executing command: ['/bin/umount', '-n', '-l', '/home/user/builder-R4.0/chroot-fc25/mock/fedora-25-x86_64/root/dev/pts'] with env {'TERM': 'vt100', 'SHELL': '/bin/sh', 'HOME': '/builddir', 'HOSTNAME': 'mock', 'PATH': '/usr/bin:/bin:/usr/sbin:/sbin', 'LANG': 'en_US.UTF-8'} and shell False
DEBUG: Child return code was: 0
DEBUG: child environment: None
DEBUG: Executing command: ['/bin/umount', '-n', '-l', '/home/user/builder-R4.0/chroot-fc25/mock/fedora-25-x86_64/root/dev/shm'] with env {'TERM': 'vt100', 'SHELL': '/bin/sh', 'HOME': '/builddir', 'HOSTNAME': 'mock', 'PATH': '/usr/bin:/bin:/usr/sbin:/sbin', 'LANG': 'en_US.UTF-8'} and shell False
DEBUG: Child return code was: 0
DEBUG: child environment: None
DEBUG: Executing command: ['/bin/umount', '-n', '-l', '/home/user/builder-R4.0/chroot-fc25/mock/fedora-25-x86_64/root/sys'] with env {'TERM': 'vt100', 'SHELL': '/bin/sh', 'HOME': '/builddir', 'HOSTNAME': 'mock', 'PATH': '/usr/bin:/bin:/usr/sbin:/sbin', 'LANG': 'en_US.UTF-8'} and shell False
DEBUG: Child return code was: 0
DEBUG: child environment: None
DEBUG: Executing command: ['/bin/umount', '-n', '-l', '/home/user/builder-R4.0/chroot-fc25/mock/fedora-25-x86_64/root/proc'] with env {'TERM': 'vt100', 'SHELL': '/bin/sh', 'HOME': '/builddir', 'HOSTNAME': 'mock', 'PATH': '/usr/bin:/bin:/usr/sbin:/sbin', 'LANG': 'en_US.UTF-8'} and shell False
DEBUG: Child return code was: 0
Finish: dnf update
DEBUG: touching file: /home/user/builder-R4.0/chroot-fc25/mock/fedora-25-x86_64/root/.initialized
DEBUG: removing 3 rpm db files
DEBUG: nuke_rpm_db: removing /home/user/builder-R4.0/chroot-fc25/mock/fedora-25-x86_64/root/var/lib/rpm/__db.003
DEBUG: nuke_rpm_db: removing /home/user/builder-R4.0/chroot-fc25/mock/fedora-25-x86_64/root/var/lib/rpm/__db.002
DEBUG: nuke_rpm_db: removing /home/user/builder-R4.0/chroot-fc25/mock/fedora-25-x86_64/root/var/lib/rpm/__db.001
Finish: chroot init
Start: buildsrpm
Start: rpmbuild -bs
INFO: ENTER ['do'](['bash', '--login', '-c', '/usr/bin/rpmbuild -bs --target x86_64 --nodeps /builddir/build/SPECS/pykickstart.spec'], chrootPath='/home/user/builder-R4.0/chroot-fc25/mock/fedora-25-x86_64/root'env={'TERM': 'vt100', 'SHELL': '/bin/bash', 'HOME': '/builddir', 'HOSTNAME': 'mock', 'PATH': '/usr/bin:/bin:/usr/sbin:/sbin', 'PROMPT_COMMAND': 'printf "\\033]0;<mock-chroot>\\007"', 'PS1': '<mock-chroot> \\s-\\v\\$ ', 'LANG': 'en_US.UTF-8'}shell=Falselogger=<mockbuild.trace_decorator.getLog object at 0x759c0029c940>timeout=0uid=1000gid=135user='mockbuild'nspawn_args=[]unshare_net=TrueprintOutput=False)
DEBUG: child environment: None
DEBUG: Executing command: ['/usr/bin/systemd-nspawn', '-q', '-M', 'b376b9022e3b475d8566126cd4a490c8', '-D', '/home/user/builder-R4.0/chroot-fc25/mock/fedora-25-x86_64/root', '-a', '--setenv=TERM=vt100', '--setenv=SHELL=/bin/bash', '--setenv=HOME=/builddir', '--setenv=HOSTNAME=mock', '--setenv=PATH=/usr/bin:/bin:/usr/sbin:/sbin', '--setenv=PROMPT_COMMAND=printf "\\033]0;<mock-chroot>\\007"', '--setenv=PS1=<mock-chroot> \\s-\\v\\$ ', '--setenv=LANG=en_US.UTF-8', '-u', 'mockbuild', 'bash', '--login', '-c', '/usr/bin/rpmbuild -bs --target x86_64 --nodeps /builddir/build/SPECS/pykickstart.spec'] with env {'TERM': 'vt100', 'SHELL': '/bin/bash', 'HOME': '/builddir', 'HOSTNAME': 'mock', 'PATH': '/usr/bin:/bin:/usr/sbin:/sbin', 'PROMPT_COMMAND': 'printf "\\033]0;<mock-chroot>\\007"', 'PS1': '<mock-chroot> \\s-\\v\\$ ', 'LANG': 'en_US.UTF-8'} and shell False
DEBUG: BUILDSTDERR: DEBUG: Unsharing. Flags: 1073741824
DEBUG: BUILDSTDERR: DEBUG: Unsharing. Flags: 134217728
DEBUG: BUILDSTDERR: error: File /builddir/build/SOURCES/pykickstart-2.32.tar.gz: No such file or directory
DEBUG: Building target platforms: x86_64
DEBUG: Building for target x86_64
DEBUG: Child return code was: 1
INFO: EXCEPTION: [Error()]
Traceback (most recent call last):
File "/usr/lib/python3.6/site-packages/mockbuild/trace_decorator.py", line 96, in trace
result = func(*args, **kw)
File "/usr/lib/python3.6/site-packages/mockbuild/util.py", line 626, in do
raise exception.Error("Command failed: \n # %s\n%s" % (command, output), child.returncode)
mockbuild.exception.Error: Command failed:
# /usr/bin/systemd-nspawn -q -M b376b9022e3b475d8566126cd4a490c8 -D /home/user/builder-R4.0/chroot-fc25/mock/fedora-25-x86_64/root -a --setenv=TERM=vt100 --setenv=SHELL=/bin/bash --setenv=HOME=/builddir --setenv=HOSTNAME=mock --setenv=PATH=/usr/bin:/bin:/usr/sbin:/sbin --setenv=PROMPT_COMMAND=printf "\033]0;<mock-chroot>\007" --setenv=PS1=<mock-chroot> \s-\v\$ --setenv=LANG=en_US.UTF-8 -u mockbuild bash --login -c /usr/bin/rpmbuild -bs --target x86_64 --nodeps /builddir/build/SPECS/pykickstart.spec
Finish: rpmbuild -bs
Finish: buildsrpm
ERROR: Exception(pykickstart/pykickstart.spec) Config(fedora-25-x86_64) 9 minutes 32 seconds
INFO: Results and/or logs in: /home/user/builder-R4.0/chroot-fc25//home/user/qubes-src/installer-qubes-os/pkgs/fc25
INFO: Cleaning up build root ('cleanup_on_failure=True')
Start: clean chroot
DEBUG: kill orphans
DEBUG: child environment: None
DEBUG: Executing command: ['/bin/umount', '-n', '/home/user/builder-R4.0/chroot-fc25/mock/fedora-25-x86_64/root/var/cache/dnf/'] with env {'TERM': 'vt100', 'SHELL': '/bin/sh', 'HOME': '/builddir', 'HOSTNAME': 'mock', 'PATH': '/usr/bin:/bin:/usr/sbin:/sbin', 'LANG': 'en_US.UTF-8'} and shell False
DEBUG: Child return code was: 1
DEBUG: child environment: None
DEBUG: Executing command: ['/bin/umount', '-n', '/home/user/builder-R4.0/chroot-fc25/mock/fedora-25-x86_64/root/var/cache/dnf/'] with env {'TERM': 'vt100', 'SHELL': '/bin/sh', 'HOME': '/builddir', 'HOSTNAME': 'mock', 'PATH': '/usr/bin:/bin:/usr/sbin:/sbin', 'LANG': 'en_US.UTF-8'} and shell False
DEBUG: Child return code was: 1
DEBUG: child environment: None
DEBUG: Executing command: ['btrfs', 'subv', 'list', '/home/user/builder-R4.0/chroot-fc25/mock'] with env {'TERM': 'vt100', 'SHELL': '/bin/sh', 'HOME': '/builddir', 'HOSTNAME': 'mock', 'PATH': '/usr/bin:/bin:/usr/sbin:/sbin', 'LANG': 'en_US.UTF-8'} and shell False
DEBUG: BUILDSTDERR: ERROR: not a btrfs filesystem: /home/user/builder-R4.0/chroot-fc25/mock
DEBUG: BUILDSTDERR: ERROR: can't access '/home/user/builder-R4.0/chroot-fc25/mock'
DEBUG: Child return code was: 1
DEBUG: Please ignore the error above above about btrfs.
DEBUG: ensuring that dir exists: /home/user/builder-R4.0/chroot-fc25/mock/fedora-25-x86_64
DEBUG: kill orphans
DEBUG: child environment: None
DEBUG: Executing command: ['/bin/umount', '-n', '/home/user/builder-R4.0/chroot-fc25/mock/fedora-25-x86_64/root/var/cache/dnf/'] with env {'TERM': 'vt100', 'SHELL': '/bin/sh', 'HOME': '/builddir', 'HOSTNAME': 'mock', 'PATH': '/usr/bin:/bin:/usr/sbin:/sbin', 'LANG': 'en_US.UTF-8'} and shell False
DEBUG: Child return code was: 0
Traceback (most recent call last):
File "/usr/libexec/mock/mock", line 481, in rebuild_generic
ret = cmd(item)
File "/usr/libexec/mock/mock", line 552, in cmd
follow_links=options.symlink_dereference)
File "/usr/lib/python3.6/site-packages/mockbuild/trace_decorator.py", line 96, in trace
result = func(*args, **kw)
File "/usr/lib/python3.6/site-packages/mockbuild/backend.py", line 391, in buildsrpm
rebuilt_srpm = self.rebuild_installed_srpm(chrootspec, timeout)
File "/usr/lib/python3.6/site-packages/mockbuild/trace_decorator.py", line 96, in trace
result = func(*args, **kw)
File "/usr/lib/python3.6/site-packages/mockbuild/backend.py", line 456, in rebuild_installed_srpm
printOutput=self.config['print_main_output']
File "/usr/lib/python3.6/site-packages/mockbuild/buildroot.py", line 204, in doChroot
env=env, shell=shell, *args, **kargs)
File "/usr/lib/python3.6/site-packages/mockbuild/trace_decorator.py", line 96, in trace
result = func(*args, **kw)
File "/usr/lib/python3.6/site-packages/mockbuild/util.py", line 626, in do
raise exception.Error("Command failed: \n # %s\n%s" % (command, output), child.returncode)
mockbuild.exception.Error: Command failed:
# /usr/bin/systemd-nspawn -q -M b376b9022e3b475d8566126cd4a490c8 -D /home/user/builder-R4.0/chroot-fc25/mock/fedora-25-x86_64/root -a --setenv=TERM=vt100 --setenv=SHELL=/bin/bash --setenv=HOME=/builddir --setenv=HOSTNAME=mock --setenv=PATH=/usr/bin:/bin:/usr/sbin:/sbin --setenv=PROMPT_COMMAND=printf "\033]0;<mock-chroot>\007" --setenv=PS1=<mock-chroot> \s-\v\$ --setenv=LANG=en_US.UTF-8 -u mockbuild bash --login -c /usr/bin/rpmbuild -bs --target x86_64 --nodeps /builddir/build/SPECS/pykickstart.spec
During handling of the above exception, another exception occurred:
Traceback (most recent call last):
File "/usr/libexec/mock/mock", line 959, in <module>
main()
File "/usr/lib/python3.6/site-packages/mockbuild/trace_decorator.py", line 96, in trace
result = func(*args, **kw)
File "/usr/libexec/mock/mock", line 759, in main
run_command(options, args, config_opts, commands, buildroot, state)
File "/usr/lib/python3.6/site-packages/mockbuild/trace_decorator.py", line 96, in trace
result = func(*args, **kw)
File "/usr/libexec/mock/mock", line 846, in run_command
do_buildsrpm(config_opts, commands, buildroot, options, args)
File "/usr/lib/python3.6/site-packages/mockbuild/trace_decorator.py", line 96, in trace
result = func(*args, **kw)
File "/usr/libexec/mock/mock", line 554, in do_buildsrpm
cmd=cmd, post=None, clean=clean)
File "/usr/lib/python3.6/site-packages/mockbuild/trace_decorator.py", line 96, in trace
result = func(*args, **kw)
File "/usr/libexec/mock/mock", line 501, in rebuild_generic
commands.clean()
File "/usr/lib/python3.6/site-packages/mockbuild/trace_decorator.py", line 96, in trace
result = func(*args, **kw)
File "/usr/lib/python3.6/site-packages/mockbuild/backend.py", line 84, in clean
self.buildroot.delete()
File "/usr/lib/python3.6/site-packages/mockbuild/trace_decorator.py", line 96, in trace
result = func(*args, **kw)
File "/usr/lib/python3.6/site-packages/mockbuild/buildroot.py", line 613, in delete
util.rmtree(self.basedir, selinux=self.selinux)
File "/usr/lib/python3.6/site-packages/mockbuild/trace_decorator.py", line 96, in trace
result = func(*args, **kw)
File "/usr/lib/python3.6/site-packages/mockbuild/util.py", line 153, in rmtree
rmtree(fullname, selinux=selinux, exclude=exclude)
File "/usr/lib/python3.6/site-packages/mockbuild/trace_decorator.py", line 96, in trace
result = func(*args, **kw)
File "/usr/lib/python3.6/site-packages/mockbuild/util.py", line 153, in rmtree
rmtree(fullname, selinux=selinux, exclude=exclude)
File "/usr/lib/python3.6/site-packages/mockbuild/trace_decorator.py", line 96, in trace
result = func(*args, **kw)
File "/usr/lib/python3.6/site-packages/mockbuild/util.py", line 162, in rmtree
os.rmdir(path)
PermissionError: [Errno 13] Permission denied: '/home/user/builder-R4.0/chroot-fc25/mock/fedora-25-x86_64/root/proc'
make[2]: *** [/home/user/builder-R4.0/qubes-src/builder-rpm/Makefile-mock.rpmbuilder:53: dist-package-build] Error 1
make[2]: Leaving directory '/home/user/builder-R4.0'
Sign up for free to join this conversation on GitHub. Already have an account? Sign in to comment