Skip to content

Embed URL

HTTPS clone URL

Subversion checkout URL

You can clone with
or
.
Download ZIP
Attempting to build ruby-2.0.0 in SmartOS
[admin@test1 ~]$ openssl md5 ruby-2.0.0-p0.tar.gz
MD5(ruby-2.0.0-p0.tar.gz)= 50d307c4dc9297ae59952527be4e755d
[admin@test1 ~]$ pkgin list
autoconf-2.69nb1 Generates automatic source code configuration scripts
automake-1.12.6 GNU Standards-compliant Makefile generator
binutils-2.22nb1 GNU binary utilities
bison-2.7 GNU yacc(1) replacement
bmake-20110606 Portable (autoconf) version of NetBSD 'make' utility
bootstrap-mk-files-20120415 *.mk files for the bootstrap bmake utility
build-essential-1.0 Meta-package for essential build utilities
bzip2-1.0.6 Block-sorting file compressor
changepass-1.3.3 Simple tool to set user passwords non-interactively
coreutils-8.13nb5 GNU basic file, shell and text manipulation utilities
curl-7.28.1nb3 Client that groks URLs
cyrus-sasl-2.1.26nb1 Simple Authentication and Security Layer
db4-4.8.30 Berkeley DB version 4 from Oracle
diffutils-3.2nb2 GNU diff utilities - find the differences between files
expat-2.1.0 XML parser library written in C
findutils-4.2.33nb3 The GNU find, locate, updatedb, and xargs utilities
gawk-4.0.1nb2 GNU awk
gcc47-4.7.2 The GNU Compiler Collection (GCC) - 4.7 Release Series
gcc47-libs-4.7.2nb1 The GNU Compiler Collection (GCC) support shared libraries.
genbfpw-0 Simple tool to generate Blowfish crypts of passwords
gettext-lib-0.18.1.1nb1 Internationalized Message Handling Library (libintl)
gmake-3.82nb5 GNU version of 'make' utility
grep-2.14nb1 GNU grep
groff-1.20.1nb8 GNU roff text processing suite
gsed-4.2.1nb4 GNU implementation of sed, the POSIX stream editor
gtar-base-1.26nb2 The GNU tape archiver with remote magnetic tape support
heimdal-1.5.2nb5 Kerberos 5 implementation
install-sh-20100824 install script compatible with the BSD install program
less-444nb1 Pager similar to more and pg
libarchive-2.8.4nb1 Library to read/create different archive formats
libffi-3.0.11nb1 Foreign function interface
libgetopt-1.4.4 Library for handling --long options
libiconv-1.14nb2 Character set conversion library
libidn-1.26 Internationalized Domain Names command line tool
libssh2-1.2.2nb1 SSH2 protocol library
libtool-2.2.6b Generic shared library support script
libtool-base-2.2.6bnb8 Generic shared library support script (the script itself)
libtool-info-2.2.6b Generic shared library support script - info pages
libyaml-0.1.4 YAML 1.1 parser and emitter written in C
m4-1.4.16nb3 GNU version of UNIX m4 macro language processor
mozilla-rootcerts-1.0.20110902 Root CA certificates from the Mozilla Project
nawk-20050424nb3 Brian Kernighan's pattern-directed scanning and processing language
nbsed-20120308 NetBSD-current's sed(1)
ncurses-5.9 CRT screen handling and optimization package
nodejs-0.8.18 V8 JavaScript for clients and servers
openldap-client-2.4.33nb1 Lightweight Directory Access Protocol libraries and client programs
openssl-1.0.1dnb2 Secure Socket Layer and cryptographic library
p5-Authen-SASL-2.16 Perl module to handle SASL authentication
p5-Digest-HMAC-1.03nb1 Perl5 module for HMAC
p5-Digest-MD5-2.52nb1 Perl5 extension interface for MD5 algorithm
p5-Digest-SHA-5.81 Perl module for SHA-1/224/256/384/512 algorithms
p5-Email-Valid-0.190nb1 Perl5 module for testing validity of an email address
p5-Error-0.17018nb1 Perl extension module for try/throw/catch exception handling
p5-GSSAPI-0.28nb3 Perl extension providing access to the GSSAPIv2 library
p5-IO-Socket-INET6-2.69nb1 Perl object interface for AF_INET|AF_INET6 domain sockets
p5-IO-Socket-SSL-1.77 Perl5 SSL socket interface class
p5-MIME-Base64-3.13nb2 Perl5 module for Base64 and Quoted-Printable encodings
p5-MailTools-2.11nb1 Perl5 modules related to mail applications
p5-Net-DNS-0.69 Perl5 module for DNS resolution
p5-Net-IP-1.26 Perl extension for manipulating IPv4/IPv6 addresses
p5-Net-LibIDN-0.12nb4 Perl bindings for GNU Libidn
p5-Net-SMTP-SSL-1.01nb3 Perl5 module providing SSL support for Net::SMTP
p5-Net-SSLeay-1.49 Perl5 module for using OpenSSL
p5-Socket6-0.23nb3 Perl5 module to support getaddrinfo() and getnameinfo()
p5-TimeDate-1.20nb3 Perl5 TimeDate distribution
patch-2.5.9nb2 Patch files using diff output
pcre-8.32 Perl Compatible Regular Expressions library
perl-5.16.2nb2 Practical Extraction and Report Language
pkg_alternatives-1.6 Generic wrappers for programs with similar interfaces
pkg_install-20120221 Package management and administration tools for pkgsrc
pkg_install-info-4.5nb3 Standalone GNU info file installation utility
pkgin-0.6.3.1 Apt / yum like tool for managing pkgsrc binary packages
postfix-2.8.13nb1 Postfix SMTP server and tools
python27-2.7.3nb2 Interpreted, interactive, object-oriented programming language
readline-6.2 GNU library that can recall and edit previous input
scmgit-1.8.0.1 GIT version control suite meta-package
scmgit-base-1.8.0.1nb1 GIT Tree History Storage Tool (base package)
scmgit-docs-1.8.0.1 GIT Tree History Storage Tool (documentation)
smtools-20130305 Joyent tools relevant to SmartOS and SmartMachines
sqlite3-3.7.15 SQL Database Engine in a C Library
sudo-1.7.9p1nb1 Allow others to run commands as root
tcp_wrappers-7.6.4 Monitor and filter incoming requests for network services
xz-5.0.4 XZ utilities
zlib-1.2.7 General purpose data compression library
[admin@test1 ~]$ env
MANPATH=/opt/local/gcc47/man:/opt/local/java/sun6/man:/opt/local/lib/perl5/man:/opt/local/lib/perl5/vendor_perl/man:/opt/local/man:/usr/share/man
TERM=xterm-256color
SHELL=/usr/bin/bash
SSH_CLIENT=192.168.1.106 50816 22
OLDPWD=/home/admin/ruby-2.0.0-p0
SSH_TTY=/dev/pts/5
USER=admin
COLUMNS=125
PAGER=less
MAIL=/usr/mail/admin
PATH=/opt/local/bin:/opt/local/sbin:/usr/bin:/usr/sbin
PWD=/home/admin
LANG=en_AU.UTF-8
TZ=UTC
LINES=46
SHLVL=1
HOME=/home/admin
LOGNAME=admin
SSH_CONNECTION=192.168.1.106 50816 192.168.1.94 22
FTPMODE=auto
_=/opt/local/bin/env
[admin@test1 ~]$ gzcat ruby-2.0.0-p0.tar.gz |tar -xf -
[admin@test1 ~]$ cd ruby-2.0.0-p0
[admin@test1 ~/ruby-2.0.0-p0]$ bash ./configure --prefix=$HOME --with-opt-dir=/opt/local --enable-shared ac_cv_func_dl_iterate_phdr=no
checking build system type... x86_64-pc-solaris2.11
checking host system type... x86_64-pc-solaris2.11
checking target system type... x86_64-pc-solaris2.11
checking for gcc... gcc
checking whether the C compiler works... yes
checking for C compiler default output file name... a.out
checking for suffix of executables...
checking whether we are cross compiling... no
checking for suffix of object files... o
checking whether we are using the GNU C compiler... yes
checking whether gcc accepts -g... yes
checking for gcc option to accept ISO C89... none needed
checking for g++... g++
checking whether we are using the GNU C++ compiler... yes
checking whether g++ accepts -g... yes
checking how to run the C preprocessor... gcc -E
checking for grep that handles long lines and -e... /opt/local/bin/grep
checking for egrep... /opt/local/bin/grep -E
checking whether gcc needs -traditional... no
checking for ld... /usr/ccs/bin/ld
checking whether the linker is GNU ld... no
checking whether gcc -E accepts -o... yes
checking for ranlib... ranlib
checking for ar... ar
checking for as... as
checking for objdump... objdump
checking for objcopy... objcopy
checking for nm... nm
checking whether ln -s works... yes
checking whether make sets $(MAKE)... yes
checking for a BSD-compatible install... /opt/local/bin/ginstall -c
checking for a thread-safe mkdir -p... /opt/local/bin/mkdir -p
checking for dtrace... dtrace
checking for dot... no
checking for doxygen... no
checking for pkg-config... no
checking for ANSI C header files... yes
checking for sys/types.h... yes
checking for sys/stat.h... yes
checking for stdlib.h... yes
checking for string.h... yes
checking for memory.h... yes
checking for strings.h... yes
checking for inttypes.h... yes
checking for stdint.h... yes
checking for unistd.h... yes
checking minix/config.h usability... no
checking minix/config.h presence... no
checking for minix/config.h... no
checking whether it is safe to define __EXTENSIONS__... yes
checking for cd using physical directory... cd -P
checking whether -Wno-unused-parameter is accepted as CFLAGS... yes
checking whether -Wno-parentheses is accepted as CFLAGS... yes
checking whether -Wno-long-long is accepted as CFLAGS... yes
checking whether -Wno-missing-field-initializers is accepted as CFLAGS... yes
checking whether -Wunused-variable is accepted as CFLAGS... yes
checking whether -Werror=pointer-arith is accepted as CFLAGS... yes
checking whether -Werror=write-strings is accepted as CFLAGS... yes
checking whether -Werror=declaration-after-statement is accepted as CFLAGS... yes
checking whether -Werror=shorten-64-to-32 is accepted as CFLAGS... no
checking whether -Wshorten-64-to-32 is accepted as CFLAGS... no
checking whether -Werror=implicit-function-declaration is accepted as CFLAGS... yes
checking whether -Wall -Wextra is accepted as CFLAGS... yes
checking whether -ggdb3 is accepted as CFLAGS... yes
checking whether -D_FORTIFY_SOURCE=2 is accepted as CFLAGS... yes
checking whether -fstack-protector is accepted as CFLAGS... yes
checking whether -fstack-protector is accepted as LDFLAGS... yes
checking whether -ansi -std=iso9899:199409 is accepted as CFLAGS... yes
checking whether -fno-strict-overflow is accepted as CFLAGS... yes
checking whether -fvisibility=hidden is accepted as CFLAGS... yes
checking whether -fno-fast-math is accepted as CFLAGS... yes
checking for special C compiler options needed for large files... no
checking for _FILE_OFFSET_BITS value needed for large files... no
checking whether byte ordering is bigendian... no
checking for an ANSI C-conforming const... yes
checking whether char is unsigned... no
checking for inline... __inline__
checking for working volatile... yes
checking for long long... yes
checking for off_t... yes
checking char bit... 8
checking size of int... 0
checking size of short... 0
checking size of long... 0
checking size of long long... configure: error: in `/home/admin/ruby-2.0.0-p0':
configure: error: cannot compute sizeof (long long)
See `config.log' for more details
[admin@test1 ~/ruby-2.0.0-p0]$ cat config.log
This file contains any messages produced by compilers while
running configure, to aid debugging if configure makes a mistake.
It was created by configure, which was
generated by GNU Autoconf 2.69. Invocation command line was
$ ./configure --prefix=/home/admin --with-opt-dir=/opt/local --enable-shared ac_cv_func_dl_iterate_phdr=no
## --------- ##
## Platform. ##
## --------- ##
hostname = test1
uname -m = i86pc
uname -r = 5.11
uname -s = SunOS
uname -v = joyent_20130307T214308Z
/usr/bin/uname -p = i386
/bin/uname -X = System = SunOS
Node = test1
Release = 5.11
KernelID = joyent_20130307T214308Z
Machine = i86pc
BusType = <unknown>
Serial = <unknown>
Users = <unknown>
OEM# = 0
Origin# = 1
NumCPU = 2
/bin/arch = i86pc
/usr/bin/arch -k = i86pc
/usr/convex/getsysinfo = unknown
/usr/bin/hostinfo = unknown
/bin/machine = unknown
/usr/bin/oslevel = unknown
/bin/universe = unknown
PATH: /opt/local/bin
PATH: /opt/local/sbin
PATH: /usr/bin
PATH: /usr/sbin
## ----------- ##
## Core tests. ##
## ----------- ##
configure:2875: checking build system type
configure:2889: result: x86_64-pc-solaris2.11
configure:2967: checking host system type
configure:2980: result: x86_64-pc-solaris2.11
configure:3000: checking target system type
configure:3013: result: x86_64-pc-solaris2.11
configure:3445: checking for gcc
configure:3461: found /opt/local/bin/gcc
configure:3472: result: gcc
configure:3701: checking for C compiler version
configure:3710: gcc --version >&5
gcc (GCC) 4.7.2
Copyright (C) 2012 Free Software Foundation, Inc.
This is free software; see the source for copying conditions. There is NO
warranty; not even for MERCHANTABILITY or FITNESS FOR A PARTICULAR PURPOSE.
configure:3721: $? = 0
configure:3710: gcc -v >&5
Using built-in specs.
COLLECT_GCC=/opt/local/gcc47/bin/gcc
COLLECT_LTO_WRAPPER=/opt/local/gcc47/libexec/gcc/x86_64-sun-solaris2.11/4.7.2/lto-wrapper
Target: x86_64-sun-solaris2.11
Configured with: ../gcc-4.7.2/configure --enable-languages='c fortran c++' --enable-shared --enable-long-long --with-local-prefix=/opt/local/gcc47 --enable-libssp --enable-threads=posix --with-boot-ldflags='-static-libstdc++ -static-libgcc -Wl,-R/opt/local/lib' --disable-nls --enable-__cxa_atexit --with-gxx-include-dir=/opt/local/gcc47/include/c++/ --without-gnu-ld --with-ld=/usr/bin/ld --with-gnu-as --with-as=/opt/local/bin/gas --prefix=/opt/local/gcc47 --build=x86_64-sun-solaris2.11 --host=x86_64-sun-solaris2.11 --infodir=/opt/local/gcc47/info --mandir=/opt/local/gcc47/man
Thread model: posix
gcc version 4.7.2 (GCC)
configure:3721: $? = 0
configure:3710: gcc -V >&5
gcc: error: unrecognized command line option '-V'
gcc: fatal error: no input files
compilation terminated.
configure:3721: $? = 1
configure:3710: gcc -qversion >&5
gcc: error: unrecognized command line option '-qversion'
gcc: fatal error: no input files
compilation terminated.
configure:3721: $? = 1
configure:3741: checking whether the C compiler works
configure:3763: gcc conftest.c >&5
configure:3767: $? = 0
configure:3815: result: yes
configure:3818: checking for C compiler default output file name
configure:3820: result: a.out
configure:3826: checking for suffix of executables
configure:3833: gcc -o conftest conftest.c >&5
configure:3837: $? = 0
configure:3859: result:
configure:3881: checking whether we are cross compiling
configure:3889: gcc -o conftest conftest.c >&5
configure:3893: $? = 0
configure:3900: ./conftest
configure:3904: $? = 0
configure:3919: result: no
configure:3924: checking for suffix of object files
configure:3946: gcc -c conftest.c >&5
configure:3950: $? = 0
configure:3971: result: o
configure:3975: checking whether we are using the GNU C compiler
configure:3994: gcc -c conftest.c >&5
configure:3994: $? = 0
configure:4003: result: yes
configure:4012: checking whether gcc accepts -g
configure:4032: gcc -c -g conftest.c >&5
configure:4032: $? = 0
configure:4073: result: yes
configure:4090: checking for gcc option to accept ISO C89
configure:4153: gcc -c -g -O2 conftest.c >&5
configure:4153: $? = 0
configure:4166: result: none needed
configure:4244: checking for g++
configure:4260: found /opt/local/bin/g++
configure:4271: result: g++
configure:4298: checking for C++ compiler version
configure:4307: g++ --version >&5
g++ (GCC) 4.7.2
Copyright (C) 2012 Free Software Foundation, Inc.
This is free software; see the source for copying conditions. There is NO
warranty; not even for MERCHANTABILITY or FITNESS FOR A PARTICULAR PURPOSE.
configure:4318: $? = 0
configure:4307: g++ -v >&5
Using built-in specs.
COLLECT_GCC=/opt/local/gcc47/bin/g++
COLLECT_LTO_WRAPPER=/opt/local/gcc47/libexec/gcc/x86_64-sun-solaris2.11/4.7.2/lto-wrapper
Target: x86_64-sun-solaris2.11
Configured with: ../gcc-4.7.2/configure --enable-languages='c fortran c++' --enable-shared --enable-long-long --with-local-prefix=/opt/local/gcc47 --enable-libssp --enable-threads=posix --with-boot-ldflags='-static-libstdc++ -static-libgcc -Wl,-R/opt/local/lib' --disable-nls --enable-__cxa_atexit --with-gxx-include-dir=/opt/local/gcc47/include/c++/ --without-gnu-ld --with-ld=/usr/bin/ld --with-gnu-as --with-as=/opt/local/bin/gas --prefix=/opt/local/gcc47 --build=x86_64-sun-solaris2.11 --host=x86_64-sun-solaris2.11 --infodir=/opt/local/gcc47/info --mandir=/opt/local/gcc47/man
Thread model: posix
gcc version 4.7.2 (GCC)
configure:4318: $? = 0
configure:4307: g++ -V >&5
g++: error: unrecognized command line option '-V'
g++: fatal error: no input files
compilation terminated.
configure:4318: $? = 1
configure:4307: g++ -qversion >&5
g++: error: unrecognized command line option '-qversion'
g++: fatal error: no input files
compilation terminated.
configure:4318: $? = 1
configure:4322: checking whether we are using the GNU C++ compiler
configure:4341: g++ -c conftest.cpp >&5
configure:4341: $? = 0
configure:4350: result: yes
configure:4359: checking whether g++ accepts -g
configure:4379: g++ -c -g conftest.cpp >&5
configure:4379: $? = 0
configure:4420: result: yes
configure:4449: checking how to run the C preprocessor
configure:4480: gcc -E conftest.c
configure:4480: $? = 0
configure:4494: gcc -E conftest.c
conftest.c:12:28: fatal error: ac_nonexistent.h: No such file or directory
compilation terminated.
configure:4494: $? = 1
configure: failed program was:
| /* confdefs.h */
| #define PACKAGE_NAME ""
| #define PACKAGE_TARNAME ""
| #define PACKAGE_VERSION ""
| #define PACKAGE_STRING ""
| #define PACKAGE_BUGREPORT ""
| #define PACKAGE_URL ""
| #define CANONICALIZATION_FOR_MATHN 1
| #define RUBY_BASE_NAME "ruby" !<verconf>!
| #define RUBY_VERSION_NAME RUBY_BASE_NAME"-"RUBY_LIB_VERSION !<verconf>!
| /* end confdefs.h. */
| #include <ac_nonexistent.h>
configure:4519: result: gcc -E
configure:4539: gcc -E conftest.c
configure:4539: $? = 0
configure:4553: gcc -E conftest.c
conftest.c:12:28: fatal error: ac_nonexistent.h: No such file or directory
compilation terminated.
configure:4553: $? = 1
configure: failed program was:
| /* confdefs.h */
| #define PACKAGE_NAME ""
| #define PACKAGE_TARNAME ""
| #define PACKAGE_VERSION ""
| #define PACKAGE_STRING ""
| #define PACKAGE_BUGREPORT ""
| #define PACKAGE_URL ""
| #define CANONICALIZATION_FOR_MATHN 1
| #define RUBY_BASE_NAME "ruby" !<verconf>!
| #define RUBY_VERSION_NAME RUBY_BASE_NAME"-"RUBY_LIB_VERSION !<verconf>!
| /* end confdefs.h. */
| #include <ac_nonexistent.h>
configure:4633: checking for grep that handles long lines and -e
configure:4691: result: /opt/local/bin/grep
configure:4696: checking for egrep
configure:4758: result: /opt/local/bin/grep -E
configure:4764: checking whether gcc needs -traditional
configure:4798: result: no
configure:4855: checking for ld
configure:4874: found /usr/ccs/bin/ld
configure:4886: result: /usr/ccs/bin/ld
configure:5020: checking whether the linker is GNU ld
configure:5032: result: no
configure:5036: checking whether gcc -E accepts -o
configure:5048: gcc -E -o conftest-1.i conftest.c
configure:5048: $? = 0
configure:5055: result: yes
configure:5262: checking for ranlib
configure:5278: found /opt/local/bin/ranlib
configure:5289: result: ranlib
configure:5354: checking for ar
configure:5370: found /opt/local/bin/ar
configure:5381: result: ar
configure:5492: checking for as
configure:5508: found /opt/local/bin/as
configure:5519: result: as
configure:5601: checking for objdump
configure:5617: found /opt/local/bin/objdump
configure:5628: result: objdump
configure:5701: checking for objcopy
configure:5717: found /opt/local/bin/objcopy
configure:5728: result: objcopy
configure:6145: checking for nm
configure:6161: found /opt/local/bin/nm
configure:6172: result: nm
configure:6195: checking whether ln -s works
configure:6199: result: yes
configure:6206: checking whether make sets $(MAKE)
configure:6228: result: yes
configure:6251: checking for a BSD-compatible install
configure:6319: result: /opt/local/bin/ginstall -c
configure:6330: checking for a thread-safe mkdir -p
configure:6369: result: /opt/local/bin/mkdir -p
configure:6389: checking for dtrace
configure:6405: found /usr/sbin/dtrace
configure:6416: result: dtrace
configure:6468: checking for dot
configure:6498: result: no
configure:6510: checking for doxygen
configure:6540: result: no
configure:6596: checking for pkg-config
configure:6643: result: no
configure:6650: checking for ANSI C header files
configure:6670: gcc -c -g -O2 conftest.c >&5
configure:6670: $? = 0
configure:6743: gcc -o conftest -g -O2 conftest.c >&5
configure:6743: $? = 0
configure:6743: ./conftest
configure:6743: $? = 0
configure:6754: result: yes
configure:6767: checking for sys/types.h
configure:6767: gcc -c -g -O2 conftest.c >&5
configure:6767: $? = 0
configure:6767: result: yes
configure:6767: checking for sys/stat.h
configure:6767: gcc -c -g -O2 conftest.c >&5
configure:6767: $? = 0
configure:6767: result: yes
configure:6767: checking for stdlib.h
configure:6767: gcc -c -g -O2 conftest.c >&5
configure:6767: $? = 0
configure:6767: result: yes
configure:6767: checking for string.h
configure:6767: gcc -c -g -O2 conftest.c >&5
configure:6767: $? = 0
configure:6767: result: yes
configure:6767: checking for memory.h
configure:6767: gcc -c -g -O2 conftest.c >&5
configure:6767: $? = 0
configure:6767: result: yes
configure:6767: checking for strings.h
configure:6767: gcc -c -g -O2 conftest.c >&5
configure:6767: $? = 0
configure:6767: result: yes
configure:6767: checking for inttypes.h
configure:6767: gcc -c -g -O2 conftest.c >&5
configure:6767: $? = 0
configure:6767: result: yes
configure:6767: checking for stdint.h
configure:6767: gcc -c -g -O2 conftest.c >&5
configure:6767: $? = 0
configure:6767: result: yes
configure:6767: checking for unistd.h
configure:6767: gcc -c -g -O2 conftest.c >&5
configure:6767: $? = 0
configure:6767: result: yes
configure:6780: checking minix/config.h usability
configure:6780: gcc -c -g -O2 conftest.c >&5
conftest.c:55:26: fatal error: minix/config.h: No such file or directory
compilation terminated.
configure:6780: $? = 1
configure: failed program was:
| /* confdefs.h */
| #define PACKAGE_NAME ""
| #define PACKAGE_TARNAME ""
| #define PACKAGE_VERSION ""
| #define PACKAGE_STRING ""
| #define PACKAGE_BUGREPORT ""
| #define PACKAGE_URL ""
| #define CANONICALIZATION_FOR_MATHN 1
| #define RUBY_BASE_NAME "ruby" !<verconf>!
| #define RUBY_VERSION_NAME RUBY_BASE_NAME"-"RUBY_LIB_VERSION !<verconf>!
| #define STDC_HEADERS 1
| #define HAVE_SYS_TYPES_H 1
| #define HAVE_SYS_STAT_H 1
| #define HAVE_STDLIB_H 1
| #define HAVE_STRING_H 1
| #define HAVE_MEMORY_H 1
| #define HAVE_STRINGS_H 1
| #define HAVE_INTTYPES_H 1
| #define HAVE_STDINT_H 1
| #define HAVE_UNISTD_H 1
| /* end confdefs.h. */
| #include <stdio.h>
| #ifdef HAVE_SYS_TYPES_H
| # include <sys/types.h>
| #endif
| #ifdef HAVE_SYS_STAT_H
| # include <sys/stat.h>
| #endif
| #ifdef STDC_HEADERS
| # include <stdlib.h>
| # include <stddef.h>
| #else
| # ifdef HAVE_STDLIB_H
| # include <stdlib.h>
| # endif
| #endif
| #ifdef HAVE_STRING_H
| # if !defined STDC_HEADERS && defined HAVE_MEMORY_H
| # include <memory.h>
| # endif
| # include <string.h>
| #endif
| #ifdef HAVE_STRINGS_H
| # include <strings.h>
| #endif
| #ifdef HAVE_INTTYPES_H
| # include <inttypes.h>
| #endif
| #ifdef HAVE_STDINT_H
| # include <stdint.h>
| #endif
| #ifdef HAVE_UNISTD_H
| # include <unistd.h>
| #endif
| #include <minix/config.h>
configure:6780: result: no
configure:6780: checking minix/config.h presence
configure:6780: gcc -E conftest.c
conftest.c:22:26: fatal error: minix/config.h: No such file or directory
compilation terminated.
configure:6780: $? = 1
configure: failed program was:
| /* confdefs.h */
| #define PACKAGE_NAME ""
| #define PACKAGE_TARNAME ""
| #define PACKAGE_VERSION ""
| #define PACKAGE_STRING ""
| #define PACKAGE_BUGREPORT ""
| #define PACKAGE_URL ""
| #define CANONICALIZATION_FOR_MATHN 1
| #define RUBY_BASE_NAME "ruby" !<verconf>!
| #define RUBY_VERSION_NAME RUBY_BASE_NAME"-"RUBY_LIB_VERSION !<verconf>!
| #define STDC_HEADERS 1
| #define HAVE_SYS_TYPES_H 1
| #define HAVE_SYS_STAT_H 1
| #define HAVE_STDLIB_H 1
| #define HAVE_STRING_H 1
| #define HAVE_MEMORY_H 1
| #define HAVE_STRINGS_H 1
| #define HAVE_INTTYPES_H 1
| #define HAVE_STDINT_H 1
| #define HAVE_UNISTD_H 1
| /* end confdefs.h. */
| #include <minix/config.h>
configure:6780: result: no
configure:6780: checking for minix/config.h
configure:6780: result: no
configure:6801: checking whether it is safe to define __EXTENSIONS__
configure:6819: gcc -c -g -O2 conftest.c >&5
configure:6819: $? = 0
configure:6826: result: yes
configure:6858: checking for cd using physical directory
configure:6873: result: cd -P
configure:6905: checking whether -Wno-unused-parameter is accepted as CFLAGS
configure:6928: gcc -c -g -O2 -Wno-unused-parameter conftest.c >&5
configure:6928: $? = 0
configure:6942: result: yes
configure:6905: checking whether -Wno-parentheses is accepted as CFLAGS
configure:6928: gcc -c -g -O2 -Wno-parentheses conftest.c >&5
configure:6928: $? = 0
configure:6942: result: yes
configure:6905: checking whether -Wno-long-long is accepted as CFLAGS
configure:6928: gcc -c -g -O2 -Wno-long-long conftest.c >&5
configure:6928: $? = 0
configure:6942: result: yes
configure:6905: checking whether -Wno-missing-field-initializers is accepted as CFLAGS
configure:6928: gcc -c -g -O2 -Wno-missing-field-initializers conftest.c >&5
configure:6928: $? = 0
configure:6942: result: yes
configure:6905: checking whether -Wunused-variable is accepted as CFLAGS
configure:6928: gcc -c -g -O2 -Wunused-variable conftest.c >&5
configure:6928: $? = 0
configure:6942: result: yes
configure:6905: checking whether -Werror=pointer-arith is accepted as CFLAGS
configure:6928: gcc -c -g -O2 -Werror=pointer-arith conftest.c >&5
configure:6928: $? = 0
configure:6942: result: yes
configure:6905: checking whether -Werror=write-strings is accepted as CFLAGS
configure:6928: gcc -c -g -O2 -Werror=write-strings conftest.c >&5
configure:6928: $? = 0
configure:6942: result: yes
configure:6905: checking whether -Werror=declaration-after-statement is accepted as CFLAGS
configure:6928: gcc -c -g -O2 -Werror=declaration-after-statement conftest.c >&5
configure:6928: $? = 0
configure:6942: result: yes
configure:6905: checking whether -Werror=shorten-64-to-32 is accepted as CFLAGS
configure:6928: gcc -c -g -O2 -Werror=shorten-64-to-32 conftest.c >&5
cc1: error: -Werror=shorten-64-to-32: no option -Wshorten-64-to-32
configure:6928: $? = 1
configure: failed program was:
| /* confdefs.h */
| #define PACKAGE_NAME ""
| #define PACKAGE_TARNAME ""
| #define PACKAGE_VERSION ""
| #define PACKAGE_STRING ""
| #define PACKAGE_BUGREPORT ""
| #define PACKAGE_URL ""
| #define CANONICALIZATION_FOR_MATHN 1
| #define RUBY_BASE_NAME "ruby" !<verconf>!
| #define RUBY_VERSION_NAME RUBY_BASE_NAME"-"RUBY_LIB_VERSION !<verconf>!
| #define STDC_HEADERS 1
| #define HAVE_SYS_TYPES_H 1
| #define HAVE_SYS_STAT_H 1
| #define HAVE_STDLIB_H 1
| #define HAVE_STRING_H 1
| #define HAVE_MEMORY_H 1
| #define HAVE_STRINGS_H 1
| #define HAVE_INTTYPES_H 1
| #define HAVE_STDINT_H 1
| #define HAVE_UNISTD_H 1
| #define __EXTENSIONS__ 1
| #define _ALL_SOURCE 1
| #define _GNU_SOURCE 1
| #define _POSIX_PTHREAD_SEMANTICS 1
| #define _TANDEM_SOURCE 1
| /* end confdefs.h. */
|
| int
| main ()
| {
|
| ;
| return 0;
| }
configure:6946: result: no
configure:6964: checking whether -Wshorten-64-to-32 is accepted as CFLAGS
configure:6987: gcc -c -g -O2 -Wshorten-64-to-32 conftest.c >&5
gcc: error: unrecognized command line option '-Wshorten-64-to-32'
configure:6987: $? = 1
configure: failed program was:
| /* confdefs.h */
| #define PACKAGE_NAME ""
| #define PACKAGE_TARNAME ""
| #define PACKAGE_VERSION ""
| #define PACKAGE_STRING ""
| #define PACKAGE_BUGREPORT ""
| #define PACKAGE_URL ""
| #define CANONICALIZATION_FOR_MATHN 1
| #define RUBY_BASE_NAME "ruby" !<verconf>!
| #define RUBY_VERSION_NAME RUBY_BASE_NAME"-"RUBY_LIB_VERSION !<verconf>!
| #define STDC_HEADERS 1
| #define HAVE_SYS_TYPES_H 1
| #define HAVE_SYS_STAT_H 1
| #define HAVE_STDLIB_H 1
| #define HAVE_STRING_H 1
| #define HAVE_MEMORY_H 1
| #define HAVE_STRINGS_H 1
| #define HAVE_INTTYPES_H 1
| #define HAVE_STDINT_H 1
| #define HAVE_UNISTD_H 1
| #define __EXTENSIONS__ 1
| #define _ALL_SOURCE 1
| #define _GNU_SOURCE 1
| #define _POSIX_PTHREAD_SEMANTICS 1
| #define _TANDEM_SOURCE 1
| /* end confdefs.h. */
|
| int
| main ()
| {
|
| ;
| return 0;
| }
configure:7005: result: no
configure:6905: checking whether -Werror=implicit-function-declaration is accepted as CFLAGS
configure:6928: gcc -c -g -O2 -Werror=implicit-function-declaration conftest.c >&5
configure:6928: $? = 0
configure:6942: result: yes
configure:7030: checking whether -Wall -Wextra is accepted as CFLAGS
configure:7053: gcc -c -g -O2 -Wall -Wextra conftest.c >&5
configure:7053: $? = 0
configure:7055: result: yes
configure:7078: checking whether -ggdb3 is accepted as CFLAGS
configure:7101: gcc -c -g -O2 -Wall -Wextra -Wno-unused-parameter -Wno-parentheses -Wno-long-long -Wno-missing-field-initializers -Wunused-variable -Werror=pointer-arith -Werror=write-strings -Werror=declaration-after-statement -Werror=implicit-function-declaration -ggdb3 conftest.c >&5
configure:7101: $? = 0
configure:7103: result: yes
configure:7209: checking whether -D_FORTIFY_SOURCE=2 is accepted as CFLAGS
configure:7232: gcc -c -g -O2 -Wall -Wextra -Wno-unused-parameter -Wno-parentheses -Wno-long-long -Wno-missing-field-initializers -Wunused-variable -Werror=pointer-arith -Werror=write-strings -Werror=declaration-after-statement -Werror=implicit-function-declaration -D_FORTIFY_SOURCE=2 conftest.c >&5
configure:7232: $? = 0
configure:7242: result: yes
configure:7269: checking whether -fstack-protector is accepted as CFLAGS
configure:7292: gcc -c -g -O2 -Wall -Wextra -Wno-unused-parameter -Wno-parentheses -Wno-long-long -Wno-missing-field-initializers -Wunused-variable -Werror=pointer-arith -Werror=write-strings -Werror=declaration-after-statement -Werror=implicit-function-declaration -fstack-protector conftest.c >&5
configure:7292: $? = 0
configure:7294: result: yes
configure:7315: checking whether -fstack-protector is accepted as LDFLAGS
configure:7337: gcc -o conftest -g -O2 -Wall -Wextra -Wno-unused-parameter -Wno-parentheses -Wno-long-long -Wno-missing-field-initializers -Wunused-variable -Werror=pointer-arith -Werror=write-strings -Werror=declaration-after-statement -Werror=implicit-function-declaration -fstack-protector conftest.c >&5
configure:7337: $? = 0
configure:7339: result: yes
configure:7415: checking whether -ansi -std=iso9899:199409 is accepted as CFLAGS
configure:7438: gcc -c -g -O2 -Wall -Wextra -Wno-unused-parameter -Wno-parentheses -Wno-long-long -Wno-missing-field-initializers -Wunused-variable -Werror=pointer-arith -Werror=write-strings -Werror=declaration-after-statement -Werror=implicit-function-declaration -ansi -std=iso9899:199409 conftest.c >&5
configure:7438: $? = 0
configure:7459: result: yes
configure:7481: checking whether -fno-strict-overflow is accepted as CFLAGS
configure:7504: gcc -c -g -O2 -Wall -Wextra -Wno-unused-parameter -Wno-parentheses -Wno-long-long -Wno-missing-field-initializers -Wunused-variable -Werror=pointer-arith -Werror=write-strings -Werror=declaration-after-statement -Werror=implicit-function-declaration -fno-strict-overflow conftest.c >&5
configure:7504: $? = 0
configure:7514: result: yes
configure:7558: gcc -c -g -O2 conftest.c >&5
configure:7558: $? = 0
configure:7566: checking whether -fvisibility=hidden is accepted as CFLAGS
configure:7589: gcc -c -g -O2 -Wall -Wextra -Wno-unused-parameter -Wno-parentheses -Wno-long-long -Wno-missing-field-initializers -Wunused-variable -Werror=pointer-arith -Werror=write-strings -Werror=declaration-after-statement -Werror=implicit-function-declaration -fvisibility=hidden conftest.c >&5
configure:7589: $? = 0
configure:7591: result: yes
configure:7730: checking whether -fno-fast-math is accepted as CFLAGS
configure:7753: gcc -c -g -O2 -Wall -Wextra -Wno-unused-parameter -Wno-parentheses -Wno-long-long -Wno-missing-field-initializers -Wunused-variable -Werror=pointer-arith -Werror=write-strings -Werror=declaration-after-statement -Werror=implicit-function-declaration -fno-fast-math conftest.c >&5
configure:7753: $? = 0
configure:7763: result: yes
configure:7795: checking for special C compiler options needed for large files
configure:7840: result: no
configure:7846: checking for _FILE_OFFSET_BITS value needed for large files
configure:7871: gcc -c -O3 -fno-fast-math -ggdb3 -ansi -std=iso9899:199409 conftest.c >&5
configure:7871: $? = 0
configure:7903: result: no
configure:7999: checking whether byte ordering is bigendian
configure:8014: gcc -c -O3 -fno-fast-math -ggdb3 -ansi -std=iso9899:199409 conftest.c >&5
conftest.c:28:9: error: unknown type name 'not'
conftest.c:28:15: error: expected '=', ',', ';', 'asm' or '__attribute__' before 'universal'
conftest.c:28:15: error: unknown type name 'universal'
configure:8014: $? = 1
configure: failed program was:
| /* confdefs.h */
| #define PACKAGE_NAME ""
| #define PACKAGE_TARNAME ""
| #define PACKAGE_VERSION ""
| #define PACKAGE_STRING ""
| #define PACKAGE_BUGREPORT ""
| #define PACKAGE_URL ""
| #define CANONICALIZATION_FOR_MATHN 1
| #define RUBY_BASE_NAME "ruby" !<verconf>!
| #define RUBY_VERSION_NAME RUBY_BASE_NAME"-"RUBY_LIB_VERSION !<verconf>!
| #define STDC_HEADERS 1
| #define HAVE_SYS_TYPES_H 1
| #define HAVE_SYS_STAT_H 1
| #define HAVE_STDLIB_H 1
| #define HAVE_STRING_H 1
| #define HAVE_MEMORY_H 1
| #define HAVE_STRINGS_H 1
| #define HAVE_INTTYPES_H 1
| #define HAVE_STDINT_H 1
| #define HAVE_UNISTD_H 1
| #define __EXTENSIONS__ 1
| #define _ALL_SOURCE 1
| #define _GNU_SOURCE 1
| #define _POSIX_PTHREAD_SEMANTICS 1
| #define _TANDEM_SOURCE 1
| /* end confdefs.h. */
| #ifndef __APPLE_CC__
| not a universal capable compiler
| #endif
| typedef int dummy;
|
configure:8059: gcc -c -O3 -fno-fast-math -ggdb3 -ansi -std=iso9899:199409 conftest.c >&5
conftest.c: In function 'main':
conftest.c:34:8: error: unknown type name 'bogus'
conftest.c:34:21: error: expected '=', ',', ';', 'asm' or '__attribute__' before 'macros'
configure:8059: $? = 1
configure: failed program was:
| /* confdefs.h */
| #define PACKAGE_NAME ""
| #define PACKAGE_TARNAME ""
| #define PACKAGE_VERSION ""
| #define PACKAGE_STRING ""
| #define PACKAGE_BUGREPORT ""
| #define PACKAGE_URL ""
| #define CANONICALIZATION_FOR_MATHN 1
| #define RUBY_BASE_NAME "ruby" !<verconf>!
| #define RUBY_VERSION_NAME RUBY_BASE_NAME"-"RUBY_LIB_VERSION !<verconf>!
| #define STDC_HEADERS 1
| #define HAVE_SYS_TYPES_H 1
| #define HAVE_SYS_STAT_H 1
| #define HAVE_STDLIB_H 1
| #define HAVE_STRING_H 1
| #define HAVE_MEMORY_H 1
| #define HAVE_STRINGS_H 1
| #define HAVE_INTTYPES_H 1
| #define HAVE_STDINT_H 1
| #define HAVE_UNISTD_H 1
| #define __EXTENSIONS__ 1
| #define _ALL_SOURCE 1
| #define _GNU_SOURCE 1
| #define _POSIX_PTHREAD_SEMANTICS 1
| #define _TANDEM_SOURCE 1
| /* end confdefs.h. */
| #include <sys/types.h>
| #include <sys/param.h>
|
| int
| main ()
| {
| #if ! (defined BYTE_ORDER && defined BIG_ENDIAN && defined LITTLE_ENDIAN && BYTE_ORDER && BIG_ENDIAN && LITTLE_ENDIAN)
| bogus endian macros
| #endif
|
| ;
| return 0;
| }
configure:8103: gcc -c -O3 -fno-fast-math -ggdb3 -ansi -std=iso9899:199409 conftest.c >&5
configure:8103: $? = 0
configure:8120: gcc -c -O3 -fno-fast-math -ggdb3 -ansi -std=iso9899:199409 conftest.c >&5
conftest.c: In function 'main':
conftest.c:33:4: error: unknown type name 'not'
conftest.c:33:12: error: expected '=', ',', ';', 'asm' or '__attribute__' before 'endian'
configure:8120: $? = 1
configure: failed program was:
| /* confdefs.h */
| #define PACKAGE_NAME ""
| #define PACKAGE_TARNAME ""
| #define PACKAGE_VERSION ""
| #define PACKAGE_STRING ""
| #define PACKAGE_BUGREPORT ""
| #define PACKAGE_URL ""
| #define CANONICALIZATION_FOR_MATHN 1
| #define RUBY_BASE_NAME "ruby" !<verconf>!
| #define RUBY_VERSION_NAME RUBY_BASE_NAME"-"RUBY_LIB_VERSION !<verconf>!
| #define STDC_HEADERS 1
| #define HAVE_SYS_TYPES_H 1
| #define HAVE_SYS_STAT_H 1
| #define HAVE_STDLIB_H 1
| #define HAVE_STRING_H 1
| #define HAVE_MEMORY_H 1
| #define HAVE_STRINGS_H 1
| #define HAVE_INTTYPES_H 1
| #define HAVE_STDINT_H 1
| #define HAVE_UNISTD_H 1
| #define __EXTENSIONS__ 1
| #define _ALL_SOURCE 1
| #define _GNU_SOURCE 1
| #define _POSIX_PTHREAD_SEMANTICS 1
| #define _TANDEM_SOURCE 1
| /* end confdefs.h. */
| #include <limits.h>
|
| int
| main ()
| {
| #ifndef _BIG_ENDIAN
| not big endian
| #endif
|
| ;
| return 0;
| }
configure:8205: result: no
configure:8223: checking for an ANSI C-conforming const
configure:8289: gcc -c -O3 -fno-fast-math -ggdb3 -ansi -std=iso9899:199409 conftest.c >&5
configure:8289: $? = 0
configure:8296: result: yes
configure:8304: checking whether char is unsigned
configure:8323: gcc -c -O3 -fno-fast-math -ggdb3 -ansi -std=iso9899:199409 conftest.c >&5
configure:8323: $? = 0
configure:8330: result: no
configure:8337: checking for inline
configure:8353: gcc -c -O3 -fno-fast-math -ggdb3 -ansi -std=iso9899:199409 conftest.c >&5
conftest.c:29:1: error: unknown type name 'inline'
conftest.c:29:21: error: expected '=', ',', ';', 'asm' or '__attribute__' before 'static_foo'
conftest.c:30:1: error: unknown type name 'inline'
conftest.c:30:14: error: expected '=', ',', ';', 'asm' or '__attribute__' before 'foo'
configure:8353: $? = 1
configure: failed program was:
| /* confdefs.h */
| #define PACKAGE_NAME ""
| #define PACKAGE_TARNAME ""
| #define PACKAGE_VERSION ""
| #define PACKAGE_STRING ""
| #define PACKAGE_BUGREPORT ""
| #define PACKAGE_URL ""
| #define CANONICALIZATION_FOR_MATHN 1
| #define RUBY_BASE_NAME "ruby" !<verconf>!
| #define RUBY_VERSION_NAME RUBY_BASE_NAME"-"RUBY_LIB_VERSION !<verconf>!
| #define STDC_HEADERS 1
| #define HAVE_SYS_TYPES_H 1
| #define HAVE_SYS_STAT_H 1
| #define HAVE_STDLIB_H 1
| #define HAVE_STRING_H 1
| #define HAVE_MEMORY_H 1
| #define HAVE_STRINGS_H 1
| #define HAVE_INTTYPES_H 1
| #define HAVE_STDINT_H 1
| #define HAVE_UNISTD_H 1
| #define __EXTENSIONS__ 1
| #define _ALL_SOURCE 1
| #define _GNU_SOURCE 1
| #define _POSIX_PTHREAD_SEMANTICS 1
| #define _TANDEM_SOURCE 1
| /* end confdefs.h. */
| #ifndef __cplusplus
| typedef int foo_t;
| static inline foo_t static_foo () {return 0; }
| inline foo_t foo () {return 0; }
| #endif
|
configure:8353: gcc -c -O3 -fno-fast-math -ggdb3 -ansi -std=iso9899:199409 conftest.c >&5
configure:8353: $? = 0
configure:8361: result: __inline__
configure:8379: checking for working volatile
configure:8398: gcc -c -O3 -fno-fast-math -ggdb3 -ansi -std=iso9899:199409 conftest.c >&5
configure:8398: $? = 0
configure:8405: result: yes
configure:8421: checking for long long
configure:8421: gcc -c -O3 -fno-fast-math -ggdb3 -ansi -std=iso9899:199409 conftest.c >&5
configure:8421: $? = 0
configure:8421: gcc -c -O3 -fno-fast-math -ggdb3 -ansi -std=iso9899:199409 conftest.c >&5
conftest.c: In function 'main':
conftest.c:66:24: error: expected expression before ')' token
configure:8421: $? = 1
configure: failed program was:
| /* confdefs.h */
| #define PACKAGE_NAME ""
| #define PACKAGE_TARNAME ""
| #define PACKAGE_VERSION ""
| #define PACKAGE_STRING ""
| #define PACKAGE_BUGREPORT ""
| #define PACKAGE_URL ""
| #define CANONICALIZATION_FOR_MATHN 1
| #define RUBY_BASE_NAME "ruby" !<verconf>!
| #define RUBY_VERSION_NAME RUBY_BASE_NAME"-"RUBY_LIB_VERSION !<verconf>!
| #define STDC_HEADERS 1
| #define HAVE_SYS_TYPES_H 1
| #define HAVE_SYS_STAT_H 1
| #define HAVE_STDLIB_H 1
| #define HAVE_STRING_H 1
| #define HAVE_MEMORY_H 1
| #define HAVE_STRINGS_H 1
| #define HAVE_INTTYPES_H 1
| #define HAVE_STDINT_H 1
| #define HAVE_UNISTD_H 1
| #define __EXTENSIONS__ 1
| #define _ALL_SOURCE 1
| #define _GNU_SOURCE 1
| #define _POSIX_PTHREAD_SEMANTICS 1
| #define _TANDEM_SOURCE 1
| #ifndef __cplusplus
| #define inline __inline__
| #endif
| /* end confdefs.h. */
| #include <stdio.h>
| #ifdef HAVE_SYS_TYPES_H
| # include <sys/types.h>
| #endif
| #ifdef HAVE_SYS_STAT_H
| # include <sys/stat.h>
| #endif
| #ifdef STDC_HEADERS
| # include <stdlib.h>
| # include <stddef.h>
| #else
| # ifdef HAVE_STDLIB_H
| # include <stdlib.h>
| # endif
| #endif
| #ifdef HAVE_STRING_H
| # if !defined STDC_HEADERS && defined HAVE_MEMORY_H
| # include <memory.h>
| # endif
| # include <string.h>
| #endif
| #ifdef HAVE_STRINGS_H
| # include <strings.h>
| #endif
| #ifdef HAVE_INTTYPES_H
| # include <inttypes.h>
| #endif
| #ifdef HAVE_STDINT_H
| # include <stdint.h>
| #endif
| #ifdef HAVE_UNISTD_H
| # include <unistd.h>
| #endif
| int
| main ()
| {
| if (sizeof ((long long)))
| return 0;
| ;
| return 0;
| }
configure:8421: result: yes
configure:8430: checking for off_t
configure:8430: gcc -c -O3 -fno-fast-math -ggdb3 -ansi -std=iso9899:199409 conftest.c >&5
configure:8430: $? = 0
configure:8430: gcc -c -O3 -fno-fast-math -ggdb3 -ansi -std=iso9899:199409 conftest.c >&5
conftest.c: In function 'main':
conftest.c:67:20: error: expected expression before ')' token
configure:8430: $? = 1
configure: failed program was:
| /* confdefs.h */
| #define PACKAGE_NAME ""
| #define PACKAGE_TARNAME ""
| #define PACKAGE_VERSION ""
| #define PACKAGE_STRING ""
| #define PACKAGE_BUGREPORT ""
| #define PACKAGE_URL ""
| #define CANONICALIZATION_FOR_MATHN 1
| #define RUBY_BASE_NAME "ruby" !<verconf>!
| #define RUBY_VERSION_NAME RUBY_BASE_NAME"-"RUBY_LIB_VERSION !<verconf>!
| #define STDC_HEADERS 1
| #define HAVE_SYS_TYPES_H 1
| #define HAVE_SYS_STAT_H 1
| #define HAVE_STDLIB_H 1
| #define HAVE_STRING_H 1
| #define HAVE_MEMORY_H 1
| #define HAVE_STRINGS_H 1
| #define HAVE_INTTYPES_H 1
| #define HAVE_STDINT_H 1
| #define HAVE_UNISTD_H 1
| #define __EXTENSIONS__ 1
| #define _ALL_SOURCE 1
| #define _GNU_SOURCE 1
| #define _POSIX_PTHREAD_SEMANTICS 1
| #define _TANDEM_SOURCE 1
| #ifndef __cplusplus
| #define inline __inline__
| #endif
| #define HAVE_LONG_LONG 1
| /* end confdefs.h. */
| #include <stdio.h>
| #ifdef HAVE_SYS_TYPES_H
| # include <sys/types.h>
| #endif
| #ifdef HAVE_SYS_STAT_H
| # include <sys/stat.h>
| #endif
| #ifdef STDC_HEADERS
| # include <stdlib.h>
| # include <stddef.h>
| #else
| # ifdef HAVE_STDLIB_H
| # include <stdlib.h>
| # endif
| #endif
| #ifdef HAVE_STRING_H
| # if !defined STDC_HEADERS && defined HAVE_MEMORY_H
| # include <memory.h>
| # endif
| # include <string.h>
| #endif
| #ifdef HAVE_STRINGS_H
| # include <strings.h>
| #endif
| #ifdef HAVE_INTTYPES_H
| # include <inttypes.h>
| #endif
| #ifdef HAVE_STDINT_H
| # include <stdint.h>
| #endif
| #ifdef HAVE_UNISTD_H
| # include <unistd.h>
| #endif
| int
| main ()
| {
| if (sizeof ((off_t)))
| return 0;
| ;
| return 0;
| }
configure:8430: result: yes
configure:8441: checking char bit
configure:8447: gcc -o conftest -O3 -fno-fast-math -ggdb3 -ansi -std=iso9899:199409 -fstack-protector conftest.c >&5
ld: fatal: relocation error: R_AMD64_32: file /var/tmp//ccXYaWgC.o: section [53].rela.debug_macro: symbol .debug_macro (section): symbol has been discarded with discarded section: [56].debug_macro
ld: fatal: relocation error: R_AMD64_32: file /var/tmp//ccXYaWgC.o: section [53].rela.debug_macro: symbol .debug_macro (section): symbol has been discarded with discarded section: [58].debug_macro
ld: fatal: relocation error: R_AMD64_32: file /var/tmp//ccXYaWgC.o: section [53].rela.debug_macro: symbol .debug_macro (section): symbol has been discarded with discarded section: [60].debug_macro
ld: fatal: relocation error: R_AMD64_32: file /var/tmp//ccXYaWgC.o: section [53].rela.debug_macro: symbol .debug_macro (section): symbol has been discarded with discarded section: [62].debug_macro
ld: fatal: relocation error: R_AMD64_32: file /var/tmp//ccXYaWgC.o: section [53].rela.debug_macro: symbol .debug_macro (section): symbol has been discarded with discarded section: [64].debug_macro
ld: fatal: relocation error: R_AMD64_32: file /var/tmp//ccXYaWgC.o: section [53].rela.debug_macro: symbol .debug_macro (section): symbol has been discarded with discarded section: [66].debug_macro
ld: fatal: relocation error: R_AMD64_32: file /var/tmp//ccXYaWgC.o: section [53].rela.debug_macro: symbol .debug_macro (section): symbol has been discarded with discarded section: [68].debug_macro
ld: fatal: relocation error: R_AMD64_32: file /var/tmp//ccXYaWgC.o: section [53].rela.debug_macro: symbol .debug_macro (section): symbol has been discarded with discarded section: [70].debug_macro
ld: fatal: relocation error: R_AMD64_32: file /var/tmp//ccXYaWgC.o: section [53].rela.debug_macro: symbol .debug_macro (section): symbol has been discarded with discarded section: [72].debug_macro
ld: fatal: relocation error: R_AMD64_32: file /var/tmp//ccXYaWgC.o: section [53].rela.debug_macro: symbol .debug_macro (section): symbol has been discarded with discarded section: [74].debug_macro
ld: fatal: relocation error: R_AMD64_32: file /var/tmp//ccXYaWgC.o: section [53].rela.debug_macro: symbol .debug_macro (section): symbol has been discarded with discarded section: [76].debug_macro
ld: fatal: relocation error: R_AMD64_32: file /var/tmp//ccXYaWgC.o: section [53].rela.debug_macro: symbol .debug_macro (section): symbol has been discarded with discarded section: [78].debug_macro
ld: fatal: relocation error: R_AMD64_32: file /var/tmp//ccXYaWgC.o: section [53].rela.debug_macro: symbol .debug_macro (section): symbol has been discarded with discarded section: [80].debug_macro
ld: fatal: relocation error: R_AMD64_32: file /var/tmp//ccXYaWgC.o: section [53].rela.debug_macro: symbol .debug_macro (section): symbol has been discarded with discarded section: [82].debug_macro
ld: fatal: relocation error: R_AMD64_32: file /var/tmp//ccXYaWgC.o: section [53].rela.debug_macro: symbol .debug_macro (section): symbol has been discarded with discarded section: [84].debug_macro
ld: fatal: relocation error: R_AMD64_32: file /var/tmp//ccXYaWgC.o: section [53].rela.debug_macro: symbol .debug_macro (section): symbol has been discarded with discarded section: [86].debug_macro
ld: fatal: relocation error: R_AMD64_32: file /var/tmp//ccXYaWgC.o: section [53].rela.debug_macro: symbol .debug_macro (section): symbol has been discarded with discarded section: [88].debug_macro
ld: fatal: relocation error: R_AMD64_32: file /var/tmp//ccXYaWgC.o: section [53].rela.debug_macro: symbol .debug_macro (section): symbol has been discarded with discarded section: [90].debug_macro
ld: fatal: relocation error: R_AMD64_32: file /var/tmp//ccXYaWgC.o: section [53].rela.debug_macro: symbol .debug_macro (section): symbol has been discarded with discarded section: [92].debug_macro
ld: fatal: relocation error: R_AMD64_32: file /var/tmp//ccXYaWgC.o: section [53].rela.debug_macro: symbol .debug_macro (section): symbol has been discarded with discarded section: [94].debug_macro
ld: fatal: relocation error: R_AMD64_32: file /var/tmp//ccXYaWgC.o: section [53].rela.debug_macro: symbol .debug_macro (section): symbol has been discarded with discarded section: [96].debug_macro
ld: fatal: relocation error: R_AMD64_32: file /var/tmp//ccXYaWgC.o: section [53].rela.debug_macro: symbol .debug_macro (section): symbol has been discarded with discarded section: [98].debug_macro
ld: fatal: relocation error: R_AMD64_32: file /var/tmp//ccXYaWgC.o: section [53].rela.debug_macro: symbol .debug_macro (section): symbol has been discarded with discarded section: [100].debug_macro
ld: fatal: relocation error: R_AMD64_32: file /var/tmp//ccXYaWgC.o: section [53].rela.debug_macro: symbol .debug_macro (section): symbol has been discarded with discarded section: [102].debug_macro
ld: fatal: relocation error: R_AMD64_32: file /var/tmp//ccXYaWgC.o: section [53].rela.debug_macro: symbol .debug_macro (section): symbol has been discarded with discarded section: [104].debug_macro
ld: fatal: relocation error: R_AMD64_32: file /var/tmp//ccXYaWgC.o: section [53].rela.debug_macro: symbol .debug_macro (section): symbol has been discarded with discarded section: [106].debug_macro
ld: fatal: relocation error: R_AMD64_32: file /var/tmp//ccXYaWgC.o: section [53].rela.debug_macro: symbol .debug_macro (section): symbol has been discarded with discarded section: [108].debug_macro
ld: fatal: relocation error: R_AMD64_32: file /var/tmp//ccXYaWgC.o: section [53].rela.debug_macro: symbol .debug_macro (section): symbol has been discarded with discarded section: [110].debug_macro
ld: fatal: relocation error: R_AMD64_32: file /var/tmp//ccXYaWgC.o: section [53].rela.debug_macro: symbol .debug_macro (section): symbol has been discarded with discarded section: [112].debug_macro
ld: fatal: relocation error: R_AMD64_32: file /var/tmp//ccXYaWgC.o: section [53].rela.debug_macro: symbol .debug_macro (section): symbol has been discarded with discarded section: [114].debug_macro
ld: fatal: relocation error: R_AMD64_32: file /var/tmp//ccXYaWgC.o: section [53].rela.debug_macro: symbol .debug_macro (section): symbol has been discarded with discarded section: [116].debug_macro
collect2: error: ld returned 1 exit status
configure:8447: $? = 1
configure: program exited with status 1
configure: failed program was:
| /* confdefs.h */
| #define PACKAGE_NAME ""
| #define PACKAGE_TARNAME ""
| #define PACKAGE_VERSION ""
| #define PACKAGE_STRING ""
| #define PACKAGE_BUGREPORT ""
| #define PACKAGE_URL ""
| #define CANONICALIZATION_FOR_MATHN 1
| #define RUBY_BASE_NAME "ruby" !<verconf>!
| #define RUBY_VERSION_NAME RUBY_BASE_NAME"-"RUBY_LIB_VERSION !<verconf>!
| #define STDC_HEADERS 1
| #define HAVE_SYS_TYPES_H 1
| #define HAVE_SYS_STAT_H 1
| #define HAVE_STDLIB_H 1
| #define HAVE_STRING_H 1
| #define HAVE_MEMORY_H 1
| #define HAVE_STRINGS_H 1
| #define HAVE_INTTYPES_H 1
| #define HAVE_STDINT_H 1
| #define HAVE_UNISTD_H 1
| #define __EXTENSIONS__ 1
| #define _ALL_SOURCE 1
| #define _GNU_SOURCE 1
| #define _POSIX_PTHREAD_SEMANTICS 1
| #define _TANDEM_SOURCE 1
| #ifndef __cplusplus
| #define inline __inline__
| #endif
| #define HAVE_LONG_LONG 1
| #define HAVE_OFF_T 1
| /* end confdefs.h. */
| #include <limits.h>
|
| static long int longval () { return CHAR_BIT; }
| static unsigned long int ulongval () { return CHAR_BIT; }
| #include <stdio.h>
| #include <stdlib.h>
| int
| main ()
| {
|
| FILE *f = fopen ("conftest.val", "w");
| if (! f)
| return 1;
| if ((CHAR_BIT) < 0)
| {
| long int i = longval ();
| if (i != (CHAR_BIT))
| return 1;
| fprintf (f, "%ld", i);
| }
| else
| {
| unsigned long int i = ulongval ();
| if (i != (CHAR_BIT))
| return 1;
| fprintf (f, "%lu", i);
| }
| /* Do not output a trailing newline, as this causes \r\n confusion
| on some platforms. */
| return ferror (f) || fclose (f) != 0;
|
| ;
| return 0;
| }
configure:8456: result: 8
configure:8579: checking size of int
configure:8584: gcc -o conftest -O3 -fno-fast-math -ggdb3 -ansi -std=iso9899:199409 -fstack-protector conftest.c >&5
ld: fatal: relocation error: R_AMD64_32: file /var/tmp//cc51awhC.o: section [55].rela.debug_macro: symbol .debug_macro (section): symbol has been discarded with discarded section: [58].debug_macro
ld: fatal: relocation error: R_AMD64_32: file /var/tmp//cc51awhC.o: section [55].rela.debug_macro: symbol .debug_macro (section): symbol has been discarded with discarded section: [60].debug_macro
ld: fatal: relocation error: R_AMD64_32: file /var/tmp//cc51awhC.o: section [55].rela.debug_macro: symbol .debug_macro (section): symbol has been discarded with discarded section: [62].debug_macro
ld: fatal: relocation error: R_AMD64_32: file /var/tmp//cc51awhC.o: section [55].rela.debug_macro: symbol .debug_macro (section): symbol has been discarded with discarded section: [64].debug_macro
ld: fatal: relocation error: R_AMD64_32: file /var/tmp//cc51awhC.o: section [55].rela.debug_macro: symbol .debug_macro (section): symbol has been discarded with discarded section: [66].debug_macro
ld: fatal: relocation error: R_AMD64_32: file /var/tmp//cc51awhC.o: section [55].rela.debug_macro: symbol .debug_macro (section): symbol has been discarded with discarded section: [68].debug_macro
ld: fatal: relocation error: R_AMD64_32: file /var/tmp//cc51awhC.o: section [55].rela.debug_macro: symbol .debug_macro (section): symbol has been discarded with discarded section: [70].debug_macro
ld: fatal: relocation error: R_AMD64_32: file /var/tmp//cc51awhC.o: section [55].rela.debug_macro: symbol .debug_macro (section): symbol has been discarded with discarded section: [72].debug_macro
ld: fatal: relocation error: R_AMD64_32: file /var/tmp//cc51awhC.o: section [55].rela.debug_macro: symbol .debug_macro (section): symbol has been discarded with discarded section: [74].debug_macro
ld: fatal: relocation error: R_AMD64_32: file /var/tmp//cc51awhC.o: section [55].rela.debug_macro: symbol .debug_macro (section): symbol has been discarded with discarded section: [76].debug_macro
ld: fatal: relocation error: R_AMD64_32: file /var/tmp//cc51awhC.o: section [55].rela.debug_macro: symbol .debug_macro (section): symbol has been discarded with discarded section: [78].debug_macro
ld: fatal: relocation error: R_AMD64_32: file /var/tmp//cc51awhC.o: section [55].rela.debug_macro: symbol .debug_macro (section): symbol has been discarded with discarded section: [80].debug_macro
ld: fatal: relocation error: R_AMD64_32: file /var/tmp//cc51awhC.o: section [55].rela.debug_macro: symbol .debug_macro (section): symbol has been discarded with discarded section: [82].debug_macro
ld: fatal: relocation error: R_AMD64_32: file /var/tmp//cc51awhC.o: section [55].rela.debug_macro: symbol .debug_macro (section): symbol has been discarded with discarded section: [84].debug_macro
ld: fatal: relocation error: R_AMD64_32: file /var/tmp//cc51awhC.o: section [55].rela.debug_macro: symbol .debug_macro (section): symbol has been discarded with discarded section: [86].debug_macro
ld: fatal: relocation error: R_AMD64_32: file /var/tmp//cc51awhC.o: section [55].rela.debug_macro: symbol .debug_macro (section): symbol has been discarded with discarded section: [88].debug_macro
ld: fatal: relocation error: R_AMD64_32: file /var/tmp//cc51awhC.o: section [55].rela.debug_macro: symbol .debug_macro (section): symbol has been discarded with discarded section: [90].debug_macro
ld: fatal: relocation error: R_AMD64_32: file /var/tmp//cc51awhC.o: section [55].rela.debug_macro: symbol .debug_macro (section): symbol has been discarded with discarded section: [92].debug_macro
ld: fatal: relocation error: R_AMD64_32: file /var/tmp//cc51awhC.o: section [55].rela.debug_macro: symbol .debug_macro (section): symbol has been discarded with discarded section: [94].debug_macro
ld: fatal: relocation error: R_AMD64_32: file /var/tmp//cc51awhC.o: section [55].rela.debug_macro: symbol .debug_macro (section): symbol has been discarded with discarded section: [96].debug_macro
ld: fatal: relocation error: R_AMD64_32: file /var/tmp//cc51awhC.o: section [55].rela.debug_macro: symbol .debug_macro (section): symbol has been discarded with discarded section: [98].debug_macro
ld: fatal: relocation error: R_AMD64_32: file /var/tmp//cc51awhC.o: section [55].rela.debug_macro: symbol .debug_macro (section): symbol has been discarded with discarded section: [100].debug_macro
ld: fatal: relocation error: R_AMD64_32: file /var/tmp//cc51awhC.o: section [55].rela.debug_macro: symbol .debug_macro (section): symbol has been discarded with discarded section: [102].debug_macro
ld: fatal: relocation error: R_AMD64_32: file /var/tmp//cc51awhC.o: section [55].rela.debug_macro: symbol .debug_macro (section): symbol has been discarded with discarded section: [104].debug_macro
ld: fatal: relocation error: R_AMD64_32: file /var/tmp//cc51awhC.o: section [55].rela.debug_macro: symbol .debug_macro (section): symbol has been discarded with discarded section: [106].debug_macro
ld: fatal: relocation error: R_AMD64_32: file /var/tmp//cc51awhC.o: section [55].rela.debug_macro: symbol .debug_macro (section): symbol has been discarded with discarded section: [108].debug_macro
ld: fatal: relocation error: R_AMD64_32: file /var/tmp//cc51awhC.o: section [55].rela.debug_macro: symbol .debug_macro (section): symbol has been discarded with discarded section: [110].debug_macro
ld: fatal: relocation error: R_AMD64_32: file /var/tmp//cc51awhC.o: section [55].rela.debug_macro: symbol .debug_macro (section): symbol has been discarded with discarded section: [112].debug_macro
ld: fatal: relocation error: R_AMD64_32: file /var/tmp//cc51awhC.o: section [55].rela.debug_macro: symbol .debug_macro (section): symbol has been discarded with discarded section: [114].debug_macro
ld: fatal: relocation error: R_AMD64_32: file /var/tmp//cc51awhC.o: section [55].rela.debug_macro: symbol .debug_macro (section): symbol has been discarded with discarded section: [116].debug_macro
ld: fatal: relocation error: R_AMD64_32: file /var/tmp//cc51awhC.o: section [55].rela.debug_macro: symbol .debug_macro (section): symbol has been discarded with discarded section: [118].debug_macro
ld: fatal: relocation error: R_AMD64_32: file /var/tmp//cc51awhC.o: section [55].rela.debug_macro: symbol .debug_macro (section): symbol has been discarded with discarded section: [120].debug_macro
ld: fatal: relocation error: R_AMD64_32: file /var/tmp//cc51awhC.o: section [55].rela.debug_macro: symbol .debug_macro (section): symbol has been discarded with discarded section: [122].debug_macro
collect2: error: ld returned 1 exit status
configure:8584: $? = 1
configure: program exited with status 1
configure: failed program was:
| /* confdefs.h */
| #define PACKAGE_NAME ""
| #define PACKAGE_TARNAME ""
| #define PACKAGE_VERSION ""
| #define PACKAGE_STRING ""
| #define PACKAGE_BUGREPORT ""
| #define PACKAGE_URL ""
| #define CANONICALIZATION_FOR_MATHN 1
| #define RUBY_BASE_NAME "ruby" !<verconf>!
| #define RUBY_VERSION_NAME RUBY_BASE_NAME"-"RUBY_LIB_VERSION !<verconf>!
| #define STDC_HEADERS 1
| #define HAVE_SYS_TYPES_H 1
| #define HAVE_SYS_STAT_H 1
| #define HAVE_STDLIB_H 1
| #define HAVE_STRING_H 1
| #define HAVE_MEMORY_H 1
| #define HAVE_STRINGS_H 1
| #define HAVE_INTTYPES_H 1
| #define HAVE_STDINT_H 1
| #define HAVE_UNISTD_H 1
| #define __EXTENSIONS__ 1
| #define _ALL_SOURCE 1
| #define _GNU_SOURCE 1
| #define _POSIX_PTHREAD_SEMANTICS 1
| #define _TANDEM_SOURCE 1
| #ifndef __cplusplus
| #define inline __inline__
| #endif
| #define HAVE_LONG_LONG 1
| #define HAVE_OFF_T 1
| /* end confdefs.h. */
| #include <stdio.h>
| #ifdef HAVE_SYS_TYPES_H
| # include <sys/types.h>
| #endif
| #ifdef HAVE_SYS_STAT_H
| # include <sys/stat.h>
| #endif
| #ifdef STDC_HEADERS
| # include <stdlib.h>
| # include <stddef.h>
| #else
| # ifdef HAVE_STDLIB_H
| # include <stdlib.h>
| # endif
| #endif
| #ifdef HAVE_STRING_H
| # if !defined STDC_HEADERS && defined HAVE_MEMORY_H
| # include <memory.h>
| # endif
| # include <string.h>
| #endif
| #ifdef HAVE_STRINGS_H
| # include <strings.h>
| #endif
| #ifdef HAVE_INTTYPES_H
| # include <inttypes.h>
| #endif
| #ifdef HAVE_STDINT_H
| # include <stdint.h>
| #endif
| #ifdef HAVE_UNISTD_H
| # include <unistd.h>
| #endif
| static long int longval () { return (long int) (sizeof (int)); }
| static unsigned long int ulongval () { return (long int) (sizeof (int)); }
| #include <stdio.h>
| #include <stdlib.h>
| int
| main ()
| {
|
| FILE *f = fopen ("conftest.val", "w");
| if (! f)
| return 1;
| if (((long int) (sizeof (int))) < 0)
| {
| long int i = longval ();
| if (i != ((long int) (sizeof (int))))
| return 1;
| fprintf (f, "%ld", i);
| }
| else
| {
| unsigned long int i = ulongval ();
| if (i != ((long int) (sizeof (int))))
| return 1;
| fprintf (f, "%lu", i);
| }
| /* Do not output a trailing newline, as this causes \r\n confusion
| on some platforms. */
| return ferror (f) || fclose (f) != 0;
|
| ;
| return 0;
| }
configure:8598: result: 0
configure:8677: checking size of short
configure:8682: gcc -o conftest -O3 -fno-fast-math -ggdb3 -ansi -std=iso9899:199409 -fstack-protector conftest.c >&5
ld: fatal: relocation error: R_AMD64_32: file /var/tmp//cc84a.hC.o: section [55].rela.debug_macro: symbol .debug_macro (section): symbol has been discarded with discarded section: [58].debug_macro
ld: fatal: relocation error: R_AMD64_32: file /var/tmp//cc84a.hC.o: section [55].rela.debug_macro: symbol .debug_macro (section): symbol has been discarded with discarded section: [60].debug_macro
ld: fatal: relocation error: R_AMD64_32: file /var/tmp//cc84a.hC.o: section [55].rela.debug_macro: symbol .debug_macro (section): symbol has been discarded with discarded section: [62].debug_macro
ld: fatal: relocation error: R_AMD64_32: file /var/tmp//cc84a.hC.o: section [55].rela.debug_macro: symbol .debug_macro (section): symbol has been discarded with discarded section: [64].debug_macro
ld: fatal: relocation error: R_AMD64_32: file /var/tmp//cc84a.hC.o: section [55].rela.debug_macro: symbol .debug_macro (section): symbol has been discarded with discarded section: [66].debug_macro
ld: fatal: relocation error: R_AMD64_32: file /var/tmp//cc84a.hC.o: section [55].rela.debug_macro: symbol .debug_macro (section): symbol has been discarded with discarded section: [68].debug_macro
ld: fatal: relocation error: R_AMD64_32: file /var/tmp//cc84a.hC.o: section [55].rela.debug_macro: symbol .debug_macro (section): symbol has been discarded with discarded section: [70].debug_macro
ld: fatal: relocation error: R_AMD64_32: file /var/tmp//cc84a.hC.o: section [55].rela.debug_macro: symbol .debug_macro (section): symbol has been discarded with discarded section: [72].debug_macro
ld: fatal: relocation error: R_AMD64_32: file /var/tmp//cc84a.hC.o: section [55].rela.debug_macro: symbol .debug_macro (section): symbol has been discarded with discarded section: [74].debug_macro
ld: fatal: relocation error: R_AMD64_32: file /var/tmp//cc84a.hC.o: section [55].rela.debug_macro: symbol .debug_macro (section): symbol has been discarded with discarded section: [76].debug_macro
ld: fatal: relocation error: R_AMD64_32: file /var/tmp//cc84a.hC.o: section [55].rela.debug_macro: symbol .debug_macro (section): symbol has been discarded with discarded section: [78].debug_macro
ld: fatal: relocation error: R_AMD64_32: file /var/tmp//cc84a.hC.o: section [55].rela.debug_macro: symbol .debug_macro (section): symbol has been discarded with discarded section: [80].debug_macro
ld: fatal: relocation error: R_AMD64_32: file /var/tmp//cc84a.hC.o: section [55].rela.debug_macro: symbol .debug_macro (section): symbol has been discarded with discarded section: [82].debug_macro
ld: fatal: relocation error: R_AMD64_32: file /var/tmp//cc84a.hC.o: section [55].rela.debug_macro: symbol .debug_macro (section): symbol has been discarded with discarded section: [84].debug_macro
ld: fatal: relocation error: R_AMD64_32: file /var/tmp//cc84a.hC.o: section [55].rela.debug_macro: symbol .debug_macro (section): symbol has been discarded with discarded section: [86].debug_macro
ld: fatal: relocation error: R_AMD64_32: file /var/tmp//cc84a.hC.o: section [55].rela.debug_macro: symbol .debug_macro (section): symbol has been discarded with discarded section: [88].debug_macro
ld: fatal: relocation error: R_AMD64_32: file /var/tmp//cc84a.hC.o: section [55].rela.debug_macro: symbol .debug_macro (section): symbol has been discarded with discarded section: [90].debug_macro
ld: fatal: relocation error: R_AMD64_32: file /var/tmp//cc84a.hC.o: section [55].rela.debug_macro: symbol .debug_macro (section): symbol has been discarded with discarded section: [92].debug_macro
ld: fatal: relocation error: R_AMD64_32: file /var/tmp//cc84a.hC.o: section [55].rela.debug_macro: symbol .debug_macro (section): symbol has been discarded with discarded section: [94].debug_macro
ld: fatal: relocation error: R_AMD64_32: file /var/tmp//cc84a.hC.o: section [55].rela.debug_macro: symbol .debug_macro (section): symbol has been discarded with discarded section: [96].debug_macro
ld: fatal: relocation error: R_AMD64_32: file /var/tmp//cc84a.hC.o: section [55].rela.debug_macro: symbol .debug_macro (section): symbol has been discarded with discarded section: [98].debug_macro
ld: fatal: relocation error: R_AMD64_32: file /var/tmp//cc84a.hC.o: section [55].rela.debug_macro: symbol .debug_macro (section): symbol has been discarded with discarded section: [100].debug_macro
ld: fatal: relocation error: R_AMD64_32: file /var/tmp//cc84a.hC.o: section [55].rela.debug_macro: symbol .debug_macro (section): symbol has been discarded with discarded section: [102].debug_macro
ld: fatal: relocation error: R_AMD64_32: file /var/tmp//cc84a.hC.o: section [55].rela.debug_macro: symbol .debug_macro (section): symbol has been discarded with discarded section: [104].debug_macro
ld: fatal: relocation error: R_AMD64_32: file /var/tmp//cc84a.hC.o: section [55].rela.debug_macro: symbol .debug_macro (section): symbol has been discarded with discarded section: [106].debug_macro
ld: fatal: relocation error: R_AMD64_32: file /var/tmp//cc84a.hC.o: section [55].rela.debug_macro: symbol .debug_macro (section): symbol has been discarded with discarded section: [108].debug_macro
ld: fatal: relocation error: R_AMD64_32: file /var/tmp//cc84a.hC.o: section [55].rela.debug_macro: symbol .debug_macro (section): symbol has been discarded with discarded section: [110].debug_macro
ld: fatal: relocation error: R_AMD64_32: file /var/tmp//cc84a.hC.o: section [55].rela.debug_macro: symbol .debug_macro (section): symbol has been discarded with discarded section: [112].debug_macro
ld: fatal: relocation error: R_AMD64_32: file /var/tmp//cc84a.hC.o: section [55].rela.debug_macro: symbol .debug_macro (section): symbol has been discarded with discarded section: [114].debug_macro
ld: fatal: relocation error: R_AMD64_32: file /var/tmp//cc84a.hC.o: section [55].rela.debug_macro: symbol .debug_macro (section): symbol has been discarded with discarded section: [116].debug_macro
ld: fatal: relocation error: R_AMD64_32: file /var/tmp//cc84a.hC.o: section [55].rela.debug_macro: symbol .debug_macro (section): symbol has been discarded with discarded section: [118].debug_macro
ld: fatal: relocation error: R_AMD64_32: file /var/tmp//cc84a.hC.o: section [55].rela.debug_macro: symbol .debug_macro (section): symbol has been discarded with discarded section: [120].debug_macro
ld: fatal: relocation error: R_AMD64_32: file /var/tmp//cc84a.hC.o: section [55].rela.debug_macro: symbol .debug_macro (section): symbol has been discarded with discarded section: [122].debug_macro
collect2: error: ld returned 1 exit status
configure:8682: $? = 1
configure: program exited with status 1
configure: failed program was:
| /* confdefs.h */
| #define PACKAGE_NAME ""
| #define PACKAGE_TARNAME ""
| #define PACKAGE_VERSION ""
| #define PACKAGE_STRING ""
| #define PACKAGE_BUGREPORT ""
| #define PACKAGE_URL ""
| #define CANONICALIZATION_FOR_MATHN 1
| #define RUBY_BASE_NAME "ruby" !<verconf>!
| #define RUBY_VERSION_NAME RUBY_BASE_NAME"-"RUBY_LIB_VERSION !<verconf>!
| #define STDC_HEADERS 1
| #define HAVE_SYS_TYPES_H 1
| #define HAVE_SYS_STAT_H 1
| #define HAVE_STDLIB_H 1
| #define HAVE_STRING_H 1
| #define HAVE_MEMORY_H 1
| #define HAVE_STRINGS_H 1
| #define HAVE_INTTYPES_H 1
| #define HAVE_STDINT_H 1
| #define HAVE_UNISTD_H 1
| #define __EXTENSIONS__ 1
| #define _ALL_SOURCE 1
| #define _GNU_SOURCE 1
| #define _POSIX_PTHREAD_SEMANTICS 1
| #define _TANDEM_SOURCE 1
| #ifndef __cplusplus
| #define inline __inline__
| #endif
| #define HAVE_LONG_LONG 1
| #define HAVE_OFF_T 1
| #define SIZEOF_INT 0
| /* end confdefs.h. */
| #include <stdio.h>
| #ifdef HAVE_SYS_TYPES_H
| # include <sys/types.h>
| #endif
| #ifdef HAVE_SYS_STAT_H
| # include <sys/stat.h>
| #endif
| #ifdef STDC_HEADERS
| # include <stdlib.h>
| # include <stddef.h>
| #else
| # ifdef HAVE_STDLIB_H
| # include <stdlib.h>
| # endif
| #endif
| #ifdef HAVE_STRING_H
| # if !defined STDC_HEADERS && defined HAVE_MEMORY_H
| # include <memory.h>
| # endif
| # include <string.h>
| #endif
| #ifdef HAVE_STRINGS_H
| # include <strings.h>
| #endif
| #ifdef HAVE_INTTYPES_H
| # include <inttypes.h>
| #endif
| #ifdef HAVE_STDINT_H
| # include <stdint.h>
| #endif
| #ifdef HAVE_UNISTD_H
| # include <unistd.h>
| #endif
| static long int longval () { return (long int) (sizeof (short)); }
| static unsigned long int ulongval () { return (long int) (sizeof (short)); }
| #include <stdio.h>
| #include <stdlib.h>
| int
| main ()
| {
|
| FILE *f = fopen ("conftest.val", "w");
| if (! f)
| return 1;
| if (((long int) (sizeof (short))) < 0)
| {
| long int i = longval ();
| if (i != ((long int) (sizeof (short))))
| return 1;
| fprintf (f, "%ld", i);
| }
| else
| {
| unsigned long int i = ulongval ();
| if (i != ((long int) (sizeof (short))))
| return 1;
| fprintf (f, "%lu", i);
| }
| /* Do not output a trailing newline, as this causes \r\n confusion
| on some platforms. */
| return ferror (f) || fclose (f) != 0;
|
| ;
| return 0;
| }
configure:8696: result: 0
configure:8851: checking size of long
configure:8856: gcc -o conftest -O3 -fno-fast-math -ggdb3 -ansi -std=iso9899:199409 -fstack-protector conftest.c >&5
ld: fatal: relocation error: R_AMD64_32: file /var/tmp//cc.7aMiC.o: section [55].rela.debug_macro: symbol .debug_macro (section): symbol has been discarded with discarded section: [58].debug_macro
ld: fatal: relocation error: R_AMD64_32: file /var/tmp//cc.7aMiC.o: section [55].rela.debug_macro: symbol .debug_macro (section): symbol has been discarded with discarded section: [60].debug_macro
ld: fatal: relocation error: R_AMD64_32: file /var/tmp//cc.7aMiC.o: section [55].rela.debug_macro: symbol .debug_macro (section): symbol has been discarded with discarded section: [62].debug_macro
ld: fatal: relocation error: R_AMD64_32: file /var/tmp//cc.7aMiC.o: section [55].rela.debug_macro: symbol .debug_macro (section): symbol has been discarded with discarded section: [64].debug_macro
ld: fatal: relocation error: R_AMD64_32: file /var/tmp//cc.7aMiC.o: section [55].rela.debug_macro: symbol .debug_macro (section): symbol has been discarded with discarded section: [66].debug_macro
ld: fatal: relocation error: R_AMD64_32: file /var/tmp//cc.7aMiC.o: section [55].rela.debug_macro: symbol .debug_macro (section): symbol has been discarded with discarded section: [68].debug_macro
ld: fatal: relocation error: R_AMD64_32: file /var/tmp//cc.7aMiC.o: section [55].rela.debug_macro: symbol .debug_macro (section): symbol has been discarded with discarded section: [70].debug_macro
ld: fatal: relocation error: R_AMD64_32: file /var/tmp//cc.7aMiC.o: section [55].rela.debug_macro: symbol .debug_macro (section): symbol has been discarded with discarded section: [72].debug_macro
ld: fatal: relocation error: R_AMD64_32: file /var/tmp//cc.7aMiC.o: section [55].rela.debug_macro: symbol .debug_macro (section): symbol has been discarded with discarded section: [74].debug_macro
ld: fatal: relocation error: R_AMD64_32: file /var/tmp//cc.7aMiC.o: section [55].rela.debug_macro: symbol .debug_macro (section): symbol has been discarded with discarded section: [76].debug_macro
ld: fatal: relocation error: R_AMD64_32: file /var/tmp//cc.7aMiC.o: section [55].rela.debug_macro: symbol .debug_macro (section): symbol has been discarded with discarded section: [78].debug_macro
ld: fatal: relocation error: R_AMD64_32: file /var/tmp//cc.7aMiC.o: section [55].rela.debug_macro: symbol .debug_macro (section): symbol has been discarded with discarded section: [80].debug_macro
ld: fatal: relocation error: R_AMD64_32: file /var/tmp//cc.7aMiC.o: section [55].rela.debug_macro: symbol .debug_macro (section): symbol has been discarded with discarded section: [82].debug_macro
ld: fatal: relocation error: R_AMD64_32: file /var/tmp//cc.7aMiC.o: section [55].rela.debug_macro: symbol .debug_macro (section): symbol has been discarded with discarded section: [84].debug_macro
ld: fatal: relocation error: R_AMD64_32: file /var/tmp//cc.7aMiC.o: section [55].rela.debug_macro: symbol .debug_macro (section): symbol has been discarded with discarded section: [86].debug_macro
ld: fatal: relocation error: R_AMD64_32: file /var/tmp//cc.7aMiC.o: section [55].rela.debug_macro: symbol .debug_macro (section): symbol has been discarded with discarded section: [88].debug_macro
ld: fatal: relocation error: R_AMD64_32: file /var/tmp//cc.7aMiC.o: section [55].rela.debug_macro: symbol .debug_macro (section): symbol has been discarded with discarded section: [90].debug_macro
ld: fatal: relocation error: R_AMD64_32: file /var/tmp//cc.7aMiC.o: section [55].rela.debug_macro: symbol .debug_macro (section): symbol has been discarded with discarded section: [92].debug_macro
ld: fatal: relocation error: R_AMD64_32: file /var/tmp//cc.7aMiC.o: section [55].rela.debug_macro: symbol .debug_macro (section): symbol has been discarded with discarded section: [94].debug_macro
ld: fatal: relocation error: R_AMD64_32: file /var/tmp//cc.7aMiC.o: section [55].rela.debug_macro: symbol .debug_macro (section): symbol has been discarded with discarded section: [96].debug_macro
ld: fatal: relocation error: R_AMD64_32: file /var/tmp//cc.7aMiC.o: section [55].rela.debug_macro: symbol .debug_macro (section): symbol has been discarded with discarded section: [98].debug_macro
ld: fatal: relocation error: R_AMD64_32: file /var/tmp//cc.7aMiC.o: section [55].rela.debug_macro: symbol .debug_macro (section): symbol has been discarded with discarded section: [100].debug_macro
ld: fatal: relocation error: R_AMD64_32: file /var/tmp//cc.7aMiC.o: section [55].rela.debug_macro: symbol .debug_macro (section): symbol has been discarded with discarded section: [102].debug_macro
ld: fatal: relocation error: R_AMD64_32: file /var/tmp//cc.7aMiC.o: section [55].rela.debug_macro: symbol .debug_macro (section): symbol has been discarded with discarded section: [104].debug_macro
ld: fatal: relocation error: R_AMD64_32: file /var/tmp//cc.7aMiC.o: section [55].rela.debug_macro: symbol .debug_macro (section): symbol has been discarded with discarded section: [106].debug_macro
ld: fatal: relocation error: R_AMD64_32: file /var/tmp//cc.7aMiC.o: section [55].rela.debug_macro: symbol .debug_macro (section): symbol has been discarded with discarded section: [108].debug_macro
ld: fatal: relocation error: R_AMD64_32: file /var/tmp//cc.7aMiC.o: section [55].rela.debug_macro: symbol .debug_macro (section): symbol has been discarded with discarded section: [110].debug_macro
ld: fatal: relocation error: R_AMD64_32: file /var/tmp//cc.7aMiC.o: section [55].rela.debug_macro: symbol .debug_macro (section): symbol has been discarded with discarded section: [112].debug_macro
ld: fatal: relocation error: R_AMD64_32: file /var/tmp//cc.7aMiC.o: section [55].rela.debug_macro: symbol .debug_macro (section): symbol has been discarded with discarded section: [114].debug_macro
ld: fatal: relocation error: R_AMD64_32: file /var/tmp//cc.7aMiC.o: section [55].rela.debug_macro: symbol .debug_macro (section): symbol has been discarded with discarded section: [116].debug_macro
ld: fatal: relocation error: R_AMD64_32: file /var/tmp//cc.7aMiC.o: section [55].rela.debug_macro: symbol .debug_macro (section): symbol has been discarded with discarded section: [118].debug_macro
ld: fatal: relocation error: R_AMD64_32: file /var/tmp//cc.7aMiC.o: section [55].rela.debug_macro: symbol .debug_macro (section): symbol has been discarded with discarded section: [120].debug_macro
ld: fatal: relocation error: R_AMD64_32: file /var/tmp//cc.7aMiC.o: section [55].rela.debug_macro: symbol .debug_macro (section): symbol has been discarded with discarded section: [122].debug_macro
collect2: error: ld returned 1 exit status
configure:8856: $? = 1
configure: program exited with status 1
configure: failed program was:
| /* confdefs.h */
| #define PACKAGE_NAME ""
| #define PACKAGE_TARNAME ""
| #define PACKAGE_VERSION ""
| #define PACKAGE_STRING ""
| #define PACKAGE_BUGREPORT ""
| #define PACKAGE_URL ""
| #define CANONICALIZATION_FOR_MATHN 1
| #define RUBY_BASE_NAME "ruby" !<verconf>!
| #define RUBY_VERSION_NAME RUBY_BASE_NAME"-"RUBY_LIB_VERSION !<verconf>!
| #define STDC_HEADERS 1
| #define HAVE_SYS_TYPES_H 1
| #define HAVE_SYS_STAT_H 1
| #define HAVE_STDLIB_H 1
| #define HAVE_STRING_H 1
| #define HAVE_MEMORY_H 1
| #define HAVE_STRINGS_H 1
| #define HAVE_INTTYPES_H 1
| #define HAVE_STDINT_H 1
| #define HAVE_UNISTD_H 1
| #define __EXTENSIONS__ 1
| #define _ALL_SOURCE 1
| #define _GNU_SOURCE 1
| #define _POSIX_PTHREAD_SEMANTICS 1
| #define _TANDEM_SOURCE 1
| #ifndef __cplusplus
| #define inline __inline__
| #endif
| #define HAVE_LONG_LONG 1
| #define HAVE_OFF_T 1
| #define SIZEOF_INT 0
| #define SIZEOF_SHORT 0
| /* end confdefs.h. */
| #include <stdio.h>
| #ifdef HAVE_SYS_TYPES_H
| # include <sys/types.h>
| #endif
| #ifdef HAVE_SYS_STAT_H
| # include <sys/stat.h>
| #endif
| #ifdef STDC_HEADERS
| # include <stdlib.h>
| # include <stddef.h>
| #else
| # ifdef HAVE_STDLIB_H
| # include <stdlib.h>
| # endif
| #endif
| #ifdef HAVE_STRING_H
| # if !defined STDC_HEADERS && defined HAVE_MEMORY_H
| # include <memory.h>
| # endif
| # include <string.h>
| #endif
| #ifdef HAVE_STRINGS_H
| # include <strings.h>
| #endif
| #ifdef HAVE_INTTYPES_H
| # include <inttypes.h>
| #endif
| #ifdef HAVE_STDINT_H
| # include <stdint.h>
| #endif
| #ifdef HAVE_UNISTD_H
| # include <unistd.h>
| #endif
| static long int longval () { return (long int) (sizeof (long)); }
| static unsigned long int ulongval () { return (long int) (sizeof (long)); }
| #include <stdio.h>
| #include <stdlib.h>
| int
| main ()
| {
|
| FILE *f = fopen ("conftest.val", "w");
| if (! f)
| return 1;
| if (((long int) (sizeof (long))) < 0)
| {
| long int i = longval ();
| if (i != ((long int) (sizeof (long))))
| return 1;
| fprintf (f, "%ld", i);
| }
| else
| {
| unsigned long int i = ulongval ();
| if (i != ((long int) (sizeof (long))))
| return 1;
| fprintf (f, "%lu", i);
| }
| /* Do not output a trailing newline, as this causes \r\n confusion
| on some platforms. */
| return ferror (f) || fclose (f) != 0;
|
| ;
| return 0;
| }
configure:8870: result: 0
configure:8949: checking size of long long
configure:8954: gcc -o conftest -O3 -fno-fast-math -ggdb3 -ansi -std=iso9899:199409 -fstack-protector conftest.c >&5
ld: fatal: relocation error: R_AMD64_32: file /var/tmp//ccb_aojC.o: section [55].rela.debug_macro: symbol .debug_macro (section): symbol has been discarded with discarded section: [58].debug_macro
ld: fatal: relocation error: R_AMD64_32: file /var/tmp//ccb_aojC.o: section [55].rela.debug_macro: symbol .debug_macro (section): symbol has been discarded with discarded section: [60].debug_macro
ld: fatal: relocation error: R_AMD64_32: file /var/tmp//ccb_aojC.o: section [55].rela.debug_macro: symbol .debug_macro (section): symbol has been discarded with discarded section: [62].debug_macro
ld: fatal: relocation error: R_AMD64_32: file /var/tmp//ccb_aojC.o: section [55].rela.debug_macro: symbol .debug_macro (section): symbol has been discarded with discarded section: [64].debug_macro
ld: fatal: relocation error: R_AMD64_32: file /var/tmp//ccb_aojC.o: section [55].rela.debug_macro: symbol .debug_macro (section): symbol has been discarded with discarded section: [66].debug_macro
ld: fatal: relocation error: R_AMD64_32: file /var/tmp//ccb_aojC.o: section [55].rela.debug_macro: symbol .debug_macro (section): symbol has been discarded with discarded section: [68].debug_macro
ld: fatal: relocation error: R_AMD64_32: file /var/tmp//ccb_aojC.o: section [55].rela.debug_macro: symbol .debug_macro (section): symbol has been discarded with discarded section: [70].debug_macro
ld: fatal: relocation error: R_AMD64_32: file /var/tmp//ccb_aojC.o: section [55].rela.debug_macro: symbol .debug_macro (section): symbol has been discarded with discarded section: [72].debug_macro
ld: fatal: relocation error: R_AMD64_32: file /var/tmp//ccb_aojC.o: section [55].rela.debug_macro: symbol .debug_macro (section): symbol has been discarded with discarded section: [74].debug_macro
ld: fatal: relocation error: R_AMD64_32: file /var/tmp//ccb_aojC.o: section [55].rela.debug_macro: symbol .debug_macro (section): symbol has been discarded with discarded section: [76].debug_macro
ld: fatal: relocation error: R_AMD64_32: file /var/tmp//ccb_aojC.o: section [55].rela.debug_macro: symbol .debug_macro (section): symbol has been discarded with discarded section: [78].debug_macro
ld: fatal: relocation error: R_AMD64_32: file /var/tmp//ccb_aojC.o: section [55].rela.debug_macro: symbol .debug_macro (section): symbol has been discarded with discarded section: [80].debug_macro
ld: fatal: relocation error: R_AMD64_32: file /var/tmp//ccb_aojC.o: section [55].rela.debug_macro: symbol .debug_macro (section): symbol has been discarded with discarded section: [82].debug_macro
ld: fatal: relocation error: R_AMD64_32: file /var/tmp//ccb_aojC.o: section [55].rela.debug_macro: symbol .debug_macro (section): symbol has been discarded with discarded section: [84].debug_macro
ld: fatal: relocation error: R_AMD64_32: file /var/tmp//ccb_aojC.o: section [55].rela.debug_macro: symbol .debug_macro (section): symbol has been discarded with discarded section: [86].debug_macro
ld: fatal: relocation error: R_AMD64_32: file /var/tmp//ccb_aojC.o: section [55].rela.debug_macro: symbol .debug_macro (section): symbol has been discarded with discarded section: [88].debug_macro
ld: fatal: relocation error: R_AMD64_32: file /var/tmp//ccb_aojC.o: section [55].rela.debug_macro: symbol .debug_macro (section): symbol has been discarded with discarded section: [90].debug_macro
ld: fatal: relocation error: R_AMD64_32: file /var/tmp//ccb_aojC.o: section [55].rela.debug_macro: symbol .debug_macro (section): symbol has been discarded with discarded section: [92].debug_macro
ld: fatal: relocation error: R_AMD64_32: file /var/tmp//ccb_aojC.o: section [55].rela.debug_macro: symbol .debug_macro (section): symbol has been discarded with discarded section: [94].debug_macro
ld: fatal: relocation error: R_AMD64_32: file /var/tmp//ccb_aojC.o: section [55].rela.debug_macro: symbol .debug_macro (section): symbol has been discarded with discarded section: [96].debug_macro
ld: fatal: relocation error: R_AMD64_32: file /var/tmp//ccb_aojC.o: section [55].rela.debug_macro: symbol .debug_macro (section): symbol has been discarded with discarded section: [98].debug_macro
ld: fatal: relocation error: R_AMD64_32: file /var/tmp//ccb_aojC.o: section [55].rela.debug_macro: symbol .debug_macro (section): symbol has been discarded with discarded section: [100].debug_macro
ld: fatal: relocation error: R_AMD64_32: file /var/tmp//ccb_aojC.o: section [55].rela.debug_macro: symbol .debug_macro (section): symbol has been discarded with discarded section: [102].debug_macro
ld: fatal: relocation error: R_AMD64_32: file /var/tmp//ccb_aojC.o: section [55].rela.debug_macro: symbol .debug_macro (section): symbol has been discarded with discarded section: [104].debug_macro
ld: fatal: relocation error: R_AMD64_32: file /var/tmp//ccb_aojC.o: section [55].rela.debug_macro: symbol .debug_macro (section): symbol has been discarded with discarded section: [106].debug_macro
ld: fatal: relocation error: R_AMD64_32: file /var/tmp//ccb_aojC.o: section [55].rela.debug_macro: symbol .debug_macro (section): symbol has been discarded with discarded section: [108].debug_macro
ld: fatal: relocation error: R_AMD64_32: file /var/tmp//ccb_aojC.o: section [55].rela.debug_macro: symbol .debug_macro (section): symbol has been discarded with discarded section: [110].debug_macro
ld: fatal: relocation error: R_AMD64_32: file /var/tmp//ccb_aojC.o: section [55].rela.debug_macro: symbol .debug_macro (section): symbol has been discarded with discarded section: [112].debug_macro
ld: fatal: relocation error: R_AMD64_32: file /var/tmp//ccb_aojC.o: section [55].rela.debug_macro: symbol .debug_macro (section): symbol has been discarded with discarded section: [114].debug_macro
ld: fatal: relocation error: R_AMD64_32: file /var/tmp//ccb_aojC.o: section [55].rela.debug_macro: symbol .debug_macro (section): symbol has been discarded with discarded section: [116].debug_macro
ld: fatal: relocation error: R_AMD64_32: file /var/tmp//ccb_aojC.o: section [55].rela.debug_macro: symbol .debug_macro (section): symbol has been discarded with discarded section: [118].debug_macro
ld: fatal: relocation error: R_AMD64_32: file /var/tmp//ccb_aojC.o: section [55].rela.debug_macro: symbol .debug_macro (section): symbol has been discarded with discarded section: [120].debug_macro
ld: fatal: relocation error: R_AMD64_32: file /var/tmp//ccb_aojC.o: section [55].rela.debug_macro: symbol .debug_macro (section): symbol has been discarded with discarded section: [122].debug_macro
collect2: error: ld returned 1 exit status
configure:8954: $? = 1
configure: program exited with status 1
configure: failed program was:
| /* confdefs.h */
| #define PACKAGE_NAME ""
| #define PACKAGE_TARNAME ""
| #define PACKAGE_VERSION ""
| #define PACKAGE_STRING ""
| #define PACKAGE_BUGREPORT ""
| #define PACKAGE_URL ""
| #define CANONICALIZATION_FOR_MATHN 1
| #define RUBY_BASE_NAME "ruby" !<verconf>!
| #define RUBY_VERSION_NAME RUBY_BASE_NAME"-"RUBY_LIB_VERSION !<verconf>!
| #define STDC_HEADERS 1
| #define HAVE_SYS_TYPES_H 1
| #define HAVE_SYS_STAT_H 1
| #define HAVE_STDLIB_H 1
| #define HAVE_STRING_H 1
| #define HAVE_MEMORY_H 1
| #define HAVE_STRINGS_H 1
| #define HAVE_INTTYPES_H 1
| #define HAVE_STDINT_H 1
| #define HAVE_UNISTD_H 1
| #define __EXTENSIONS__ 1
| #define _ALL_SOURCE 1
| #define _GNU_SOURCE 1
| #define _POSIX_PTHREAD_SEMANTICS 1
| #define _TANDEM_SOURCE 1
| #ifndef __cplusplus
| #define inline __inline__
| #endif
| #define HAVE_LONG_LONG 1
| #define HAVE_OFF_T 1
| #define SIZEOF_INT 0
| #define SIZEOF_SHORT 0
| #define SIZEOF_LONG 0
| /* end confdefs.h. */
| #include <stdio.h>
| #ifdef HAVE_SYS_TYPES_H
| # include <sys/types.h>
| #endif
| #ifdef HAVE_SYS_STAT_H
| # include <sys/stat.h>
| #endif
| #ifdef STDC_HEADERS
| # include <stdlib.h>
| # include <stddef.h>
| #else
| # ifdef HAVE_STDLIB_H
| # include <stdlib.h>
| # endif
| #endif
| #ifdef HAVE_STRING_H
| # if !defined STDC_HEADERS && defined HAVE_MEMORY_H
| # include <memory.h>
| # endif
| # include <string.h>
| #endif
| #ifdef HAVE_STRINGS_H
| # include <strings.h>
| #endif
| #ifdef HAVE_INTTYPES_H
| # include <inttypes.h>
| #endif
| #ifdef HAVE_STDINT_H
| # include <stdint.h>
| #endif
| #ifdef HAVE_UNISTD_H
| # include <unistd.h>
| #endif
| static long int longval () { return (long int) (sizeof (long long)); }
| static unsigned long int ulongval () { return (long int) (sizeof (long long)); }
| #include <stdio.h>
| #include <stdlib.h>
| int
| main ()
| {
|
| FILE *f = fopen ("conftest.val", "w");
| if (! f)
| return 1;
| if (((long int) (sizeof (long long))) < 0)
| {
| long int i = longval ();
| if (i != ((long int) (sizeof (long long))))
| return 1;
| fprintf (f, "%ld", i);
| }
| else
| {
| unsigned long int i = ulongval ();
| if (i != ((long int) (sizeof (long long))))
| return 1;
| fprintf (f, "%lu", i);
| }
| /* Do not output a trailing newline, as this causes \r\n confusion
| on some platforms. */
| return ferror (f) || fclose (f) != 0;
|
| ;
| return 0;
| }
configure:8958: error: in `/home/admin/ruby-2.0.0-p0':
configure:8960: error: cannot compute sizeof (long long)
See `config.log' for more details
## ---------------- ##
## Cache variables. ##
## ---------------- ##
ac_cv_build=x86_64-pc-solaris2.11
ac_cv_c_bigendian=no
ac_cv_c_char_unsigned=no
ac_cv_c_compiler_gnu=yes
ac_cv_c_const=yes
ac_cv_c_inline=__inline__
ac_cv_c_volatile=yes
ac_cv_cxx_compiler_gnu=yes
ac_cv_env_CCC_set=
ac_cv_env_CCC_value=
ac_cv_env_CC_set=
ac_cv_env_CC_value=
ac_cv_env_CFLAGS_set=
ac_cv_env_CFLAGS_value=
ac_cv_env_CPPFLAGS_set=
ac_cv_env_CPPFLAGS_value=
ac_cv_env_CPP_set=
ac_cv_env_CPP_value=
ac_cv_env_CXXFLAGS_set=
ac_cv_env_CXXFLAGS_value=
ac_cv_env_CXX_set=
ac_cv_env_CXX_value=
ac_cv_env_LDFLAGS_set=
ac_cv_env_LDFLAGS_value=
ac_cv_env_LIBS_set=
ac_cv_env_LIBS_value=
ac_cv_env_build_alias_set=
ac_cv_env_build_alias_value=
ac_cv_env_host_alias_set=
ac_cv_env_host_alias_value=
ac_cv_env_target_alias_set=
ac_cv_env_target_alias_value=
ac_cv_func_dl_iterate_phdr=no
ac_cv_header_inttypes_h=yes
ac_cv_header_memory_h=yes
ac_cv_header_minix_config_h=no
ac_cv_header_stdc=yes
ac_cv_header_stdint_h=yes
ac_cv_header_stdlib_h=yes
ac_cv_header_string_h=yes
ac_cv_header_strings_h=yes
ac_cv_header_sys_stat_h=yes
ac_cv_header_sys_types_h=yes
ac_cv_header_unistd_h=yes
ac_cv_host=x86_64-pc-solaris2.11
ac_cv_objext=o
ac_cv_path_EGREP='/opt/local/bin/grep -E'
ac_cv_path_GREP=/opt/local/bin/grep
ac_cv_path_ac_pt_LD=/usr/ccs/bin/ld
ac_cv_path_install='/opt/local/bin/ginstall -c'
ac_cv_path_mkdir=/opt/local/bin/mkdir
ac_cv_prog_CPP='gcc -E'
ac_cv_prog_DTRACE=dtrace
ac_cv_prog_ac_ct_AR=ar
ac_cv_prog_ac_ct_AS=as
ac_cv_prog_ac_ct_CC=gcc
ac_cv_prog_ac_ct_CXX=g++
ac_cv_prog_ac_ct_NM=nm
ac_cv_prog_ac_ct_OBJCOPY=objcopy
ac_cv_prog_ac_ct_OBJDUMP=objdump
ac_cv_prog_ac_ct_RANLIB=ranlib
ac_cv_prog_cc_c89=
ac_cv_prog_cc_g=yes
ac_cv_prog_cxx_g=yes
ac_cv_prog_gcc_traditional=no
ac_cv_prog_make_make_set=yes
ac_cv_safe_to_define___extensions__=yes
ac_cv_sizeof_int=0
ac_cv_sizeof_long=0
ac_cv_sizeof_short=0
ac_cv_sys_file_offset_bits=no
ac_cv_sys_largefile_CC=no
ac_cv_target=x86_64-pc-solaris2.11
ac_cv_type_long_long=yes
ac_cv_type_off_t=yes
rb_cv_char_bit=8
rb_cv_cppoutfile=yes
rb_cv_prog_gnu_ld=no
rb_cv_target_archs=x86_64
rb_cv_warnflags='-Wall -Wextra -Wno-unused-parameter -Wno-parentheses -Wno-long-long -Wno-missing-field-initializers -Wunused-variable -Werror=pointer-arith -Werror=write-strings -Werror=declaration-after-statement -Werror=implicit-function-declaration'
## ----------------- ##
## Output variables. ##
## ----------------- ##
ALLOCA=''
AR='ar'
ARCHFILE=''
ARCH_FLAG=''
AS='as'
ASFLAGS=''
BASERUBY='echo executable host ruby is required. use --with-baseruby option.; false'
BTESTRUBY=''
BUILTIN_ENCOBJS=''
BUILTIN_TRANSOBJS=''
BUILTIN_TRANSSRCS=''
CAPITARGET=''
CC='gcc'
CCDLFLAGS=''
CFLAGS=' -O3 -fno-fast-math -ggdb3 -ansi -std=iso9899:199409 '
CHDIR='cd -P'
COMMON_HEADERS=''
COMMON_LIBS=''
COMMON_MACROS=''
COUTFLAG='-o '
CP='cp'
CPP='gcc -E'
CPPFLAGS=''
CPPOUTFILE='-o conftest.i'
CROSS_COMPILING=''
CXX='g++'
CXXFLAGS=' -O3 -fno-fast-math -ggdb3 -ansi -std=iso9899:199409 '
DEFS=''
DLDFLAGS=''
DLDLIBS=''
DLEXT2=''
DLEXT=''
DLLWRAP=''
DLNOBJ=''
DOT=''
DOXYGEN=''
DTRACE='dtrace'
DTRACE_EXT=''
DTRACE_GLOMMED_OBJ=''
DTRACE_OBJ=''
ECHO_C=''
ECHO_N='-n'
ECHO_T=''
EGREP='/opt/local/bin/grep -E'
ENABLE_SHARED=''
ENCOBJS=''
EXECUTABLE_EXTS=''
EXEEXT=''
EXPORT_PREFIX=''
EXTDLDFLAGS=''
EXTLDFLAGS=''
EXTOBJS=''
EXTOUT=''
EXTSTATIC=''
GCC='yes'
GNU_LD='no'
GREP='/opt/local/bin/grep'
INSTALLDOC=''
INSTALL_DATA='${INSTALL} -m 644'
INSTALL_PROGRAM='${INSTALL}'
INSTALL_SCRIPT='${INSTALL}'
LD='/usr/ccs/bin/ld'
LDFLAGS='-fstack-protector'
LDSHARED=''
LDSHAREDXX=''
LIBEXT=''
LIBOBJS=''
LIBPATHENV=''
LIBPATHFLAG=''
LIBRUBY=''
LIBRUBYARG=''
LIBRUBYARG_SHARED=''
LIBRUBYARG_STATIC=''
LIBRUBY_A=''
LIBRUBY_ALIASES=''
LIBRUBY_A_OBJS=''
LIBRUBY_DLDFLAGS=''
LIBRUBY_LDSHARED=''
LIBRUBY_RELATIVE=''
LIBRUBY_SO=''
LIBS=''
LINK_SO=''
LN_S='ln -s'
LTLIBOBJS=''
MAINLIBS=''
MAJOR='2'
MAKEDIRS='/opt/local/bin/mkdir -p'
MAKEFILES=''
MANTYPE=''
MINIOBJS=''
MINIRUBY=''
MINOR='0'
MKDIR_P='/opt/local/bin/mkdir -p'
NACL_SDK_ROOT=''
NACL_SDK_VARIANT=''
NACL_TOOLCHAIN=''
NM='nm'
NROFF=''
NULLCMD=''
OBJCOPY=':'
OBJDUMP='objdump'
OBJEXT='o'
OUTFLAG='-o '
PACKAGE=''
PACKAGE_BUGREPORT=''
PACKAGE_NAME=''
PACKAGE_STRING=''
PACKAGE_TARNAME=''
PACKAGE_URL=''
PACKAGE_VERSION=''
PATH_SEPARATOR=':'
PKG_CONFIG=''
PLATFORM_DIR=''
POSTLINK=''
PREP=''
PYTHON=''
RANLIB='ranlib'
RDOCTARGET=''
RI_BASE_NAME=''
RM='rm -f'
RMALL='rm -fr'
RMDIR='rmdir --ignore-fail-on-non-empty'
RMDIRS='rmdir --ignore-fail-on-non-empty -p'
RPATHFLAG=''
RUBYW_BASE_NAME='rubyw'
RUBYW_INSTALL_NAME=''
RUBY_BASE_NAME='ruby'
RUBY_INSTALL_NAME=''
RUBY_PROGRAM_VERSION='2.0.0'
RUBY_RELEASE_DATE='2013-02-24'
RUBY_SO_NAME=''
RUBY_VERSION_NAME='${RUBY_BASE_NAME}-${ruby_version}'
RUNRUBY=''
SET_MAKE=''
SHELL='/bin/sh'
SOLIBS=''
STATIC=''
STRIP=''
SYMBOL_PREFIX=''
TEENY='0'
TEST_RUNNABLE=''
THREAD_MODEL=''
TRY_LINK=''
UNIVERSAL_ARCHNAMES=''
UNIVERSAL_INTS=''
USE_RUBYGEMS=''
WERRORFLAG='-Werror'
WINDRES=''
XCFLAGS='-include ruby/config.h -include ruby/missing.h -D_FORTIFY_SOURCE=2 -fstack-protector -fno-strict-overflow -fvisibility=hidden'
XLDFLAGS='-fstack-protector'
XRUBY=''
XRUBY_LIBDIR=''
XRUBY_RUBYHDRDIR=''
XRUBY_RUBYLIBDIR=''
ac_ct_CC='gcc'
ac_ct_CXX='g++'
ac_ct_OBJCOPY='objcopy'
ac_ct_OBJDUMP='objdump'
arch=''
archincludedir=''
archlibdir=''
bindir='${exec_prefix}/bin'
build='x86_64-pc-solaris2.11'
build_alias=''
build_cpu='x86_64'
build_os='solaris2.11'
build_vendor='pc'
cflags=' ${optflags} ${debugflags} ${warnflags}'
codesign=''
configure_args=''
cppflags=''
cxxflags=' ${optflags} ${debugflags} ${warnflags}'
datadir='${datarootdir}'
datarootdir='${prefix}/share'
debugflags='-ggdb3'
docdir='${datarootdir}/doc/${PACKAGE}'
dvidir='${docdir}'
exec=''
exec_prefix='NONE'
host='x86_64-pc-solaris2.11'
host_alias=''
host_cpu='x86_64'
host_os='solaris2.11'
host_vendor='pc'
htmldir='${docdir}'
includedir='${prefix}/include'
infodir='${datarootdir}/info'
libdir='${exec_prefix}/lib'
libexecdir='${exec_prefix}/libexec'
localedir='${datarootdir}/locale'
localstatedir='${prefix}/var'
mandir='${datarootdir}/man'
oldincludedir='/usr/include'
optflags='-O3 -fno-fast-math'
pdfdir='${docdir}'
prefix='/home/admin'
program_transform_name='s&^&&'
psdir='${docdir}'
ridir=''
ruby_pc=''
ruby_version=''
rubyarchdir=''
rubyarchhdrdir=''
rubyarchprefix=''
rubyhdrdir=''
rubylibdir=''
rubylibprefix=''
rubysitearchprefix=''
rubyw_install_name=''
sbindir='${exec_prefix}/sbin'
setup=''
sharedstatedir='${prefix}/com'
sitearch=''
sitearchdir=''
sitearchhdrdir=''
sitearchincludedir=''
sitearchlibdir=''
sitedir=''
sitehdrdir=''
sitelibdir=''
strict_warnflags='-ansi -std=iso9899:199409'
sysconfdir='${prefix}/etc'
target='x86_64-pc-solaris2.11'
target_alias=''
target_cpu='x86_64'
target_os='solaris2.11'
target_vendor='pc'
try_header=''
vendorarchdir=''
vendorarchhdrdir=''
vendordir=''
vendorhdrdir=''
vendorlibdir=''
warnflags='-ansi -std=iso9899:199409'
## ----------- ##
## confdefs.h. ##
## ----------- ##
/* confdefs.h */
#define PACKAGE_NAME ""
#define PACKAGE_TARNAME ""
#define PACKAGE_VERSION ""
#define PACKAGE_STRING ""
#define PACKAGE_BUGREPORT ""
#define PACKAGE_URL ""
#define CANONICALIZATION_FOR_MATHN 1
#define RUBY_BASE_NAME "ruby" !<verconf>!
#define RUBY_VERSION_NAME RUBY_BASE_NAME"-"RUBY_LIB_VERSION !<verconf>!
#define STDC_HEADERS 1
#define HAVE_SYS_TYPES_H 1
#define HAVE_SYS_STAT_H 1
#define HAVE_STDLIB_H 1
#define HAVE_STRING_H 1
#define HAVE_MEMORY_H 1
#define HAVE_STRINGS_H 1
#define HAVE_INTTYPES_H 1
#define HAVE_STDINT_H 1
#define HAVE_UNISTD_H 1
#define __EXTENSIONS__ 1
#define _ALL_SOURCE 1
#define _GNU_SOURCE 1
#define _POSIX_PTHREAD_SEMANTICS 1
#define _TANDEM_SOURCE 1
#ifndef __cplusplus
#define inline __inline__
#endif
#define HAVE_LONG_LONG 1
#define HAVE_OFF_T 1
#define SIZEOF_INT 0
#define SIZEOF_SHORT 0
#define SIZEOF_LONG 0
configure: exit 77
[admin@test1 ~/ruby-2.0.0-p0]$
[admin@test1 ~/ruby-2.0.0-p0]$ cd ..
[admin@test1 ~]$ gcc --version
gcc (GCC) 4.7.2
Copyright (C) 2012 Free Software Foundation, Inc.
This is free software; see the source for copying conditions. There is NO
warranty; not even for MERCHANTABILITY or FITNESS FOR A PARTICULAR PURPOSE.
[admin@test1 ~]$ echo '#include <stdio.h>
int main() { return 0; }' > matt.c
[admin@test1 ~]$ gcc matt.c ; echo $?
0
[admin@test1 ~]$ gcc -ggdb matt.c ; echo $?
0
[admin@test1 ~]$ gcc -ggdb3 matt.c ; echo $?
ld: fatal: relocation error: R_AMD64_32: file /var/tmp//ccViaymC.o: section [23].rela.debug_macro: symbol .debug_macro (section): symbol has been discarded with discarded section: [26].debug_macro
ld: fatal: relocation error: R_AMD64_32: file /var/tmp//ccViaymC.o: section [23].rela.debug_macro: symbol .debug_macro (section): symbol has been discarded with discarded section: [28].debug_macro
ld: fatal: relocation error: R_AMD64_32: file /var/tmp//ccViaymC.o: section [23].rela.debug_macro: symbol .debug_macro (section): symbol has been discarded with discarded section: [30].debug_macro
ld: fatal: relocation error: R_AMD64_32: file /var/tmp//ccViaymC.o: section [23].rela.debug_macro: symbol .debug_macro (section): symbol has been discarded with discarded section: [32].debug_macro
ld: fatal: relocation error: R_AMD64_32: file /var/tmp//ccViaymC.o: section [23].rela.debug_macro: symbol .debug_macro (section): symbol has been discarded with discarded section: [34].debug_macro
ld: fatal: relocation error: R_AMD64_32: file /var/tmp//ccViaymC.o: section [23].rela.debug_macro: symbol .debug_macro (section): symbol has been discarded with discarded section: [36].debug_macro
ld: fatal: relocation error: R_AMD64_32: file /var/tmp//ccViaymC.o: section [23].rela.debug_macro: symbol .debug_macro (section): symbol has been discarded with discarded section: [38].debug_macro
collect2: error: ld returned 1 exit status
1
[admin@test1 ~]$
Sign up for free to join this conversation on GitHub. Already have an account? Sign in to comment
Something went wrong with that request. Please try again.