Skip to content

Instantly share code, notes, and snippets.

Embed
What would you like to do?
Rebuilding...
Cleaning Solution: NativeReferencesTest (Release|x86)
Build started 2017/05/08 9:56:41 AM.
__________________________________________________
Project "/Users/matthew/Projects/Testing/NativeReferencesTest/MacClassLibrary/MacClassLibrary.csproj" (Clean target(s)):
Target CoreClean:
Delete Task
Files:
TreatErrorsAsWarnings: True
Delete Task
Files:
/Users/matthew/Projects/Testing/NativeReferencesTest/MacClassLibrary/bin/Release/MacClassLibrary.dll
/Users/matthew/Projects/Testing/NativeReferencesTest/MacClassLibrary/obj/Release/MacClassLibrary.csproj.CoreCompileInputs.cache
/Users/matthew/Projects/Testing/NativeReferencesTest/MacClassLibrary/obj/Release/MacClassLibrary.dll
TreatErrorsAsWarnings: True
Deleting file '/Users/matthew/Projects/Testing/NativeReferencesTest/MacClassLibrary/bin/Release/MacClassLibrary.dll'
Deleting file '/Users/matthew/Projects/Testing/NativeReferencesTest/MacClassLibrary/obj/Release/MacClassLibrary.csproj.CoreCompileInputs.cache'
Deleting file '/Users/matthew/Projects/Testing/NativeReferencesTest/MacClassLibrary/obj/Release/MacClassLibrary.dll'
MakeDir Task
Directories:
obj/Release/
Target _CleanIntermediateToolOutput:
RemoveDir Task
Directories:
obj/Release/actool
RemoveDir Task
Directories:
obj/Release/ibtool
RemoveDir Task
Directories:
obj/Release/metal
RemoveDir Task
Directories:
obj/Release/scntool
RemoveDir Task
Directories:
obj/Release/TextureAtlas
RemoveDir Task
Directories:
obj/Release/
Build succeeded.
0 Warning(s)
0 Error(s)
Time Elapsed 00:00:00.00
Build started 2017/05/08 9:56:41 AM.
__________________________________________________
Project "/Users/matthew/Projects/Testing/NativeReferencesTest/NativeReferencesTest/NativeReferencesTest.csproj" (Clean target(s)):
Target CoreClean:
Delete Task
Files:
TreatErrorsAsWarnings: True
Delete Task
Files:
/Users/matthew/Projects/Testing/NativeReferencesTest/NativeReferencesTest/bin/Release/NativeReferencesTest.exe
/Users/matthew/Projects/Testing/NativeReferencesTest/NativeReferencesTest/bin/Release/NativeReferencesTest.pdb
/Users/matthew/Projects/Testing/NativeReferencesTest/NativeReferencesTest/bin/Release/MacClassLibrary.dll
/Users/matthew/Projects/Testing/NativeReferencesTest/NativeReferencesTest/obj/x86/Release/actool/partial-info.plist
/Users/matthew/Projects/Testing/NativeReferencesTest/NativeReferencesTest/obj/x86/Release/actool/asset-manifest.plist
/Users/matthew/Projects/Testing/NativeReferencesTest/NativeReferencesTest/obj/x86/Release/actool/bundle/AppIcon.icns
/Users/matthew/Projects/Testing/NativeReferencesTest/NativeReferencesTest/obj/x86/Release/ibtool-manifests/Main.storyboardc
/Users/matthew/Projects/Testing/NativeReferencesTest/NativeReferencesTest/obj/x86/Release/ibtool/Main.storyboardc/Info.plist
/Users/matthew/Projects/Testing/NativeReferencesTest/NativeReferencesTest/obj/x86/Release/ibtool/Main.storyboardc/MainMenu.nib
/Users/matthew/Projects/Testing/NativeReferencesTest/NativeReferencesTest/obj/x86/Release/ibtool/Main.storyboardc/NSWindowController-B8D-0N-5wS.nib
/Users/matthew/Projects/Testing/NativeReferencesTest/NativeReferencesTest/obj/x86/Release/ibtool/Main.storyboardc/XfG-lQ-9wD-view-m2S-Jp-Qdl.nib
/Users/matthew/Projects/Testing/NativeReferencesTest/NativeReferencesTest/obj/x86/Release/NativeReferencesTest.csprojResolveAssemblyReference.cache
/Users/matthew/Projects/Testing/NativeReferencesTest/NativeReferencesTest/obj/x86/Release/NativeReferencesTest.csproj.CoreCompileInputs.cache
/Users/matthew/Projects/Testing/NativeReferencesTest/NativeReferencesTest/obj/x86/Release/NativeReferencesTest.exe
/Users/matthew/Projects/Testing/NativeReferencesTest/NativeReferencesTest/obj/x86/Release/NativeReferencesTest.pdb
TreatErrorsAsWarnings: True
Deleting file '/Users/matthew/Projects/Testing/NativeReferencesTest/NativeReferencesTest/bin/Release/NativeReferencesTest.exe'
Deleting file '/Users/matthew/Projects/Testing/NativeReferencesTest/NativeReferencesTest/bin/Release/NativeReferencesTest.pdb'
Deleting file '/Users/matthew/Projects/Testing/NativeReferencesTest/NativeReferencesTest/bin/Release/MacClassLibrary.dll'
Deleting file '/Users/matthew/Projects/Testing/NativeReferencesTest/NativeReferencesTest/obj/x86/Release/actool/partial-info.plist'
Deleting file '/Users/matthew/Projects/Testing/NativeReferencesTest/NativeReferencesTest/obj/x86/Release/actool/asset-manifest.plist'
Deleting file '/Users/matthew/Projects/Testing/NativeReferencesTest/NativeReferencesTest/obj/x86/Release/actool/bundle/AppIcon.icns'
Deleting file '/Users/matthew/Projects/Testing/NativeReferencesTest/NativeReferencesTest/obj/x86/Release/ibtool-manifests/Main.storyboardc'
Deleting file '/Users/matthew/Projects/Testing/NativeReferencesTest/NativeReferencesTest/obj/x86/Release/ibtool/Main.storyboardc/Info.plist'
Deleting file '/Users/matthew/Projects/Testing/NativeReferencesTest/NativeReferencesTest/obj/x86/Release/ibtool/Main.storyboardc/MainMenu.nib'
Deleting file '/Users/matthew/Projects/Testing/NativeReferencesTest/NativeReferencesTest/obj/x86/Release/ibtool/Main.storyboardc/NSWindowController-B8D-0N-5wS.nib'
Deleting file '/Users/matthew/Projects/Testing/NativeReferencesTest/NativeReferencesTest/obj/x86/Release/ibtool/Main.storyboardc/XfG-lQ-9wD-view-m2S-Jp-Qdl.nib'
Deleting file '/Users/matthew/Projects/Testing/NativeReferencesTest/NativeReferencesTest/obj/x86/Release/NativeReferencesTest.csprojResolveAssemblyReference.cache'
Deleting file '/Users/matthew/Projects/Testing/NativeReferencesTest/NativeReferencesTest/obj/x86/Release/NativeReferencesTest.csproj.CoreCompileInputs.cache'
Deleting file '/Users/matthew/Projects/Testing/NativeReferencesTest/NativeReferencesTest/obj/x86/Release/NativeReferencesTest.exe'
Deleting file '/Users/matthew/Projects/Testing/NativeReferencesTest/NativeReferencesTest/obj/x86/Release/NativeReferencesTest.pdb'
MakeDir Task
Directories:
obj/x86/Release/
Target _GetProjectReferenceTargetFrameworkProperties:
__________________________________________________
Project "/Users/matthew/Projects/Testing/NativeReferencesTest/NativeReferencesTest/NativeReferencesTest.csproj" is building "/Users/matthew/Projects/Testing/NativeReferencesTest/MacClassLibrary/MacClassLibrary.csproj" (GetTargetFrameworkProperties target(s)):
Target _CleanAppBundle:
RemoveDir Task
Directories:
bin/Release/NativeReferencesTest.app/
Target _CleanIntermediateToolOutput:
RemoveDir Task
Directories:
obj/x86/Release/actool
RemoveDir Task
Directories:
obj/x86/Release/ibtool
RemoveDir Task
Directories:
obj/x86/Release/metal
RemoveDir Task
Directories:
obj/x86/Release/scntool
RemoveDir Task
Directories:
obj/x86/Release/TextureAtlas
RemoveDir Task
Directories:
obj/x86/Release/
Build succeeded.
0 Warning(s)
0 Error(s)
Time Elapsed 00:00:00.04
Building Solution: NativeReferencesTest (Release|x86)
Build started 2017/05/08 9:56:41 AM.
__________________________________________________
Project "/Users/matthew/Projects/Testing/NativeReferencesTest/MacClassLibrary/MacClassLibrary.csproj" (Build target(s)):
Target _DetectSdkLocations:
DetectSdkLocations Task
XamarinSdkRoot: <null>
Target _CoreCompileImageAssets:
ACTool Task
AppManifest:
DeviceModel: <null>
DeviceOSVersion: <null>
ImageAssets:
IntermediateOutputPath: obj/Release/
IsWatchApp: False
OptimizePNGs: False
OutputPath: bin/Release/
ProjectDir: /Users/matthew/Projects/Testing/NativeReferencesTest/MacClassLibrary
ResourcePrefix: Resources
SdkBinPath: /Applications/Xcode.app/Contents/Developer/usr/bin
SdkPlatform: MacOSX
SdkVersion: 10.12
Target _CoreCompileInterfaceDefinitions:
IBTool Task
AppManifest:
InterfaceDefinitions:
IntermediateOutputPath: obj/Release/
IsWatchApp: False
IsWatch2App: False
IsAppExtension: False
ProjectDir: /Users/matthew/Projects/Testing/NativeReferencesTest/MacClassLibrary
ResourcePrefix: Resources
SdkBinPath: /Applications/Xcode.app/Contents/Developer/usr/bin
SdkPlatform: MacOSX
SdkRoot: /Applications/Xcode.app/Contents/Developer/Platforms/MacOSX.platform/Developer/SDKs/MacOSX10.12.sdk
SdkVersion: 10.12
BundleResources Output:
OutputManifests Output:
Target _CoreCompileSceneKitAssets:
CompileSceneKitAssets Task
IntermediateOutputPath: obj/Release/
ProjectDir: /Users/matthew/Projects/Testing/NativeReferencesTest/MacClassLibrary
ResourcePrefix: Resources
SceneKitAssets:
SdkDevPath: /Applications/Xcode.app/Contents/Developer
SdkRoot: /Applications/Xcode.app/Contents/Developer/Platforms/MacOSX.platform/Developer/SDKs/MacOSX10.12.sdk
SdkVersion: 10.12
Target _CoreCompileTextureAtlases:
TextureAtlas Task
AtlasTextures: <null>
IntermediateOutputPath: obj/Release/
ProjectDir: /Users/matthew/Projects/Testing/NativeReferencesTest/MacClassLibrary
ResourcePrefix: Resources
SdkBinPath: /Applications/Xcode.app/Contents/Developer/usr/bin
SdkDevPath: /Applications/Xcode.app/Contents/Developer
SdkUsrPath: /Applications/Xcode.app/Contents/Developer/usr
Target _CollectBundleResources:
CollectBundleResources Task
BundleResources: <null>
OptimizePropertyLists: False
OptimizePNGs: False
ProjectDir: /Users/matthew/Projects/Testing/NativeReferencesTest/MacClassLibrary
ResourcePrefix: Resources
Target _PackLibraryResources:
PackLibraryResources Task
BundleResourcesWithLogicalNames: <null>
Prefix: xammac
Target PrepareForBuild:
MakeDir Task
Directories:
bin/Release/
obj/Release/
Created directory "obj/Release/"
Target GenerateTargetFrameworkMonikerAttribute:
Skipping target "GenerateTargetFrameworkMonikerAttribute" because all output files are up-to-date with respect to the input files.
Target CoreCompile:
/Library/Frameworks/Mono.framework/Versions/5.0.0/lib/mono/4.5/csc.exe /noconfig /nowarn:1701,1702,2008 /nostdlib+ /errorreport:prompt /warn:4 /define:__UNIFIED__ /errorendlocation /preferreduilang:en-US /reference:/Library/Frameworks/Xamarin.Mac.framework/Versions/Current/lib/mono/Xamarin.Mac/mscorlib.dll /reference:/Library/Frameworks/Xamarin.Mac.framework/Versions/Current/lib/mono/Xamarin.Mac/System.Core.dll /reference:/Library/Frameworks/Xamarin.Mac.framework/Versions/Current/lib/mono/Xamarin.Mac/System.dll /reference:/Library/Frameworks/Xamarin.Mac.framework/Versions/Current/lib/mono/Xamarin.Mac/Xamarin.Mac.dll /optimize+ /out:obj/Release/MacClassLibrary.dll /target:library /utf8output MyClass.cs Properties/AssemblyInfo.cs "/var/folders/_k/kblthz_n3t9bsb6c8bxhcgxh0000gp/T/Xamarin.Mac,Version=v2.0.AssemblyAttributes.cs"
Target CopyFilesToOutputDirectory:
Copy Task
DestinationFiles: <null>
DestinationFolder: bin/Release/
OverwriteReadOnlyFiles: False
Retries: 0
RetryDelayMilliseconds: 0
SkipUnchangedFiles: True
SourceFiles:
obj/Release/MacClassLibrary.dll
UseHardlinksIfPossible: False
Copying file from '/Users/matthew/Projects/Testing/NativeReferencesTest/MacClassLibrary/obj/Release/MacClassLibrary.dll' to '/Users/matthew/Projects/Testing/NativeReferencesTest/MacClassLibrary/bin/Release/MacClassLibrary.dll'
MacClassLibrary -> /Users/matthew/Projects/Testing/NativeReferencesTest/MacClassLibrary/bin/Release/MacClassLibrary.dll
Target IncrementalClean:
Delete Task
Files:
TreatErrorsAsWarnings: True
Build succeeded.
0 Warning(s)
0 Error(s)
Time Elapsed 00:00:00.66
Build started 2017/05/08 9:56:41 AM.
__________________________________________________
Project "/Users/matthew/Projects/Testing/NativeReferencesTest/NativeReferencesTest/NativeReferencesTest.csproj" (Build target(s)):
Target _DetectAppManifest:
FindItemWithLogicalName Task
Items:
Info.plist
Entitlements.plist
LogicalName: Info.plist
ProjectDir: /Users/matthew/Projects/Testing/NativeReferencesTest/NativeReferencesTest
ResourcePrefix: Resources
Target _DetectSdkLocations:
DetectSdkLocations Task
XamarinSdkRoot: <null>
Target _CoreCompileImageAssets:
ACTool Task
AppManifest: Info.plist
DeviceModel: <null>
DeviceOSVersion: <null>
ImageAssets:
Assets.xcassets/AppIcon.appiconset/Contents.json
Assets.xcassets/AppIcon.appiconset/AppIcon-128.png
Assets.xcassets/AppIcon.appiconset/AppIcon-128@2x.png
Assets.xcassets/AppIcon.appiconset/AppIcon-16.png
Assets.xcassets/AppIcon.appiconset/AppIcon-16@2x.png
Assets.xcassets/AppIcon.appiconset/AppIcon-256.png
Assets.xcassets/AppIcon.appiconset/AppIcon-256@2x.png
Assets.xcassets/AppIcon.appiconset/AppIcon-32.png
Assets.xcassets/AppIcon.appiconset/AppIcon-32@2x.png
Assets.xcassets/AppIcon.appiconset/AppIcon-512.png
Assets.xcassets/AppIcon.appiconset/AppIcon-512@2x.png
Assets.xcassets/Contents.json
IntermediateOutputPath: obj/x86/Release/
IsWatchApp: False
OptimizePNGs: False
OutputPath: bin/Release/
ProjectDir: /Users/matthew/Projects/Testing/NativeReferencesTest/NativeReferencesTest
ResourcePrefix: Resources
SdkBinPath: /Applications/Xcode.app/Contents/Developer/usr/bin
SdkPlatform: MacOSX
SdkVersion: 10.12
Tool /Applications/Xcode.app/Contents/Developer/usr/bin/actool execution started with arguments: --errors --warnings --notices --output-format xml1 --output-partial-info-plist /Users/matthew/Projects/Testing/NativeReferencesTest/NativeReferencesTest/obj/x86/Release/actool/partial-info.plist --app-icon AppIcon --minimum-deployment-target 10.10 --platform macosx --compile /Users/matthew/Projects/Testing/NativeReferencesTest/NativeReferencesTest/obj/x86/Release/actool/bundle /Users/matthew/Projects/Testing/NativeReferencesTest/NativeReferencesTest/obj/x86/Release/actool/cloned-assets/Assets.xcassets
Target _CoreCompileInterfaceDefinitions:
IBTool Task
AppManifest: Info.plist
InterfaceDefinitions:
Main.storyboard
IntermediateOutputPath: obj/x86/Release/
IsWatchApp: False
IsWatch2App: False
IsAppExtension: False
ProjectDir: /Users/matthew/Projects/Testing/NativeReferencesTest/NativeReferencesTest
ResourcePrefix: Resources
SdkBinPath: /Applications/Xcode.app/Contents/Developer/usr/bin
SdkPlatform: MacOSX
SdkRoot: /Applications/Xcode.app/Contents/Developer/Platforms/MacOSX.platform/Developer/SDKs/MacOSX10.12.sdk
SdkVersion: 10.12
Tool /Applications/Xcode.app/Contents/Developer/usr/bin/ibtool execution started with arguments: --errors --warnings --notices --output-format xml1 --minimum-deployment-target 10.10 --sdk /Applications/Xcode.app/Contents/Developer/Platforms/MacOSX.platform/Developer/SDKs/MacOSX10.12.sdk --compilation-directory /Users/matthew/Projects/Testing/NativeReferencesTest/NativeReferencesTest/obj/x86/Release/ibtool /Users/matthew/Projects/Testing/NativeReferencesTest/NativeReferencesTest/Main.storyboard
BundleResources Output:
obj/x86/Release/ibtool/Main.storyboardc/Info.plist
obj/x86/Release/ibtool/Main.storyboardc/MainMenu.nib
obj/x86/Release/ibtool/Main.storyboardc/NSWindowController-B8D-0N-5wS.nib
obj/x86/Release/ibtool/Main.storyboardc/XfG-lQ-9wD-view-m2S-Jp-Qdl.nib
OutputManifests Output:
obj/x86/Release/ibtool-manifests/Main.storyboardc
Target _CoreCompileSceneKitAssets:
CompileSceneKitAssets Task
IntermediateOutputPath: obj/x86/Release/
ProjectDir: /Users/matthew/Projects/Testing/NativeReferencesTest/NativeReferencesTest
ResourcePrefix: Resources
SceneKitAssets:
SdkDevPath: /Applications/Xcode.app/Contents/Developer
SdkRoot: /Applications/Xcode.app/Contents/Developer/Platforms/MacOSX.platform/Developer/SDKs/MacOSX10.12.sdk
SdkVersion: 10.12
Target _CollectColladaAssets:
CollectBundleResources Task
BundleResources: <null>
OptimizePropertyLists: False
OptimizePNGs: False
ProjectDir: /Users/matthew/Projects/Testing/NativeReferencesTest/NativeReferencesTest
ResourcePrefix: Resources
Target _CoreCompileColladaAssets:
Skipping target "_CoreCompileColladaAssets" because it has no inputs.
Target _CoreCompileTextureAtlases:
TextureAtlas Task
AtlasTextures: <null>
IntermediateOutputPath: obj/x86/Release/
ProjectDir: /Users/matthew/Projects/Testing/NativeReferencesTest/NativeReferencesTest
ResourcePrefix: Resources
SdkBinPath: /Applications/Xcode.app/Contents/Developer/usr/bin
SdkDevPath: /Applications/Xcode.app/Contents/Developer
SdkUsrPath: /Applications/Xcode.app/Contents/Developer/usr
Target _CollectBundleResources:
CollectBundleResources Task
BundleResources: <null>
OptimizePropertyLists: False
OptimizePNGs: False
ProjectDir: /Users/matthew/Projects/Testing/NativeReferencesTest/NativeReferencesTest
ResourcePrefix: Resources
Target _GetProjectReferenceTargetFrameworkProperties:
__________________________________________________
Project "/Users/matthew/Projects/Testing/NativeReferencesTest/NativeReferencesTest/NativeReferencesTest.csproj" is building "/Users/matthew/Projects/Testing/NativeReferencesTest/MacClassLibrary/MacClassLibrary.csproj" (GetTargetFrameworkProperties target(s)):
Target ResolveProjectReferences:
__________________________________________________
Project "/Users/matthew/Projects/Testing/NativeReferencesTest/NativeReferencesTest/NativeReferencesTest.csproj" is building "/Users/matthew/Projects/Testing/NativeReferencesTest/MacClassLibrary/MacClassLibrary.csproj" (GetTargetPath target(s)):
__________________________________________________
Project "/Users/matthew/Projects/Testing/NativeReferencesTest/NativeReferencesTest/NativeReferencesTest.csproj" is building "/Users/matthew/Projects/Testing/NativeReferencesTest/MacClassLibrary/MacClassLibrary.csproj" (GetNativeManifest target(s)):
Target PrepareForBuild:
MakeDir Task
Directories:
bin/Release/
obj/x86/Release/
Target _UnpackLibraryResources:
UnpackLibraryResources Task
Prefix: xammac
IntermediateOutputPath: obj/x86/Release/
NoOverwrite:
obj/x86/Release/actool/bundle/AppIcon.icns
obj/x86/Release/ibtool/Main.storyboardc/Info.plist
obj/x86/Release/ibtool/Main.storyboardc/MainMenu.nib
obj/x86/Release/ibtool/Main.storyboardc/NSWindowController-B8D-0N-5wS.nib
obj/x86/Release/ibtool/Main.storyboardc/XfG-lQ-9wD-view-m2S-Jp-Qdl.nib
ReferencedLibraries:
TargetFrameworkDirectory:
/Library/Frameworks/Xamarin.Mac.framework/Versions/Current/lib/mono/Xamarin.Mac
/Library/Frameworks/Xamarin.Mac.framework/Versions/Current/lib/mono/Xamarin.Mac/Facades/
Target GenerateTargetFrameworkMonikerAttribute:
Skipping target "GenerateTargetFrameworkMonikerAttribute" because all output files are up-to-date with respect to the input files.
Target CoreCompile:
/Library/Frameworks/Mono.framework/Versions/5.0.0/lib/mono/4.5/csc.exe /noconfig /nowarn:1701,1702,2008 /nostdlib+ /platform:x86 /errorreport:prompt /warn:4 /define:__UNIFIED__ /errorendlocation /preferreduilang:en-US /reference:/Users/matthew/Projects/Testing/NativeReferencesTest/MacClassLibrary/bin/Release/MacClassLibrary.dll /reference:/Library/Frameworks/Xamarin.Mac.framework/Versions/Current/lib/mono/Xamarin.Mac/mscorlib.dll /reference:/Library/Frameworks/Xamarin.Mac.framework/Versions/Current/lib/mono/Xamarin.Mac/System.Core.dll /reference:/Library/Frameworks/Xamarin.Mac.framework/Versions/Current/lib/mono/Xamarin.Mac/System.dll /reference:/Library/Frameworks/Xamarin.Mac.framework/Versions/Current/lib/mono/Xamarin.Mac/Xamarin.Mac.dll /debug:pdbonly /nowin32manifest /optimize+ /out:obj/x86/Release/NativeReferencesTest.exe /target:exe /utf8output Main.cs AppDelegate.cs ViewController.cs ViewController.designer.cs "/var/folders/_k/kblthz_n3t9bsb6c8bxhcgxh0000gp/T/Xamarin.Mac,Version=v2.0.AssemblyAttributes.cs"
Target _CopyFilesMarkedCopyLocal:
Copy Task
DestinationFiles:
bin/Release/MacClassLibrary.dll
DestinationFolder:
OverwriteReadOnlyFiles: False
Retries: 0
RetryDelayMilliseconds: 0
SkipUnchangedFiles: True
SourceFiles:
/Users/matthew/Projects/Testing/NativeReferencesTest/MacClassLibrary/bin/Release/MacClassLibrary.dll
UseHardlinksIfPossible: False
Copying file from '/Users/matthew/Projects/Testing/NativeReferencesTest/MacClassLibrary/bin/Release/MacClassLibrary.dll' to '/Users/matthew/Projects/Testing/NativeReferencesTest/NativeReferencesTest/bin/Release/MacClassLibrary.dll'
Target GetCopyToOutputDirectoryItems:
__________________________________________________
Project "/Users/matthew/Projects/Testing/NativeReferencesTest/NativeReferencesTest/NativeReferencesTest.csproj" is building "/Users/matthew/Projects/Testing/NativeReferencesTest/MacClassLibrary/MacClassLibrary.csproj" (GetCopyToOutputDirectoryItems target(s)):
Target CopyFilesToOutputDirectory:
Copy Task
DestinationFiles: <null>
DestinationFolder: bin/Release/
OverwriteReadOnlyFiles: False
Retries: 0
RetryDelayMilliseconds: 0
SkipUnchangedFiles: True
SourceFiles:
obj/x86/Release/NativeReferencesTest.exe
UseHardlinksIfPossible: False
Copying file from '/Users/matthew/Projects/Testing/NativeReferencesTest/NativeReferencesTest/obj/x86/Release/NativeReferencesTest.exe' to '/Users/matthew/Projects/Testing/NativeReferencesTest/NativeReferencesTest/bin/Release/NativeReferencesTest.exe'
NativeReferencesTest -> /Users/matthew/Projects/Testing/NativeReferencesTest/NativeReferencesTest/bin/Release/NativeReferencesTest.exe
Copy Task
DestinationFiles:
bin/Release/NativeReferencesTest.pdb
DestinationFolder:
OverwriteReadOnlyFiles: False
Retries: 0
RetryDelayMilliseconds: 0
SkipUnchangedFiles: True
SourceFiles:
obj/x86/Release/NativeReferencesTest.pdb
UseHardlinksIfPossible: False
Copying file from '/Users/matthew/Projects/Testing/NativeReferencesTest/NativeReferencesTest/obj/x86/Release/NativeReferencesTest.pdb' to '/Users/matthew/Projects/Testing/NativeReferencesTest/NativeReferencesTest/bin/Release/NativeReferencesTest.pdb'
Target IncrementalClean:
Delete Task
Files:
TreatErrorsAsWarnings: True
Target _DetectSigningIdentity:
DetectSigningIdentity Task
AppBundleName: NativeReferencesTest
AppManifest: Info.plist
Keychain: <null>
ProvisioningProfile: <null>
RequireCodesigning: True
RequireProvisioningProfile: False
SdkPlatform: MacOSX
SdkIsSimulator: False
SigningKey: Mac Developer
Detected signing identity:
Code Signing Key: "Mac Developer: Matthew Leibowitz (Q3RH4N7S8Y)" (C62A15CC1B6D2FDED4538DD00BA0A7DF3950C66A)
Bundle Id: com.companyname.nativereferencestest
App Id: com.companyname.nativereferencestest
Target _CopyContentToBundle:
SmartCopy Task
DestinationFiles:
bin/Release/NativeReferencesTest.app/Contents/Resources/AppIcon.icns
bin/Release/NativeReferencesTest.app/Contents/Resources/Main.storyboardc/Info.plist
bin/Release/NativeReferencesTest.app/Contents/Resources/Main.storyboardc/MainMenu.nib
bin/Release/NativeReferencesTest.app/Contents/Resources/Main.storyboardc/NSWindowController-B8D-0N-5wS.nib
bin/Release/NativeReferencesTest.app/Contents/Resources/Main.storyboardc/XfG-lQ-9wD-view-m2S-Jp-Qdl.nib
DestinationFolder:
SourceFiles:
obj/x86/Release/actool/bundle/AppIcon.icns
obj/x86/Release/ibtool/Main.storyboardc/Info.plist
obj/x86/Release/ibtool/Main.storyboardc/MainMenu.nib
obj/x86/Release/ibtool/Main.storyboardc/NSWindowController-B8D-0N-5wS.nib
obj/x86/Release/ibtool/Main.storyboardc/XfG-lQ-9wD-view-m2S-Jp-Qdl.nib
Creating directory '/Users/matthew/Projects/Testing/NativeReferencesTest/NativeReferencesTest/bin/Release/NativeReferencesTest.app/Contents/Resources'
Copying file from '/Users/matthew/Projects/Testing/NativeReferencesTest/NativeReferencesTest/obj/x86/Release/actool/bundle/AppIcon.icns' to '/Users/matthew/Projects/Testing/NativeReferencesTest/NativeReferencesTest/bin/Release/NativeReferencesTest.app/Contents/Resources/AppIcon.icns'
Creating directory '/Users/matthew/Projects/Testing/NativeReferencesTest/NativeReferencesTest/bin/Release/NativeReferencesTest.app/Contents/Resources/Main.storyboardc'
Copying file from '/Users/matthew/Projects/Testing/NativeReferencesTest/NativeReferencesTest/obj/x86/Release/ibtool/Main.storyboardc/Info.plist' to '/Users/matthew/Projects/Testing/NativeReferencesTest/NativeReferencesTest/bin/Release/NativeReferencesTest.app/Contents/Resources/Main.storyboardc/Info.plist'
Copying file from '/Users/matthew/Projects/Testing/NativeReferencesTest/NativeReferencesTest/obj/x86/Release/ibtool/Main.storyboardc/MainMenu.nib' to '/Users/matthew/Projects/Testing/NativeReferencesTest/NativeReferencesTest/bin/Release/NativeReferencesTest.app/Contents/Resources/Main.storyboardc/MainMenu.nib'
Copying file from '/Users/matthew/Projects/Testing/NativeReferencesTest/NativeReferencesTest/obj/x86/Release/ibtool/Main.storyboardc/NSWindowController-B8D-0N-5wS.nib' to '/Users/matthew/Projects/Testing/NativeReferencesTest/NativeReferencesTest/bin/Release/NativeReferencesTest.app/Contents/Resources/Main.storyboardc/NSWindowController-B8D-0N-5wS.nib'
Copying file from '/Users/matthew/Projects/Testing/NativeReferencesTest/NativeReferencesTest/obj/x86/Release/ibtool/Main.storyboardc/XfG-lQ-9wD-view-m2S-Jp-Qdl.nib' to '/Users/matthew/Projects/Testing/NativeReferencesTest/NativeReferencesTest/bin/Release/NativeReferencesTest.app/Contents/Resources/Main.storyboardc/XfG-lQ-9wD-view-m2S-Jp-Qdl.nib'
Target _CompileEntitlements:
CompileEntitlements Task
AppBundleDir: bin/Release/NativeReferencesTest.app
AppIdentifier: com.companyname.nativereferencestest
BundleIdentifier: com.companyname.nativereferencestest
CompiledEntitlements: obj/x86/Release/Entitlements.xcent
Entitlements: <null>
IsAppExtension: False
ProvisioningProfile: <null>
SdkVersion: 10.12
MSBUILD : warning : Cannot expand $(AppIdentifierPrefix) in Entitlements.plist without a provisioning profile.
Done building target "_CompileEntitlements" in project "NativeReferencesTest.csproj".
Target _CompileAppManifest:
CompileAppManifest Task
AppBundleName: NativeReferencesTest
AppBundleDir: bin/Release/NativeReferencesTest.app
AppManifest: Info.plist
Architecture: x86_64
AssemblyName: NativeReferencesTest
BundleIdentifier: com.companyname.nativereferencestest
IsAppExtension: False
PartialAppManifests:
obj/x86/Release/actool/partial-info.plist
Target _CompileToNative:
Mmp Task
AppBundleDir: bin/Release/NativeReferencesTest.app
ApplicationAssembly: bin/Release/NativeReferencesTest.exe
ApplicationName: NativeReferencesTest
Architecture: x86_64
ArchiveSymbols: <null>
Debug: False
EnableSGenConc: False
ExplicitReferences:
/Users/matthew/Projects/Testing/NativeReferencesTest/MacClassLibrary/bin/Release/MacClassLibrary.dll
/Library/Frameworks/Xamarin.Mac.framework/Versions/Current/lib/mono/Xamarin.Mac/mscorlib.dll
/Library/Frameworks/Xamarin.Mac.framework/Versions/Current/lib/mono/Xamarin.Mac/System.Core.dll
/Library/Frameworks/Xamarin.Mac.framework/Versions/Current/lib/mono/Xamarin.Mac/System.dll
/Library/Frameworks/Xamarin.Mac.framework/Versions/Current/lib/mono/Xamarin.Mac/Xamarin.Mac.dll
ExtraArguments: <null>
FrameworkRoot: /Library/Frameworks/Xamarin.Mac.framework/Versions/Current
I18n: <null>
IntermediateOutputPath: obj/x86/Release/mmp-cache
LinkMode: Full
OutputPath: bin/Release/
SdkRoot: /Applications/Xcode.app/Contents/Developer
TargetFrameworkIdentifier: Xamarin.Mac
TargetFrameworkVersion: v2.0
UseXamMacFullFramework: False
Profiling: False
AppManifest: Info.plist
SdkVersion: 10.12
NativeReferences:
/Users/matthew/Projects/Testing/NativeReferencesTest/NativeFiles/libHarfBuzzSharp.dylib
IsAppExtension: False
AotScope: None
HybridAotOption: False
ExplicitAotAssemblies: <null>
Tool /Library/Frameworks/Xamarin.Mac.framework/Versions/Current/bin/mmp execution started with arguments: /verbose /output:/Users/matthew/Projects/Testing/NativeReferencesTest/NativeReferencesTest/bin/Release/ /name:NativeReferencesTest /profile:Xamarin.Mac /arch:x86_64 --http-message-handler=HttpClientHandler /minos=10.10 /assembly:/Users/matthew/Projects/Testing/NativeReferencesTest/MacClassLibrary/bin/Release/MacClassLibrary.dll /assembly:/Library/Frameworks/Xamarin.Mac.framework/Versions/Current/lib/mono/Xamarin.Mac/mscorlib.dll /assembly:/Library/Frameworks/Xamarin.Mac.framework/Versions/Current/lib/mono/Xamarin.Mac/System.Core.dll /assembly:/Library/Frameworks/Xamarin.Mac.framework/Versions/Current/lib/mono/Xamarin.Mac/System.dll /assembly:/Library/Frameworks/Xamarin.Mac.framework/Versions/Current/lib/mono/Xamarin.Mac/Xamarin.Mac.dll /Users/matthew/Projects/Testing/NativeReferencesTest/NativeReferencesTest/bin/Release/NativeReferencesTest.exe /native-reference:/Users/matthew/Projects/Testing/NativeReferencesTest/NativeFiles/libHarfBuzzSharp.dylib /sdkroot /Applications/Xcode.app/Contents/Developer --cache /Users/matthew/Projects/Testing/NativeReferencesTest/NativeReferencesTest/obj/x86/Release/mmp-cache
Xamarin.Mac 3.4.0.30 (d15-2: 30b6e87e)
Selected target framework: Xamarin.Mac,Version=v2.0; API: Unified
Added assembly /Users/matthew/Projects/Testing/NativeReferencesTest/MacClassLibrary/bin/Release/MacClassLibrary.dll
Added assembly /Library/Frameworks/Xamarin.Mac.framework/Versions/3.4.0.30/lib/mono/Xamarin.Mac/mscorlib.dll
Added assembly /Library/Frameworks/Xamarin.Mac.framework/Versions/3.4.0.30/lib/mono/Xamarin.Mac/System.Core.dll
Added assembly /Library/Frameworks/Xamarin.Mac.framework/Versions/3.4.0.30/lib/mono/Xamarin.Mac/System.dll
Added assembly /Library/Frameworks/Xamarin.Mac.framework/Versions/3.4.0.30/lib/mono/Xamarin.Mac/Mono.Security.dll
Added assembly /Library/Frameworks/Xamarin.Mac.framework/Versions/3.4.0.30/lib/mono/Xamarin.Mac/System.Xml.dll
Added assembly /Library/Frameworks/Xamarin.Mac.framework/Versions/3.4.0.30/lib/x86_64/mobile/Xamarin.Mac.dll
Added assembly /Library/Frameworks/Xamarin.Mac.framework/Versions/3.4.0.30/lib/mono/Xamarin.Mac/System.Net.Http.dll
Added assembly /Users/matthew/Projects/Testing/NativeReferencesTest/NativeReferencesTest/bin/Release/NativeReferencesTest.exe
xcrun -sdk macosx install_name_tool -id @executable_path/../MonoBundle/libHarfBuzzSharp.dylib /Users/matthew/Projects/Testing/NativeReferencesTest/NativeReferencesTest/bin/Release/NativeReferencesTest.app/Contents/MonoBundle/libHarfBuzzSharp.dylib
MMP : warning MM2006: Native library 'libSkiaSharp.dylib' was referenced but could not be found.
MMP : warning MM2009: Referenced by MacClassLibrary.MyClass.sk_colortype_get_default_8888
/Library/Frameworks/Mono.framework/Commands/pkg-config --cflags mono-2
-D_THREAD_SAFE -I/Library/Frameworks/Xamarin.Mac.framework/Versions/3.4.0.30/lib/pkgconfig/../../include/mono-2.0
/Library/Frameworks/Mono.framework/Commands/pkg-config --variable=libdir mono-2
/Library/Frameworks/Xamarin.Mac.framework/Versions/3.4.0.30/lib/pkgconfig/../../lib
/Library/Frameworks/Mono.framework/Commands/pkg-config --modversion mono-2
5.0.0
xcrun -sdk macosx clang -mmacosx-version-min=10.10 -arch x86_64 -fobjc-runtime=macosx -ObjC /Users/matthew/Projects/Testing/NativeReferencesTest/NativeReferencesTest/bin/Release/NativeReferencesTest.app/Contents/MonoBundle/libHarfBuzzSharp.dylib -weak_framework Foundation -weak_framework AppKit -weak_framework CloudKit -weak_framework QuartzCore -u _xamarin_get_block_descriptor -u _xamarin_timezone_get_data /Library/Frameworks/Xamarin.Mac.framework/Versions/3.4.0.30/lib/libxammac.a -o /Users/matthew/Projects/Testing/NativeReferencesTest/NativeReferencesTest/bin/Release/NativeReferencesTest.app/Contents/MacOS/NativeReferencesTest -D_THREAD_SAFE -I/Library/Frameworks/Xamarin.Mac.framework/Versions/3.4.0.30/lib/pkgconfig/../../include/mono-2.0 /Library/Frameworks/Xamarin.Mac.framework/Versions/3.4.0.30/lib/pkgconfig/../../lib/libmonosgen-2.0.a -framework AppKit -liconv -x objective-c++ -I/Library/Frameworks/Xamarin.Mac.framework/Versions/3.4.0.30/include /Users/matthew/Projects/Testing/NativeReferencesTest/NativeReferencesTest/obj/x86/Release/mmp-cache/registrar.m -fno-caret-diagnostics -fno-diagnostics-fixit-info -isysroot /Applications/Xcode.app/Contents/Developer/Platforms/MacOSX.platform/Developer/SDKs/MacOSX10.12.sdk /Users/matthew/Projects/Testing/NativeReferencesTest/NativeReferencesTest/obj/x86/Release/mmp-cache/main.m
bundling complete
Mmp Task
AppBundleDir: bin/Release/NativeReferencesTest.app
ApplicationAssembly: bin/Release/NativeReferencesTest.exe
ApplicationName: NativeReferencesTest
Architecture: x86_64
ArchiveSymbols: <null>
Debug: False
EnableSGenConc: False
ExplicitReferences:
/Users/matthew/Projects/Testing/NativeReferencesTest/MacClassLibrary/bin/Release/MacClassLibrary.dll
/Library/Frameworks/Xamarin.Mac.framework/Versions/Current/lib/mono/Xamarin.Mac/mscorlib.dll
/Library/Frameworks/Xamarin.Mac.framework/Versions/Current/lib/mono/Xamarin.Mac/System.Core.dll
/Library/Frameworks/Xamarin.Mac.framework/Versions/Current/lib/mono/Xamarin.Mac/System.dll
/Library/Frameworks/Xamarin.Mac.framework/Versions/Current/lib/mono/Xamarin.Mac/Xamarin.Mac.dll
ExtraArguments: <null>
FrameworkRoot: /Library/Frameworks/Xamarin.Mac.framework/Versions/Current
I18n: <null>
IntermediateOutputPath: obj/x86/Release/mmp-cache
LinkMode: Full
OutputPath: bin/Release/
SdkRoot: /Applications/Xcode.app/Contents/Developer
TargetFrameworkIdentifier: Xamarin.Mac
TargetFrameworkVersion: v2.0
UseXamMacFullFramework: False
Profiling: False
AppManifest: Info.plist
SdkVersion: 10.12
NativeReferences:
/Users/matthew/Projects/Testing/NativeReferencesTest/NativeFiles/libSkiaSharp.dylib
IsAppExtension: False
AotScope: None
HybridAotOption: False
ExplicitAotAssemblies: <null>
Tool /Library/Frameworks/Xamarin.Mac.framework/Versions/Current/bin/mmp execution started with arguments: /verbose /output:/Users/matthew/Projects/Testing/NativeReferencesTest/NativeReferencesTest/bin/Release/ /name:NativeReferencesTest /profile:Xamarin.Mac /arch:x86_64 --http-message-handler=HttpClientHandler /minos=10.10 /assembly:/Users/matthew/Projects/Testing/NativeReferencesTest/MacClassLibrary/bin/Release/MacClassLibrary.dll /assembly:/Library/Frameworks/Xamarin.Mac.framework/Versions/Current/lib/mono/Xamarin.Mac/mscorlib.dll /assembly:/Library/Frameworks/Xamarin.Mac.framework/Versions/Current/lib/mono/Xamarin.Mac/System.Core.dll /assembly:/Library/Frameworks/Xamarin.Mac.framework/Versions/Current/lib/mono/Xamarin.Mac/System.dll /assembly:/Library/Frameworks/Xamarin.Mac.framework/Versions/Current/lib/mono/Xamarin.Mac/Xamarin.Mac.dll /Users/matthew/Projects/Testing/NativeReferencesTest/NativeReferencesTest/bin/Release/NativeReferencesTest.exe /native-reference:/Users/matthew/Projects/Testing/NativeReferencesTest/NativeFiles/libSkiaSharp.dylib /sdkroot /Applications/Xcode.app/Contents/Developer --cache /Users/matthew/Projects/Testing/NativeReferencesTest/NativeReferencesTest/obj/x86/Release/mmp-cache
Xamarin.Mac 3.4.0.30 (d15-2: 30b6e87e)
Selected target framework: Xamarin.Mac,Version=v2.0; API: Unified
Added assembly /Users/matthew/Projects/Testing/NativeReferencesTest/MacClassLibrary/bin/Release/MacClassLibrary.dll
Added assembly /Library/Frameworks/Xamarin.Mac.framework/Versions/3.4.0.30/lib/mono/Xamarin.Mac/mscorlib.dll
Added assembly /Library/Frameworks/Xamarin.Mac.framework/Versions/3.4.0.30/lib/mono/Xamarin.Mac/System.Core.dll
Added assembly /Library/Frameworks/Xamarin.Mac.framework/Versions/3.4.0.30/lib/mono/Xamarin.Mac/System.dll
Added assembly /Library/Frameworks/Xamarin.Mac.framework/Versions/3.4.0.30/lib/mono/Xamarin.Mac/Mono.Security.dll
Added assembly /Library/Frameworks/Xamarin.Mac.framework/Versions/3.4.0.30/lib/mono/Xamarin.Mac/System.Xml.dll
Added assembly /Library/Frameworks/Xamarin.Mac.framework/Versions/3.4.0.30/lib/x86_64/mobile/Xamarin.Mac.dll
Added assembly /Library/Frameworks/Xamarin.Mac.framework/Versions/3.4.0.30/lib/mono/Xamarin.Mac/System.Net.Http.dll
Added assembly /Users/matthew/Projects/Testing/NativeReferencesTest/NativeReferencesTest/bin/Release/NativeReferencesTest.exe
xcrun -sdk macosx install_name_tool -id @executable_path/../MonoBundle/libSkiaSharp.dylib /Users/matthew/Projects/Testing/NativeReferencesTest/NativeReferencesTest/bin/Release/NativeReferencesTest.app/Contents/MonoBundle/libSkiaSharp.dylib
MMP : warning MM2006: Native library 'libHarfBuzzSharp.dylib' was referenced but could not be found.
MMP : warning MM2009: Referenced by MacClassLibrary.MyClass.hb_buffer_create
MMP : warning MM2009: Referenced by MacClassLibrary.MyClass.hb_buffer_destroy
/Library/Frameworks/Mono.framework/Commands/pkg-config --cflags mono-2
-D_THREAD_SAFE -I/Library/Frameworks/Xamarin.Mac.framework/Versions/3.4.0.30/lib/pkgconfig/../../include/mono-2.0
/Library/Frameworks/Mono.framework/Commands/pkg-config --variable=libdir mono-2
/Library/Frameworks/Xamarin.Mac.framework/Versions/3.4.0.30/lib/pkgconfig/../../lib
/Library/Frameworks/Mono.framework/Commands/pkg-config --modversion mono-2
5.0.0
xcrun -sdk macosx clang -mmacosx-version-min=10.10 -arch x86_64 -fobjc-runtime=macosx -ObjC /Users/matthew/Projects/Testing/NativeReferencesTest/NativeReferencesTest/bin/Release/NativeReferencesTest.app/Contents/MonoBundle/libSkiaSharp.dylib -weak_framework Foundation -weak_framework AppKit -weak_framework CloudKit -weak_framework QuartzCore -u _xamarin_get_block_descriptor -u _xamarin_timezone_get_data /Library/Frameworks/Xamarin.Mac.framework/Versions/3.4.0.30/lib/libxammac.a -o /Users/matthew/Projects/Testing/NativeReferencesTest/NativeReferencesTest/bin/Release/NativeReferencesTest.app/Contents/MacOS/NativeReferencesTest -D_THREAD_SAFE -I/Library/Frameworks/Xamarin.Mac.framework/Versions/3.4.0.30/lib/pkgconfig/../../include/mono-2.0 /Library/Frameworks/Xamarin.Mac.framework/Versions/3.4.0.30/lib/pkgconfig/../../lib/libmonosgen-2.0.a -framework AppKit -liconv -x objective-c++ -I/Library/Frameworks/Xamarin.Mac.framework/Versions/3.4.0.30/include /Users/matthew/Projects/Testing/NativeReferencesTest/NativeReferencesTest/obj/x86/Release/mmp-cache/registrar.m -fno-caret-diagnostics -fno-diagnostics-fixit-info -isysroot /Applications/Xcode.app/Contents/Developer/Platforms/MacOSX.platform/Developer/SDKs/MacOSX10.12.sdk /Users/matthew/Projects/Testing/NativeReferencesTest/NativeReferencesTest/obj/x86/Release/mmp-cache/main.m
bundling complete
Done building target "_CompileToNative" in project "NativeReferencesTest.csproj".
Target _CreatePkgInfo:
CreatePkgInfo Task
OutputPath: bin/Release/NativeReferencesTest.app/Contents/PkgInfo
Target _CodesignNativeLibraries:
Codesign Task
CodesignAllocate: /Applications/Xcode.app/Contents/Developer/Toolchains/XcodeDefault.xctoolchain/usr/bin/codesign_allocate
DisableTimestamp: False
Entitlements: <null>
Keychain: <null>
Resources:
bin/Release/NativeReferencesTest.app/Contents/MonoBundle/libHarfBuzzSharp.dylib
bin/Release/NativeReferencesTest.app/Contents/MonoBundle/libMonoPosixHelper.dylib
bin/Release/NativeReferencesTest.app/Contents/MonoBundle/libHarfBuzzSharp.dylib
bin/Release/NativeReferencesTest.app/Contents/MonoBundle/libMonoPosixHelper.dylib
bin/Release/NativeReferencesTest.app/Contents/MonoBundle/libSkiaSharp.dylib
ResourceRules: <null>
SigningKey: C62A15CC1B6D2FDED4538DD00BA0A7DF3950C66A
ExtraArgs: <null>
IsAppExtension: False
Tool /usr/bin/codesign execution started with arguments: -v --force --sign C62A15CC1B6D2FDED4538DD00BA0A7DF3950C66A /Users/matthew/Projects/Testing/NativeReferencesTest/NativeReferencesTest/bin/Release/NativeReferencesTest.app/Contents/MonoBundle/libHarfBuzzSharp.dylib
Tool /usr/bin/codesign execution started with arguments: -v --force --sign C62A15CC1B6D2FDED4538DD00BA0A7DF3950C66A /Users/matthew/Projects/Testing/NativeReferencesTest/NativeReferencesTest/bin/Release/NativeReferencesTest.app/Contents/MonoBundle/libMonoPosixHelper.dylib
Tool /usr/bin/codesign execution started with arguments: -v --force --sign C62A15CC1B6D2FDED4538DD00BA0A7DF3950C66A /Users/matthew/Projects/Testing/NativeReferencesTest/NativeReferencesTest/bin/Release/NativeReferencesTest.app/Contents/MonoBundle/libHarfBuzzSharp.dylib
Tool /usr/bin/codesign execution started with arguments: -v --force --sign C62A15CC1B6D2FDED4538DD00BA0A7DF3950C66A /Users/matthew/Projects/Testing/NativeReferencesTest/NativeReferencesTest/bin/Release/NativeReferencesTest.app/Contents/MonoBundle/libMonoPosixHelper.dylib
bin/Release/NativeReferencesTest.app/Contents/MonoBundle/libMonoPosixHelper.dylib : error : /Users/matthew/Projects/Testing/NativeReferencesTest/NativeReferencesTest/bin/Release/NativeReferencesTest.app/Contents/MonoBundle/libMonoPosixHelper.dylib: No such file or directory
bin/Release/NativeReferencesTest.app/Contents/MonoBundle/libHarfBuzzSharp.dylib : error : /Users/matthew/Projects/Testing/NativeReferencesTest/NativeReferencesTest/bin/Release/NativeReferencesTest.app/Contents/MonoBundle/libHarfBuzzSharp.dylib: replacing existing signature
bin/Release/NativeReferencesTest.app/Contents/MonoBundle/libHarfBuzzSharp.dylib : error : /Users/matthew/Projects/Testing/NativeReferencesTest/NativeReferencesTest/bin/Release/NativeReferencesTest.app/Contents/MonoBundle/libHarfBuzzSharp.dylib: No such file or directory
Tool /usr/bin/codesign execution started with arguments: -v --force --sign C62A15CC1B6D2FDED4538DD00BA0A7DF3950C66A /Users/matthew/Projects/Testing/NativeReferencesTest/NativeReferencesTest/bin/Release/NativeReferencesTest.app/Contents/MonoBundle/libSkiaSharp.dylib
Done building target "_CodesignNativeLibraries" in project "NativeReferencesTest.csproj" -- FAILED.
Done building project "NativeReferencesTest.csproj" -- FAILED.
Build FAILED.
MSBUILD : warning : Cannot expand $(AppIdentifierPrefix) in Entitlements.plist without a provisioning profile.
MMP : warning MM2006: Native library 'libSkiaSharp.dylib' was referenced but could not be found.
MMP : warning MM2009: Referenced by MacClassLibrary.MyClass.sk_colortype_get_default_8888
MMP : warning MM2006: Native library 'libHarfBuzzSharp.dylib' was referenced but could not be found.
MMP : warning MM2009: Referenced by MacClassLibrary.MyClass.hb_buffer_create
MMP : warning MM2009: Referenced by MacClassLibrary.MyClass.hb_buffer_destroy
bin/Release/NativeReferencesTest.app/Contents/MonoBundle/libMonoPosixHelper.dylib : error : /Users/matthew/Projects/Testing/NativeReferencesTest/NativeReferencesTest/bin/Release/NativeReferencesTest.app/Contents/MonoBundle/libMonoPosixHelper.dylib: No such file or directory
bin/Release/NativeReferencesTest.app/Contents/MonoBundle/libHarfBuzzSharp.dylib : error : /Users/matthew/Projects/Testing/NativeReferencesTest/NativeReferencesTest/bin/Release/NativeReferencesTest.app/Contents/MonoBundle/libHarfBuzzSharp.dylib: replacing existing signature
bin/Release/NativeReferencesTest.app/Contents/MonoBundle/libHarfBuzzSharp.dylib : error : /Users/matthew/Projects/Testing/NativeReferencesTest/NativeReferencesTest/bin/Release/NativeReferencesTest.app/Contents/MonoBundle/libHarfBuzzSharp.dylib: No such file or directory
6 Warning(s)
2 Error(s)
Time Elapsed 00:00:11.89
---------------------- Done ----------------------
Build: 2 errors, 6 warnings
Sign up for free to join this conversation on GitHub. Already have an account? Sign in to comment