Skip to content

Instantly share code, notes, and snippets.

Embed
What would you like to do?
upgrade org.hibernate to 5.3.6 (errai doesn't build)
12:00:14 [INFO]
12:00:14 [INFO] ------------------< org.jboss.errai:errai-jpa-client >------------------
12:00:14 [INFO] Building Errai::JPA::Client 4.4.0-SNAPSHOT [30/62]
12:00:14 [INFO] --------------------------------[ jar ]---------------------------------
12:00:14 [INFO]
12:00:14 [INFO] --- maven-clean-plugin:3.0.0:clean (default-clean) @ errai-jpa-client ---
12:00:14 [INFO] Deleting /home/jenkins/workspace/KIE/Test-jobs/kieAllBuild-and-jboss-ip-bom-upgrade-Tests-04/errai/errai-jpa/errai-jpa-client (includes = [www-test/**, .gwt/**, .errai/**, war/WEB-INF/deploy/**, war/WEB-INF/lib/**, war/WEB-INF/classes/**, src/main/webapp/WEB-INF/deploy/**, src/main/webapp/WEB-INF/lib/**, src/main/webapp/WEB-INF/classes/**, **/*.JUnit/**], excludes = [])
12:00:14 [INFO]
12:00:14 [INFO] --- maven-enforcer-plugin:3.0.0-M1:enforce (enforce-java-version) @ errai-jpa-client ---
12:00:14 [INFO] Skipping Rule Enforcement.
12:00:14 [INFO]
12:00:14 [INFO] --- maven-enforcer-plugin:3.0.0-M1:enforce (enforce-maven-version) @ errai-jpa-client ---
12:00:14 [INFO] Skipping Rule Enforcement.
12:00:14 [INFO]
12:00:14 [INFO] --- maven-enforcer-plugin:3.0.0-M1:enforce (enforce-plugin-versions) @ errai-jpa-client ---
12:00:14 [INFO] Skipping Rule Enforcement.
12:00:14 [INFO]
12:00:14 [INFO] --- maven-enforcer-plugin:3.0.0-M1:enforce (ban-blacklisted-dependencies) @ errai-jpa-client ---
12:00:14 [INFO] Skipping Rule Enforcement.
12:00:14 [INFO]
12:00:14 [INFO] --- maven-enforcer-plugin:3.0.0-M1:enforce (enforce-sane-versions) @ errai-jpa-client ---
12:00:14 [INFO] Skipping Rule Enforcement.
12:00:14 [INFO]
12:00:14 [INFO] --- maven-enforcer-plugin:3.0.0-M1:enforce (no-managed-deps) @ errai-jpa-client ---
12:00:14 [INFO] Skipping Rule Enforcement.
12:00:14 [INFO]
12:00:14 [INFO] --- buildnumber-maven-plugin:1.4:create (get-scm-revision) @ errai-jpa-client ---
12:00:14 [INFO]
12:00:14 [INFO] --- maven-resources-plugin:3.0.2:resources (default-resources) @ errai-jpa-client ---
12:00:14 [INFO] Using 'UTF-8' encoding to copy filtered resources.
12:00:14 [INFO] Copying 197 resources
12:00:14 [INFO] Copying 1 resource
12:00:14 [INFO]
12:00:14 [INFO] --- maven-compiler-plugin:3.7.0:compile (default-compile) @ errai-jpa-client ---
12:00:14 [INFO] Changes detected - recompiling the module!
12:00:14 [INFO] Compiling 192 source files to /home/jenkins/workspace/KIE/Test-jobs/kieAllBuild-and-jboss-ip-bom-upgrade-Tests-04/errai/errai-jpa/errai-jpa-client/target/classes
12:00:14 [INFO] -------------------------------------------------------------
12:00:14 [WARNING] COMPILATION WARNING :
12:00:14 [INFO] -------------------------------------------------------------
12:00:14 [WARNING] /home/jenkins/workspace/KIE/Test-jobs/kieAllBuild-and-jboss-ip-bom-upgrade-Tests-04/errai/errai-jpa/errai-jpa-client/src/main/java/org/jboss/errai/jpa/rebind/ErraiEntityManagerGenerator.java:[173,14] '_' used as an identifier
12:00:14 (use of '_' as an identifier might not be supported in releases after Java SE 8)
12:00:14 [WARNING] /home/jenkins/workspace/KIE/Test-jobs/kieAllBuild-and-jboss-ip-bom-upgrade-Tests-04/errai/errai-jpa/errai-jpa-client/src/main/java/org/jboss/errai/jpa/rebind/ErraiEntityManagerGenerator.java:[174,14] '_' used as an identifier
12:00:14 (use of '_' as an identifier might not be supported in releases after Java SE 8)
12:00:14 [WARNING] /home/jenkins/workspace/KIE/Test-jobs/kieAllBuild-and-jboss-ip-bom-upgrade-Tests-04/errai/errai-jpa/errai-jpa-client/src/main/java/org/jboss/errai/jpa/rebind/ErraiEntityManagerGenerator.java:[175,14] '_' used as an identifier
12:00:14 (use of '_' as an identifier might not be supported in releases after Java SE 8)
12:00:14 [WARNING] /home/jenkins/workspace/KIE/Test-jobs/kieAllBuild-and-jboss-ip-bom-upgrade-Tests-04/errai/errai-jpa/errai-jpa-client/src/main/java/org/jboss/errai/jpa/rebind/ErraiEntityManagerGenerator.java:[176,14] '_' used as an identifier
12:00:14 (use of '_' as an identifier might not be supported in releases after Java SE 8)
12:00:14 [WARNING] /home/jenkins/workspace/KIE/Test-jobs/kieAllBuild-and-jboss-ip-bom-upgrade-Tests-04/errai/errai-jpa/errai-jpa-client/src/main/java/org/jboss/errai/jpa/rebind/ErraiEntityManagerGenerator.java:[180,14] '_' used as an identifier
12:00:14 (use of '_' as an identifier might not be supported in releases after Java SE 8)
12:00:14 [INFO] 5 warnings
12:00:14 [INFO] -------------------------------------------------------------
12:00:14 [INFO] -------------------------------------------------------------
12:00:14 [ERROR] COMPILATION ERROR :
12:00:14 [INFO] -------------------------------------------------------------
12:00:14 [ERROR] /home/jenkins/workspace/KIE/Test-jobs/kieAllBuild-and-jboss-ip-bom-upgrade-Tests-04/errai/errai-jpa/errai-jpa-client/src/main/java/org/jboss/errai/jpa/rebind/ErraiEntityManagerGenerator.java:[39,25] cannot find symbol
12:00:14 symbol: class HibernatePersistence
12:00:14 location: package org.hibernate.ejb
12:00:14 [INFO] 1 error
12:00:14 [INFO] -------------------------------------------------------------
12:00:14 [INFO] ------------------------------------------------------------------------
12:00:14 [INFO] Reactor Summary:
12:00:14 [INFO]
12:00:14 [INFO] Errai Internal BOM (Bill Of Materials) ............. SUCCESS [ 0.381 s]
12:00:14 [INFO] JBoss Errai BOM .................................... SUCCESS [ 0.873 s]
12:00:14 [INFO] Errai 4.4.0-SNAPSHOT ............................... SUCCESS [ 0.549 s]
12:00:14 [INFO] Reflections parent ................................. SUCCESS [ 1.150 s]
12:00:14 [INFO] Reflections ........................................ SUCCESS [ 8.369 s]
12:00:14 [INFO] Errai::Common ...................................... SUCCESS [ 2.397 s]
12:00:14 [INFO] Errai::CDI::EE6 API Overrides ...................... SUCCESS [ 1.270 s]
12:00:14 [INFO] Errai::Codegen ..................................... SUCCESS [ 16.397 s]
12:00:14 [INFO] Errai::Codegen::GWT ................................ SUCCESS [ 0.466 s]
12:00:14 [INFO] Errai::Config ...................................... SUCCESS [ 0.229 s]
12:00:14 [INFO] Errai::Marshalling ................................. SUCCESS [ 1.121 s]
12:00:14 [INFO] Errai::Bus ......................................... SUCCESS [ 18.702 s]
12:00:14 [INFO] Errai::Tools ....................................... SUCCESS [ 0.979 s]
12:00:14 [INFO] Errai::IOC ......................................... SUCCESS [ 3.947 s]
12:00:14 [INFO] Errai::Client::Local::Class::Hider ................. SUCCESS [ 5.424 s]
12:00:14 [INFO] Errai::CDI ......................................... SUCCESS [ 0.387 s]
12:00:14 [INFO] Errai::CDI::JBoss .................................. SUCCESS [ 3.822 s]
12:00:14 [INFO] Errai::IOC::Bus Support ............................ SUCCESS [ 0.583 s]
12:00:14 [INFO] Errai::CDI::Shared ................................. SUCCESS [ 0.247 s]
12:00:14 [INFO] Errai::CDI::Client ................................. SUCCESS [ 1.553 s]
12:00:14 [INFO] Errai::Data::Binding ............................... SUCCESS [ 2.683 s]
12:00:14 [INFO] Errai::CDI::Server ................................. SUCCESS [ 2.092 s]
12:00:14 [INFO] Errai::JAX-RS ...................................... SUCCESS [ 0.029 s]
12:00:14 [INFO] Errai::JAX-RS::Provider ............................ SUCCESS [ 0.855 s]
12:00:14 [INFO] Errai::JAX-RS::Client .............................. SUCCESS [ 2.858 s]
12:00:14 [INFO] Errai::UI .......................................... SUCCESS [ 1.918 s]
12:00:14 [INFO] Errai::Navigation .................................. SUCCESS [ 1.169 s]
12:00:14 [INFO] Errai::Validation .................................. SUCCESS [ 1.490 s]
12:00:14 [INFO] Errai::JPA ......................................... SUCCESS [ 0.034 s]
12:00:14 [INFO] Errai::JPA::Client ................................. FAILURE [ 0.270 s]
12:00:14 [INFO] Errai::JPA::Data Synchronization ................... SKIPPED
12:00:14 [INFO] Errai::HTML5 ....................................... SKIPPED
12:00:14 [INFO] Errai::Java EE::All ................................ SKIPPED
12:00:14 [INFO] Errai::Cordova ..................................... SKIPPED
12:00:14 [INFO] Errai::Bus::WebSocket::Parent ...................... SKIPPED
12:00:14 [INFO] Errai::Bus::JSR-356::WebSocket ..................... SKIPPED
12:00:14 [INFO] Errai::Bus::JSR-356::WebSocket::Weld ............... SKIPPED
12:00:14 [INFO] Errai::Bus::AS7::WebSocket ......................... SKIPPED
12:00:14 [INFO] errai-jboss-as-support ............................. SKIPPED
12:00:14 [INFO] Errai::Security .................................... SKIPPED
12:00:14 [INFO] Errai::Security::Server ............................ SKIPPED
12:00:14 [INFO] Errai::Security::Client ............................ SKIPPED
12:00:14 [INFO] Errai::Security::PicketLink ........................ SKIPPED
12:00:14 [INFO] Errai::Security::Keycloak .......................... SKIPPED
12:00:14 [INFO] Errai::Bus::Demos::StressTest ...................... SKIPPED
12:00:14 [INFO] Errai::Bus::Demos::Stock ........................... SKIPPED
12:00:14 [INFO] Errai::CDI::Demos::Mobile .......................... SKIPPED
12:00:14 [INFO] Errai::CDI::Demos::TagCloud ........................ SKIPPED
12:00:14 [INFO] Errai::JPA::Demos::Basic ........................... SKIPPED
12:00:14 [INFO] Errai::Annotation Checkers ......................... SKIPPED
12:00:14 [INFO] Errai::JPA::Demos::GroceryList ..................... SKIPPED
12:00:14 [INFO] Errai::JPA::Demos::ToDoList ........................ SKIPPED
12:00:14 [INFO] Errai::JAX-RS::RestDemo ............................ SKIPPED
12:00:14 [INFO] Errai::UI::Demos::I18NDemo ......................... SKIPPED
12:00:14 [INFO] Errai Security::Demo ............................... SKIPPED
12:00:14 [INFO] Errai::Demos::Aggregator ........................... SKIPPED
12:00:14 [INFO] Errai::JSInterop::Demo::Parent ..................... SKIPPED
12:00:14 [INFO] Errai::JSInterop::Demo::API ........................ SKIPPED
12:00:15 [INFO] Errai::JSInterop::Demo::Plugin ..................... SKIPPED
12:00:15 [INFO] Errai::JSInterop::Demo::App ........................ SKIPPED
12:00:15 [INFO] Errai::Forge Addon ................................. SKIPPED
12:00:15 [INFO] Errai::API 4.4.0-SNAPSHOT .......................... SKIPPED
12:00:15 [INFO] ------------------------------------------------------------------------
12:00:15 [INFO] BUILD FAILURE
12:00:15 [INFO] ------------------------------------------------------------------------
12:00:15 [INFO] Total time: 01:24 min
12:00:15 [INFO] Finished at: 2018-10-30T08:00:15-04:00
12:00:15 [INFO] ------------------------------------------------------------------------
12:00:15 [ERROR] Failed to execute goal org.apache.maven.plugins:maven-compiler-plugin:3.7.0:compile (default-compile) on project errai-jpa-client: Compilation failure
12:00:15 [ERROR] /home/jenkins/workspace/KIE/Test-jobs/kieAllBuild-and-jboss-ip-bom-upgrade-Tests-04/errai/errai-jpa/errai-jpa-client/src/main/java/org/jboss/errai/jpa/rebind/ErraiEntityManagerGenerator.java:[39,25] cannot find symbol
12:00:15 [ERROR] symbol: class HibernatePersistence
12:00:15 [ERROR] location: package org.hibernate.ejb
12:00:15 [ERROR] -> [Help 1]
12:00:15 org.apache.maven.lifecycle.LifecycleExecutionException: Failed to execute goal org.apache.maven.plugins:maven-compiler-plugin:3.7.0:compile (default-compile) on project errai-jpa-client: Compilation failure
12:00:15 /home/jenkins/workspace/KIE/Test-jobs/kieAllBuild-and-jboss-ip-bom-upgrade-Tests-04/errai/errai-jpa/errai-jpa-client/src/main/java/org/jboss/errai/jpa/rebind/ErraiEntityManagerGenerator.java:[39,25] cannot find symbol
12:00:15 symbol: class HibernatePersistence
12:00:15 location: package org.hibernate.ejb
12:00:15
12:00:15 at org.apache.maven.lifecycle.internal.MojoExecutor.execute (MojoExecutor.java:213)
12:00:15 at org.apache.maven.lifecycle.internal.MojoExecutor.execute (MojoExecutor.java:154)
12:00:15 at org.apache.maven.lifecycle.internal.MojoExecutor.execute (MojoExecutor.java:146)
12:00:15 at org.apache.maven.lifecycle.internal.LifecycleModuleBuilder.buildProject (LifecycleModuleBuilder.java:117)
12:00:15 at org.apache.maven.lifecycle.internal.LifecycleModuleBuilder.buildProject (LifecycleModuleBuilder.java:81)
12:00:15 at org.apache.maven.lifecycle.internal.builder.singlethreaded.SingleThreadedBuilder.build (SingleThreadedBuilder.java:56)
12:00:15 at org.apache.maven.lifecycle.internal.LifecycleStarter.execute (LifecycleStarter.java:128)
12:00:15 at org.apache.maven.DefaultMaven.doExecute (DefaultMaven.java:305)
12:00:15 at org.apache.maven.DefaultMaven.doExecute (DefaultMaven.java:192)
12:00:15 at org.apache.maven.DefaultMaven.execute (DefaultMaven.java:105)
12:00:15 at org.apache.maven.cli.MavenCli.execute (MavenCli.java:954)
12:00:15 at org.apache.maven.cli.MavenCli.doMain (MavenCli.java:288)
12:00:15 at org.apache.maven.cli.MavenCli.main (MavenCli.java:192)
12:00:15 at sun.reflect.NativeMethodAccessorImpl.invoke0 (Native Method)
12:00:15 at sun.reflect.NativeMethodAccessorImpl.invoke (NativeMethodAccessorImpl.java:62)
12:00:15 at sun.reflect.DelegatingMethodAccessorImpl.invoke (DelegatingMethodAccessorImpl.java:43)
12:00:15 at java.lang.reflect.Method.invoke (Method.java:498)
12:00:15 at org.codehaus.plexus.classworlds.launcher.Launcher.launchEnhanced (Launcher.java:289)
12:00:15 at org.codehaus.plexus.classworlds.launcher.Launcher.launch (Launcher.java:229)
12:00:15 at org.codehaus.plexus.classworlds.launcher.Launcher.mainWithExitCode (Launcher.java:415)
12:00:15 at org.codehaus.plexus.classworlds.launcher.Launcher.main (Launcher.java:356)
12:00:15 Caused by: org.apache.maven.plugin.compiler.CompilationFailureException: Compilation failure
12:00:15 /home/jenkins/workspace/KIE/Test-jobs/kieAllBuild-and-jboss-ip-bom-upgrade-Tests-04/errai/errai-jpa/errai-jpa-client/src/main/java/org/jboss/errai/jpa/rebind/ErraiEntityManagerGenerator.java:[39,25] cannot find symbol
12:00:15 symbol: class HibernatePersistence
12:00:15 location: package org.hibernate.ejb
12:00:15
12:00:15 at org.apache.maven.plugin.compiler.AbstractCompilerMojo.execute (AbstractCompilerMojo.java:1161)
12:00:15 at org.apache.maven.plugin.compiler.CompilerMojo.execute (CompilerMojo.java:168)
12:00:15 at org.apache.maven.plugin.DefaultBuildPluginManager.executeMojo (DefaultBuildPluginManager.java:137)
12:00:15 at org.apache.maven.lifecycle.internal.MojoExecutor.execute (MojoExecutor.java:208)
12:00:15 at org.apache.maven.lifecycle.internal.MojoExecutor.execute (MojoExecutor.java:154)
12:00:15 at org.apache.maven.lifecycle.internal.MojoExecutor.execute (MojoExecutor.java:146)
12:00:15 at org.apache.maven.lifecycle.internal.LifecycleModuleBuilder.buildProject (LifecycleModuleBuilder.java:117)
12:00:15 at org.apache.maven.lifecycle.internal.LifecycleModuleBuilder.buildProject (LifecycleModuleBuilder.java:81)
12:00:15 at org.apache.maven.lifecycle.internal.builder.singlethreaded.SingleThreadedBuilder.build (SingleThreadedBuilder.java:56)
12:00:15 at org.apache.maven.lifecycle.internal.LifecycleStarter.execute (LifecycleStarter.java:128)
12:00:15 at org.apache.maven.DefaultMaven.doExecute (DefaultMaven.java:305)
12:00:15 at org.apache.maven.DefaultMaven.doExecute (DefaultMaven.java:192)
12:00:15 at org.apache.maven.DefaultMaven.execute (DefaultMaven.java:105)
12:00:15 at org.apache.maven.cli.MavenCli.execute (MavenCli.java:954)
12:00:15 at org.apache.maven.cli.MavenCli.doMain (MavenCli.java:288)
12:00:15 at org.apache.maven.cli.MavenCli.main (MavenCli.java:192)
12:00:15 at sun.reflect.NativeMethodAccessorImpl.invoke0 (Native Method)
12:00:15 at sun.reflect.NativeMethodAccessorImpl.invoke (NativeMethodAccessorImpl.java:62)
12:00:15 at sun.reflect.DelegatingMethodAccessorImpl.invoke (DelegatingMethodAccessorImpl.java:43)
12:00:15 at java.lang.reflect.Method.invoke (Method.java:498)
12:00:15 at org.codehaus.plexus.classworlds.launcher.Launcher.launchEnhanced (Launcher.java:289)
12:00:15 at org.codehaus.plexus.classworlds.launcher.Launcher.launch (Launcher.java:229)
12:00:15 at org.codehaus.plexus.classworlds.launcher.Launcher.mainWithExitCode (Launcher.java:415)
12:00:15 at org.codehaus.plexus.classworlds.launcher.Launcher.main (Launcher.java:356)
12:00:15 [ERROR]
12:00:15 [ERROR] Re-run Maven using the -X switch to enable full debug logging.
12:00:15 [ERROR]
12:00:15 [ERROR] For more information about the errors and possible solutions, please read the following articles:
12:00:15 [ERROR] [Help 1] http://cwiki.apache.org/confluence/display/MAVEN/MojoFailureException
12:00:15 [ERROR]
12:00:15 [ERROR] After correcting the problems, you can resume the build with the command
12:00:15 [ERROR] mvn <goals> -rf :errai-jpa-client
12:00:15 Build step 'Execute shell' marked build as failure
12:00:15 Deleting 1 temporary files
12:00:15 Recording test results
12:00:15 Setting KIE_JDK1_8_HOME=/opt/tools/jdk1.8
12:00:15 Setting KIE_MAVEN_3_5_4_HOME=/opt/tools/apache-maven-3.5.4
12:00:19 Setting KIE_JDK1_8_HOME=/opt/tools/jdk1.8
12:00:19 Setting KIE_MAVEN_3_5_4_HOME=/opt/tools/apache-maven-3.5.4
12:00:19 Sending e-mails to: mbiarnes@redhat.com
12:00:33 Setting KIE_JDK1_8_HOME=/opt/tools/jdk1.8
12:00:33 Setting KIE_MAVEN_3_5_4_HOME=/opt/tools/apache-maven-3.5.4
12:00:33 [WS-CLEANUP] Deleting project workspace...[WS-CLEANUP] done
12:00:33 Finished: FAILURE
Sign up for free to join this conversation on GitHub. Already have an account? Sign in to comment
You can’t perform that action at this time.