Skip to content

Instantly share code, notes, and snippets.

Embed
What would you like to do?
[1/16] cd /home/nstgc5/Installers/llvm-git.aur/src/_build && /usr/bin/cmake -E make_directory /home/nstgc5/Installers/llvm-git.aur/src/_build/./lib/ocaml/llvm
[2/16] Running utility command for ocaml_llvm
[3/16] Running utility command for ocaml_llvm_irreader
[4/16] Running utility command for ocaml_llvm_bitwriter
[5/16] Running utility command for ocaml_llvm_linker
[6/16] Running utility command for ocaml_llvm_target
[7/16] Running utility command for ocaml_llvm_all_backends
[8/16] Running utility command for ocaml_llvm_analysis
[9/16] Running utility command for ocaml_llvm_bitreader
[10/16] Running utility command for ocaml_llvm_ipo
[11/16] Running utility command for ocaml_llvm_scalar_opts
[12/16] Running utility command for ocaml_llvm_passmgr_builder
[13/16] Running utility command for ocaml_llvm_transform_utils
[14/16] Running utility command for ocaml_llvm_executionengine
[15/16] Running utility command for ocaml_llvm_vectorize
[15/16] Running the LLVM regression tests
-- Testing: 36322 tests, 6 workers --
Testing: 0.. 10.. 20.. 30.. 40.. 50.. 60.. 70.. 80.. 90..
FAIL: LLVM :: tools/opt-viewer/suppress.test (36210 of 36322)
******************** TEST 'LLVM :: tools/opt-viewer/suppress.test' FAILED ********************
Script:
--
: 'RUN: at line 1'; /usr/bin/python /home/nstgc5/Installers/llvm-git.aur/src/llvm-project/llvm/tools/opt-viewer/opt-viewer.py -s /home/nstgc5/Installers/llvm-git.aur/src/llvm-project/llvm/test/tools/opt-viewer/Inputs/suppress -o /home/nstgc5/Installers/llvm-git.aur/src/_build/test/tools/opt-viewer/Output/suppress.test.tmp /home/nstgc5/Installers/llvm-git.aur/src/llvm-project/llvm/test/tools/opt-viewer/Inputs/suppress/s.opt.yaml --no-highlight --demangler=/home/nstgc5/Installers/llvm-git.aur/src/_build/bin/llvm-cxxfilt
: 'RUN: at line 2'; diff /home/nstgc5/Installers/llvm-git.aur/src/llvm-project/llvm/test/tools/opt-viewer/Outputs/suppress/index.html /home/nstgc5/Installers/llvm-git.aur/src/_build/test/tools/opt-viewer/Output/suppress.test.tmp/index.html
: 'RUN: at line 3'; diff /home/nstgc5/Installers/llvm-git.aur/src/llvm-project/llvm/test/tools/opt-viewer/Outputs/suppress/s.swift.html /home/nstgc5/Installers/llvm-git.aur/src/_build/test/tools/opt-viewer/Output/suppress.test.tmp/s.swift.html
--
Exit Code: 1
Command Output (stdout):
--
Reading YAML files...
1 of 1
Rendering index page...
--
Command Output (stderr):
--
Traceback (most recent call last):
File "/home/nstgc5/Installers/llvm-git.aur/src/llvm-project/llvm/tools/opt-viewer/opt-viewer.py", line 379, in <module>
main()
File "/home/nstgc5/Installers/llvm-git.aur/src/llvm-project/llvm/tools/opt-viewer/opt-viewer.py", line 368, in main
generate_report(all_remarks,
File "/home/nstgc5/Installers/llvm-git.aur/src/llvm-project/llvm/tools/opt-viewer/opt-viewer.py", line 284, in generate_report
IndexRenderer(output_dir, should_display_hotness, max_hottest_remarks_on_index).render(sorted_remarks)
File "/home/nstgc5/Installers/llvm-git.aur/src/llvm-project/llvm/tools/opt-viewer/opt-viewer.py", line 232, in render
self.render_entry(remark, i % 2)
File "/home/nstgc5/Installers/llvm-git.aur/src/llvm-project/llvm/tools/opt-viewer/opt-viewer.py", line 200, in render_entry
escaped_name = cgi.escape(r.DemangledFunctionName)
AttributeError: module 'cgi' has no attribute 'escape'
--
********************
Testing: 0.. 10.. 20.. 30.. 40.. 50.. 60.. 70.. 80.. 90..
FAIL: LLVM :: tools/opt-viewer/unicode-function-name.test (36211 of 36322)
******************** TEST 'LLVM :: tools/opt-viewer/unicode-function-name.test' FAILED ********************
Script:
--
: 'RUN: at line 1'; /usr/bin/python /home/nstgc5/Installers/llvm-git.aur/src/llvm-project/llvm/tools/opt-viewer/opt-viewer.py -s /home/nstgc5/Installers/llvm-git.aur/src/llvm-project/llvm/test/tools/opt-viewer/Inputs/unicode-function-name -o /home/nstgc5/Installers/llvm-git.aur/src/_build/test/tools/opt-viewer/Output/unicode-function-name.test.tmp /home/nstgc5/Installers/llvm-git.aur/src/llvm-project/llvm/test/tools/opt-viewer/Inputs/unicode-function-name/s.opt.yaml --no-highlight --demangler=/home/nstgc5/Installers/llvm-git.aur/src/_build/bin/llvm-cxxfilt
: 'RUN: at line 2'; diff /home/nstgc5/Installers/llvm-git.aur/src/llvm-project/llvm/test/tools/opt-viewer/Outputs/unicode-function-name/index.html /home/nstgc5/Installers/llvm-git.aur/src/_build/test/tools/opt-viewer/Output/unicode-function-name.test.tmp/index.html
: 'RUN: at line 3'; diff /home/nstgc5/Installers/llvm-git.aur/src/llvm-project/llvm/test/tools/opt-viewer/Outputs/unicode-function-name/s.swift.html /home/nstgc5/Installers/llvm-git.aur/src/_build/test/tools/opt-viewer/Output/unicode-function-name.test.tmp/s.swift.html
: 'RUN: at line 7'; /usr/bin/python /home/nstgc5/Installers/llvm-git.aur/src/llvm-project/llvm/tools/opt-viewer/opt-viewer.py -s /home/nstgc5/Installers/llvm-git.aur/src/llvm-project/llvm/test/tools/opt-viewer/Inputs/unicode-function-name -o /home/nstgc5/Installers/llvm-git.aur/src/_build/test/tools/opt-viewer/Output/unicode-function-name.test.tmp.unused /home/nstgc5/Installers/llvm-git.aur/src/llvm-project/llvm/test/tools/opt-viewer/Inputs/unicode-function-name/s.opt.yaml --demangler=/home/nstgc5/Installers/llvm-git.aur/src/_build/bin/llvm-cxxfilt
--
Exit Code: 1
Command Output (stdout):
--
Reading YAML files...
1 of 1
Rendering index page...
--
Command Output (stderr):
--
Traceback (most recent call last):
File "/home/nstgc5/Installers/llvm-git.aur/src/llvm-project/llvm/tools/opt-viewer/opt-viewer.py", line 379, in <module>
main()
File "/home/nstgc5/Installers/llvm-git.aur/src/llvm-project/llvm/tools/opt-viewer/opt-viewer.py", line 368, in main
generate_report(all_remarks,
File "/home/nstgc5/Installers/llvm-git.aur/src/llvm-project/llvm/tools/opt-viewer/opt-viewer.py", line 284, in generate_report
IndexRenderer(output_dir, should_display_hotness, max_hottest_remarks_on_index).render(sorted_remarks)
File "/home/nstgc5/Installers/llvm-git.aur/src/llvm-project/llvm/tools/opt-viewer/opt-viewer.py", line 232, in render
self.render_entry(remark, i % 2)
File "/home/nstgc5/Installers/llvm-git.aur/src/llvm-project/llvm/tools/opt-viewer/opt-viewer.py", line 200, in render_entry
escaped_name = cgi.escape(r.DemangledFunctionName)
AttributeError: module 'cgi' has no attribute 'escape'
--
********************
Testing: 0.. 10.. 20.. 30.. 40.. 50.. 60.. 70.. 80.. 90..
FAIL: LLVM :: tools/opt-viewer/basic.test (36212 of 36322)
******************** TEST 'LLVM :: tools/opt-viewer/basic.test' FAILED ********************
Script:
--
: 'RUN: at line 5'; /usr/bin/python /home/nstgc5/Installers/llvm-git.aur/src/llvm-project/llvm/tools/opt-viewer/opt-viewer.py -s /home/nstgc5/Installers/llvm-git.aur/src/llvm-project/llvm/test/tools/opt-viewer/Inputs -o /home/nstgc5/Installers/llvm-git.aur/src/_build/test/tools/opt-viewer/Output/basic.test.tmp /home/nstgc5/Installers/llvm-git.aur/src/llvm-project/llvm/test/tools/opt-viewer/Inputs/basic/or.yaml --no-highlight --demangler=/home/nstgc5/Installers/llvm-git.aur/src/_build/bin/llvm-cxxfilt
: 'RUN: at line 6'; diff /home/nstgc5/Installers/llvm-git.aur/src/llvm-project/llvm/test/tools/opt-viewer/Outputs/basic/index.html /home/nstgc5/Installers/llvm-git.aur/src/_build/test/tools/opt-viewer/Output/basic.test.tmp/index.html
: 'RUN: at line 7'; diff /home/nstgc5/Installers/llvm-git.aur/src/llvm-project/llvm/test/tools/opt-viewer/Outputs/basic/basic_or.h.html /home/nstgc5/Installers/llvm-git.aur/src/_build/test/tools/opt-viewer/Output/basic.test.tmp/basic_or.h.html
: 'RUN: at line 8'; diff /home/nstgc5/Installers/llvm-git.aur/src/llvm-project/llvm/test/tools/opt-viewer/Outputs/basic/basic_or.c.html /home/nstgc5/Installers/llvm-git.aur/src/_build/test/tools/opt-viewer/Output/basic.test.tmp/basic_or.c.html
: 'RUN: at line 9'; ls /home/nstgc5/Installers/llvm-git.aur/src/_build/test/tools/opt-viewer/Output/basic.test.tmp/style.css
--
Exit Code: 1
Command Output (stdout):
--
Reading YAML files...
1 of 1
Rendering index page...
--
Command Output (stderr):
--
Traceback (most recent call last):
File "/home/nstgc5/Installers/llvm-git.aur/src/llvm-project/llvm/tools/opt-viewer/opt-viewer.py", line 379, in <module>
main()
File "/home/nstgc5/Installers/llvm-git.aur/src/llvm-project/llvm/tools/opt-viewer/opt-viewer.py", line 368, in main
generate_report(all_remarks,
File "/home/nstgc5/Installers/llvm-git.aur/src/llvm-project/llvm/tools/opt-viewer/opt-viewer.py", line 284, in generate_report
IndexRenderer(output_dir, should_display_hotness, max_hottest_remarks_on_index).render(sorted_remarks)
File "/home/nstgc5/Installers/llvm-git.aur/src/llvm-project/llvm/tools/opt-viewer/opt-viewer.py", line 232, in render
self.render_entry(remark, i % 2)
File "/home/nstgc5/Installers/llvm-git.aur/src/llvm-project/llvm/tools/opt-viewer/opt-viewer.py", line 200, in render_entry
escaped_name = cgi.escape(r.DemangledFunctionName)
AttributeError: module 'cgi' has no attribute 'escape'
--
********************
Testing: 0.. 10.. 20.. 30.. 40.. 50.. 60.. 70.. 80.. 90..
FAIL: LLVM :: tools/opt-viewer/filter.test (36213 of 36322)
******************** TEST 'LLVM :: tools/opt-viewer/filter.test' FAILED ********************
Script:
--
: 'RUN: at line 5'; /usr/bin/python /home/nstgc5/Installers/llvm-git.aur/src/llvm-project/llvm/tools/opt-viewer/opt-viewer.py --filter inline -s /home/nstgc5/Installers/llvm-git.aur/src/llvm-project/llvm/test/tools/opt-viewer/Inputs -o /home/nstgc5/Installers/llvm-git.aur/src/_build/test/tools/opt-viewer/Output/filter.test.tmp /home/nstgc5/Installers/llvm-git.aur/src/llvm-project/llvm/test/tools/opt-viewer/Inputs/basic/or.yaml --no-highlight --demangler=/home/nstgc5/Installers/llvm-git.aur/src/_build/bin/llvm-cxxfilt
: 'RUN: at line 6'; diff /home/nstgc5/Installers/llvm-git.aur/src/llvm-project/llvm/test/tools/opt-viewer/Outputs/filter/index.html /home/nstgc5/Installers/llvm-git.aur/src/_build/test/tools/opt-viewer/Output/filter.test.tmp/index.html
: 'RUN: at line 7'; diff /home/nstgc5/Installers/llvm-git.aur/src/llvm-project/llvm/test/tools/opt-viewer/Outputs/filter/basic_or.h.html /home/nstgc5/Installers/llvm-git.aur/src/_build/test/tools/opt-viewer/Output/filter.test.tmp/basic_or.h.html
: 'RUN: at line 8'; diff /home/nstgc5/Installers/llvm-git.aur/src/llvm-project/llvm/test/tools/opt-viewer/Outputs/filter/basic_or.c.html /home/nstgc5/Installers/llvm-git.aur/src/_build/test/tools/opt-viewer/Output/filter.test.tmp/basic_or.c.html
--
Exit Code: 1
Command Output (stdout):
--
Reading YAML files...
1 of 1
Rendering index page...
--
Command Output (stderr):
--
Traceback (most recent call last):
File "/home/nstgc5/Installers/llvm-git.aur/src/llvm-project/llvm/tools/opt-viewer/opt-viewer.py", line 379, in <module>
main()
File "/home/nstgc5/Installers/llvm-git.aur/src/llvm-project/llvm/tools/opt-viewer/opt-viewer.py", line 368, in main
generate_report(all_remarks,
File "/home/nstgc5/Installers/llvm-git.aur/src/llvm-project/llvm/tools/opt-viewer/opt-viewer.py", line 284, in generate_report
IndexRenderer(output_dir, should_display_hotness, max_hottest_remarks_on_index).render(sorted_remarks)
File "/home/nstgc5/Installers/llvm-git.aur/src/llvm-project/llvm/tools/opt-viewer/opt-viewer.py", line 232, in render
self.render_entry(remark, i % 2)
File "/home/nstgc5/Installers/llvm-git.aur/src/llvm-project/llvm/tools/opt-viewer/opt-viewer.py", line 200, in render_entry
escaped_name = cgi.escape(r.DemangledFunctionName)
AttributeError: module 'cgi' has no attribute 'escape'
--
********************
Testing: 0.. 10.. 20.. 30.. 40.. 50.. 60.. 70.. 80.. 90..
Testing Time: 377.57s
********************
Failing Tests (4):
LLVM :: tools/opt-viewer/basic.test
LLVM :: tools/opt-viewer/filter.test
LLVM :: tools/opt-viewer/suppress.test
LLVM :: tools/opt-viewer/unicode-function-name.test
Expected Passes : 35006
Expected Failures : 156
Unsupported Tests : 1156
Unexpected Failures: 4
FAILED: test/CMakeFiles/check-llvm
cd /home/nstgc5/Installers/llvm-git.aur/src/_build/test && /usr/bin/python /home/nstgc5/Installers/llvm-git.aur/src/_build/./bin/llvm-lit -sv /home/nstgc5/Installers/llvm-git.aur/src/_build/test
ninja: build stopped: subcommand failed.
==> ERROR:(B A failure occurred in check().(B
 Aborting...(B
==>(B Removing installed dependencies...(B
sudo: timed out reading password
==> WARNING:(B Failed to remove installed dependencies.(B
Sign up for free to join this conversation on GitHub. Already have an account? Sign in to comment