Skip to content

Instantly share code, notes, and snippets.

@nvandoorn nvandoorn/nice.log
Created Sep 6, 2018

Embed
What would you like to do?
[79/783] Build kernel driver module
FAILED: make -C /home/nick/Documents/BRNKL-base/legato/build/wp76xx/system/modules/spisvc
make[1]: Entering directory '/home/nick/Documents/BRNKL-base/legato/build/wp76xx/system/modules/spisvc'
make -C /opt/swi/SWI9X07Y_02.16.02.00/sysroots/armv7a-neon-poky-linux-gnueabi/usr/src/kernel M=/home/nick/Documents/BRNKL-base/legato/build/wp76xx/system/modules/spisvc modules
make[2]: Entering directory '/opt/swi/SWI9X07Y_02.16.02.00/sysroots/armv7a-neon-poky-linux-gnueabi/usr/src/kernel'
CC [M] /home/nick/Documents/BRNKL-base/legato/build/wp76xx/system/modules/spisvc/spisvc.o
Building modules, stage 2.
MODPOST 1 modules
/bin/sh: scripts/mod/modpost: No such file or directory
scripts/Makefile.modpost:91: recipe for target '__modpost' failed
make[3]: *** [__modpost] Error 127
Makefile:1403: recipe for target 'modules' failed
make[2]: *** [modules] Error 2
make[2]: Leaving directory '/opt/swi/SWI9X07Y_02.16.02.00/sysroots/armv7a-neon-poky-linux-gnueabi/usr/src/kernel'
Makefile:11: recipe for target 'all' failed
make[1]: *** [all] Error 2
make[1]: Leaving directory '/home/nick/Documents/BRNKL-base/legato/build/wp76xx/system/modules/spisvc'
[79/783] Compiling C source
ninja: build stopped: subcommand failed.
Makefile:603: recipe for target 'system_wp76xx' failed
make: *** [system_wp76xx] Error 1
Sign up for free to join this conversation on GitHub. Already have an account? Sign in to comment
You can’t perform that action at this time.