Skip to content

Instantly share code, notes, and snippets.

@ober
Created Apr 6, 2021
Embed
What would you like to do?
gambit master boom: trave view
-*- mode: compilation; default-directory: "~/src/gerbil-docker/" -*-
Compilation started at Mon Apr 5 20:55:01
cd ~/src/gerbil-docker/ && make alpine-current-static
docker build -t alpine-current-static ./alpine-current-static
Sending build context to Docker daemon 3.584kB
Step 1/28 : FROM alpine:latest
---> 28f6e2705743
Step 2/28 : ARG GAMBIT_VERSION=master
---> Using cache
---> e2cf9243a75a
Step 3/28 : ARG GERBIL_VERSION=master
---> Using cache
---> b77ea1af9367
Step 4/28 : ENV GAMBIT_HOME=/opt/gerbil
---> Using cache
---> 9cab21f0da7c
Step 5/28 : ENV GERBIL_HOME=/opt/gerbil
---> Using cache
---> 44c8f8764507
Step 6/28 : ENV GERBIL_PATH=/src/.gerbil
---> Using cache
---> f795ee208fdc
Step 7/28 : ENV PATH=${GAMBIT_HOME}/bin:${GERBIL_HOME}/bin:/bin:/sbin:/usr/bin:/usr/sbin
---> Using cache
---> 39b41177b8ef
Step 8/28 : ENV GERBIL_BUILD_CORES=4
---> Using cache
---> baa2ad8bec9c
Step 9/28 : RUN mkdir -p /src /opt
---> Using cache
---> 8031fca85073
Step 10/28 : RUN apk update && apk add autoconf automake curl gcc git leveldb leveldb-dev libgcc libtool libxml2-dev linux-headers lmdb-dev make mariadb-dev musl musl-dev openssl-dev openssl-libs-static sqlite-dev yaml-dev yaml-static zlib-static
---> Using cache
---> 63c550e923d2
Step 11/28 : RUN git config --global url.https://github.com/.insteadOf git://github.com/
---> Using cache
---> 6cf4492ec485
Step 12/28 : RUN cd /opt && git clone https://github.com/gambit/gambit gambit-src
---> Using cache
---> 52db9a128d24
Step 13/28 : RUN cd /opt/gambit-src && git fetch -a
---> Using cache
---> 245fe47515c6
Step 14/28 : RUN cd /opt/gambit-src && sed -i -e 's#SSL_VERIFY_PEER#SSL_VERIFY_NONE#g' lib/os_io.c && ./configure --enable-default-runtime-options=f8,-8,t8 --enable-multiple-threaded-vms --enable-multiple-versions --enable-openssl --enable-poll --enable-single-host --enable-smp --prefix=${GAMBIT_HOME}
---> Using cache
---> 4aec1662bf36
Step 15/28 : RUN cd /opt/gambit-src && make -j4
---> Using cache
---> de381f1011bf
Step 16/28 : RUN cd /opt/gambit-src && make bootstrap
---> Using cache
---> 0457a1b3abb8
Step 17/28 : RUN cd /opt/gambit-src && make bootclean
---> Using cache
---> 0c02ac68d632
Step 18/28 : RUN cd /opt/gambit-src && make --trace -d #-j4
---> Running in 75ff82a4abef
GNU Make 4.3
Built for x86_64-alpine-linux-musl
Copyright (C) 1988-2020 Free Software Foundation, Inc.
License GPLv3+: GNU GPL version 3 or later <http://gnu.org/licenses/gpl.html>
This is free software: you are free to change and redistribute it.
There is NO WARRANTY, to the extent permitted by law.
Reading makefiles...
Reading makefile 'makefile'...
Updating makefiles....
Considering target file 'makefile'.
Considering target file 'makefile.in'.
Looking for an implicit rule for 'makefile.in'.
Trying pattern rule with stem 'makefile.in'.
Trying implicit prerequisite 'makefile.in,v'.
Trying pattern rule with stem 'makefile.in'.
Trying implicit prerequisite 'RCS/makefile.in,v'.
Trying pattern rule with stem 'makefile.in'.
Trying implicit prerequisite 'RCS/makefile.in'.
Trying pattern rule with stem 'makefile.in'.
Trying implicit prerequisite 's.makefile.in'.
Trying pattern rule with stem 'makefile.in'.
Trying implicit prerequisite 'SCCS/s.makefile.in'.
No implicit rule found for 'makefile.in'.
Finished prerequisites of target file 'makefile.in'.
No need to remake target 'makefile.in'.
Considering target file 'config.status'.
Considering target file 'configure'.
Considering target file 'configure.ac'.
Looking for an implicit rule for 'configure.ac'.
Trying pattern rule with stem 'configure.ac'.
Trying implicit prerequisite 'configure.ac,v'.
Trying pattern rule with stem 'configure.ac'.
Trying implicit prerequisite 'RCS/configure.ac,v'.
Trying pattern rule with stem 'configure.ac'.
Trying implicit prerequisite 'RCS/configure.ac'.
Trying pattern rule with stem 'configure.ac'.
Trying implicit prerequisite 's.configure.ac'.
Trying pattern rule with stem 'configure.ac'.
Trying implicit prerequisite 'SCCS/s.configure.ac'.
No implicit rule found for 'configure.ac'.
Finished prerequisites of target file 'configure.ac'.
No need to remake target 'configure.ac'.
Finished prerequisites of target file 'configure'.
Prerequisite 'configure.ac' is older than target 'configure'.
No need to remake target 'configure'.
Finished prerequisites of target file 'config.status'.
Prerequisite 'configure' is older than target 'config.status'.
No need to remake target 'config.status'.
Finished prerequisites of target file 'makefile'.
Prerequisite 'makefile.in' is older than target 'makefile'.
Prerequisite 'config.status' is older than target 'makefile'.
No need to remake target 'makefile'.
Updating goal targets....
Considering target file 'all'.
File 'all' does not exist.
Looking for an implicit rule for 'all'.
Trying pattern rule with stem 'all'.
Trying implicit prerequisite 'all,v'.
Trying pattern rule with stem 'all'.
Trying implicit prerequisite 'RCS/all,v'.
Trying pattern rule with stem 'all'.
Trying implicit prerequisite 'RCS/all'.
Trying pattern rule with stem 'all'.
Trying implicit prerequisite 's.all'.
Trying pattern rule with stem 'all'.
Trying implicit prerequisite 'SCCS/s.all'.
No implicit rule found for 'all'.
Considering target file 'all-post'.
File 'all-post' does not exist.
Considering target file 'all-recursive'.
File 'all-recursive' does not exist.
Considering target file 'all-pre'.
File 'all-pre' does not exist.
Considering target file 'gsc-boot'.
Finished prerequisites of target file 'gsc-boot'.
No need to remake target 'gsc-boot'.
Finished prerequisites of target file 'all-pre'.
Must remake target 'all-pre'.
makefile:109: update target 'all-pre' due to: gsc-boot
make stamp
Putting child 0x7f818f002e70 (all-pre) PID 6 on the chain.
Live child 0x7f818f002e70 (all-pre) PID 6
GNU Make 4.3
Built for x86_64-alpine-linux-musl
Copyright (C) 1988-2020 Free Software Foundation, Inc.
License GPLv3+: GNU GPL version 3 or later <http://gnu.org/licenses/gpl.html>
This is free software: you are free to change and redistribute it.
There is NO WARRANTY, to the extent permitted by law.
Reading makefiles...
Reading makefile 'makefile'...
Updating makefiles....
Considering target file 'makefile'.
Considering target file 'makefile.in'.
Looking for an implicit rule for 'makefile.in'.
Trying pattern rule with stem 'makefile.in'.
Trying implicit prerequisite 'makefile.in,v'.
Trying pattern rule with stem 'makefile.in'.
Trying implicit prerequisite 'RCS/makefile.in,v'.
Trying pattern rule with stem 'makefile.in'.
Trying implicit prerequisite 'RCS/makefile.in'.
Trying pattern rule with stem 'makefile.in'.
Trying implicit prerequisite 's.makefile.in'.
Trying pattern rule with stem 'makefile.in'.
Trying implicit prerequisite 'SCCS/s.makefile.in'.
No implicit rule found for 'makefile.in'.
Finished prerequisites of target file 'makefile.in'.
No need to remake target 'makefile.in'.
Considering target file 'config.status'.
Considering target file 'configure'.
Considering target file 'configure.ac'.
Looking for an implicit rule for 'configure.ac'.
Trying pattern rule with stem 'configure.ac'.
Trying implicit prerequisite 'configure.ac,v'.
Trying pattern rule with stem 'configure.ac'.
Trying implicit prerequisite 'RCS/configure.ac,v'.
Trying pattern rule with stem 'configure.ac'.
Trying implicit prerequisite 'RCS/configure.ac'.
Trying pattern rule with stem 'configure.ac'.
Trying implicit prerequisite 's.configure.ac'.
Trying pattern rule with stem 'configure.ac'.
Trying implicit prerequisite 'SCCS/s.configure.ac'.
No implicit rule found for 'configure.ac'.
Finished prerequisites of target file 'configure.ac'.
No need to remake target 'configure.ac'.
Finished prerequisites of target file 'configure'.
Prerequisite 'configure.ac' is older than target 'configure'.
No need to remake target 'configure'.
Finished prerequisites of target file 'config.status'.
Prerequisite 'configure' is older than target 'config.status'.
No need to remake target 'config.status'.
Finished prerequisites of target file 'makefile'.
Prerequisite 'makefile.in' is older than target 'makefile'.
Prerequisite 'config.status' is older than target 'makefile'.
No need to remake target 'makefile'.
Updating goal targets....
Considering target file 'stamp'.
File 'stamp' does not exist.
Considering target file 'fake_target'.
File 'fake_target' does not exist.
Looking for an implicit rule for 'fake_target'.
Trying pattern rule with stem 'fake_target'.
Trying implicit prerequisite 'fake_target,v'.
Trying pattern rule with stem 'fake_target'.
Trying implicit prerequisite 'RCS/fake_target,v'.
Trying pattern rule with stem 'fake_target'.
Trying implicit prerequisite 'RCS/fake_target'.
Trying pattern rule with stem 'fake_target'.
Trying implicit prerequisite 's.fake_target'.
Trying pattern rule with stem 'fake_target'.
Trying implicit prerequisite 'SCCS/s.fake_target'.
No implicit rule found for 'fake_target'.
Finished prerequisites of target file 'fake_target'.
Must remake target 'fake_target'.
Successfully remade target file 'fake_target'.
Finished prerequisites of target file 'stamp'.
Must remake target 'stamp'.
make[1]: Entering directory '/opt/gambit-src'
makefile:224: update target 'stamp' due to: fake_target
cd include && make prefix="/opt/gerbil/v4.9.3" exec_prefix="/opt/gerbil/v4.9.3" includedir="/opt/gerbil/v4.9.3/include" libdir="/opt/gerbil/v4.9.3/lib" bindir="/opt/gerbil/v4.9.3/bin" docdir="/opt/gerbil/v4.9.3/doc" infodir="/opt/gerbil/v4.9.3/info" emacsdir="/opt/gerbil/v4.9.3/share/emacs/site-lisp" stamp
Putting child 0x7f04ce552900 (stamp) PID 7 on the chain.
Live child 0x7f04ce552900 (stamp) PID 7
GNU Make 4.3
Built for x86_64-alpine-linux-musl
Copyright (C) 1988-2020 Free Software Foundation, Inc.
License GPLv3+: GNU GPL version 3 or later <http://gnu.org/licenses/gpl.html>
This is free software: you are free to change and redistribute it.
There is NO WARRANTY, to the extent permitted by law.
Reading makefiles...
Reading makefile 'makefile'...
Updating makefiles....
Considering target file 'makefile'.
Considering target file 'makefile.in'.
Looking for an implicit rule for 'makefile.in'.
Trying pattern rule with stem 'makefile.in'.
Trying implicit prerequisite 'makefile.in,v'.
Trying pattern rule with stem 'makefile.in'.
Trying implicit prerequisite 'RCS/makefile.in,v'.
Trying pattern rule with stem 'makefile.in'.
Trying implicit prerequisite 'RCS/makefile.in'.
Trying pattern rule with stem 'makefile.in'.
Trying implicit prerequisite 's.makefile.in'.
Trying pattern rule with stem 'makefile.in'.
Trying implicit prerequisite 'SCCS/s.makefile.in'.
No implicit rule found for 'makefile.in'.
Finished prerequisites of target file 'makefile.in'.
No need to remake target 'makefile.in'.
Considering target file '../config.status'.
Looking for an implicit rule for '../config.status'.
Trying pattern rule with stem 'config.status'.
Trying implicit prerequisite '../config.status,v'.
Trying pattern rule with stem 'config.status'.
Trying implicit prerequisite '../RCS/config.status,v'.
Trying pattern rule with stem 'config.status'.
Trying implicit prerequisite '../RCS/config.status'.
Trying pattern rule with stem 'config.status'.
Trying implicit prerequisite '../s.config.status'.
Trying pattern rule with stem 'config.status'.
Trying implicit prerequisite '../SCCS/s.config.status'.
No implicit rule found for '../config.status'.
Finished prerequisites of target file '../config.status'.
No need to remake target '../config.status'.
Finished prerequisites of target file 'makefile'.
Prerequisite 'makefile.in' is older than target 'makefile'.
Prerequisite '../config.status' is older than target 'makefile'.
No need to remake target 'makefile'.
Updating goal targets....
Considering target file 'stamp'.
File 'stamp' does not exist.
Finished prerequisites of target file 'stamp'.
Must remake target 'stamp'.
make[2]: Entering directory '/opt/gambit-src/include'
makefile:300: target 'stamp' does not exist
cp stamp.h stamp2.h; \
stamp_version=\"v4.9.3\"; \
if [ -e ../.git ]; then \
stamp_version=\"`git describe --tag --always 2> /dev/null | sed -e s/-bootstrap$//`\"; \
fi; \
if fgrep "#define ___STAMP_VERSION $stamp_version" stamp.h > /dev/null; then \
echo "*** include/stamp.h untouched (___STAMP_VERSION did not change)"; \
else \
echo "*** include/stamp.h updated to have ___STAMP_VERSION=$stamp_version"; \
eval `date -u '+stamp_ymd=%Y%m%d stamp_hms=%H%M%S'`; \
sed -e "s/#define ___STAMP_YMD [0-9][0-9]*/#define ___STAMP_YMD `expr 0 + $stamp_ymd`/" -e "s/#define ___STAMP_HMS [0-9][0-9]*/#define ___STAMP_HMS `expr 0 + $stamp_hms`/" -e "s/#define ___STAMP_VERSION .*/#define ___STAMP_VERSION $stamp_version/" stamp.h > stamp2.h; \
mv stamp2.h stamp.h; \
fi
Putting child 0x7ff3615e1770 (stamp) PID 8 on the chain.
Live child 0x7ff3615e1770 (stamp) PID 8
*** include/stamp.h untouched (___STAMP_VERSION did not change)
Reaping winning child 0x7ff3615e1770 PID 8
Removing child 0x7ff3615e1770 PID 8 from chain.
Successfully remade target file 'stamp'.
make[2]: Leaving directory '/opt/gambit-src/include'
Reaping winning child 0x7f04ce552900 PID 7
Removing child 0x7f04ce552900 PID 7 from chain.
Successfully remade target file 'stamp'.
make[1]: Leaving directory '/opt/gambit-src'
Reaping winning child 0x7f818f002e70 PID 6
if echo "MAKEFLAGS: d --trace" | fgrep -e "--jobserver-fds="; then \
make phases; \
fi
Live child 0x7f818f002e70 (all-pre) PID 14
Reaping winning child 0x7f818f002e70 PID 14
Removing child 0x7f818f002e70 PID 14 from chain.
Successfully remade target file 'all-pre'.
Finished prerequisites of target file 'all-recursive'.
Must remake target 'all-recursive'.
makefile:534: update target 'all-recursive' due to: all-pre
for subdir in include bin lib gsi gsc misc doc tests examples contrib prebuilt bench githooks; do \
target=`echo all-recursive | sed 's/-recursive//'`; \
echo making $target in $subdir; \
(cd $subdir && make $target) || exit 1; \
done
Putting child 0x7f818f002e70 (all-recursive) PID 17 on the chain.
Live child 0x7f818f002e70 (all-recursive) PID 17
making all in include
GNU Make 4.3
Built for x86_64-alpine-linux-musl
Copyright (C) 1988-2020 Free Software Foundation, Inc.
License GPLv3+: GNU GPL version 3 or later <http://gnu.org/licenses/gpl.html>
This is free software: you are free to change and redistribute it.
There is NO WARRANTY, to the extent permitted by law.
Reading makefiles...
Reading makefile 'makefile'...
Updating makefiles....
Considering target file 'makefile'.
Considering target file 'makefile.in'.
Looking for an implicit rule for 'makefile.in'.
Trying pattern rule with stem 'makefile.in'.
Trying implicit prerequisite 'makefile.in,v'.
Trying pattern rule with stem 'makefile.in'.
Trying implicit prerequisite 'RCS/makefile.in,v'.
Trying pattern rule with stem 'makefile.in'.
Trying implicit prerequisite 'RCS/makefile.in'.
Trying pattern rule with stem 'makefile.in'.
Trying implicit prerequisite 's.makefile.in'.
Trying pattern rule with stem 'makefile.in'.
Trying implicit prerequisite 'SCCS/s.makefile.in'.
No implicit rule found for 'makefile.in'.
Finished prerequisites of target file 'makefile.in'.
No need to remake target 'makefile.in'.
Considering target file '../config.status'.
Looking for an implicit rule for '../config.status'.
Trying pattern rule with stem 'config.status'.
Trying implicit prerequisite '../config.status,v'.
Trying pattern rule with stem 'config.status'.
Trying implicit prerequisite '../RCS/config.status,v'.
Trying pattern rule with stem 'config.status'.
Trying implicit prerequisite '../RCS/config.status'.
Trying pattern rule with stem 'config.status'.
Trying implicit prerequisite '../s.config.status'.
Trying pattern rule with stem 'config.status'.
Trying implicit prerequisite '../SCCS/s.config.status'.
No implicit rule found for '../config.status'.
Finished prerequisites of target file '../config.status'.
No need to remake target '../config.status'.
Finished prerequisites of target file 'makefile'.
Prerequisite 'makefile.in' is older than target 'makefile'.
Prerequisite '../config.status' is older than target 'makefile'.
No need to remake target 'makefile'.
Updating goal targets....
Considering target file 'all'.
File 'all' does not exist.
Looking for an implicit rule for 'all'.
Trying pattern rule with stem 'all'.
Trying implicit prerequisite 'all,v'.
Trying pattern rule with stem 'all'.
Trying implicit prerequisite 'RCS/all,v'.
Trying pattern rule with stem 'all'.
Trying implicit prerequisite 'RCS/all'.
Trying pattern rule with stem 'all'.
Trying implicit prerequisite 's.all'.
Trying pattern rule with stem 'all'.
Trying implicit prerequisite 'SCCS/s.all'.
No implicit rule found for 'all'.
Considering target file 'all-post'.
File 'all-post' does not exist.
Looking for an implicit rule for 'all-post'.
Trying pattern rule with stem 'all-post'.
Trying implicit prerequisite 'all-post,v'.
Trying pattern rule with stem 'all-post'.
Trying implicit prerequisite 'RCS/all-post,v'.
Trying pattern rule with stem 'all-post'.
Trying implicit prerequisite 'RCS/all-post'.
Trying pattern rule with stem 'all-post'.
Trying implicit prerequisite 's.all-post'.
Trying pattern rule with stem 'all-post'.
Trying implicit prerequisite 'SCCS/s.all-post'.
No implicit rule found for 'all-post'.
Considering target file 'gambit.h'.
Considering target file 'gambit.h.in'.
Looking for an implicit rule for 'gambit.h.in'.
Trying pattern rule with stem 'gambit.h.in'.
Trying implicit prerequisite 'gambit.h.in,v'.
Trying pattern rule with stem 'gambit.h.in'.
Trying implicit prerequisite 'RCS/gambit.h.in,v'.
Trying pattern rule with stem 'gambit.h.in'.
Trying implicit prerequisite 'RCS/gambit.h.in'.
Trying pattern rule with stem 'gambit.h.in'.
Trying implicit prerequisite 's.gambit.h.in'.
Trying pattern rule with stem 'gambit.h.in'.
Trying implicit prerequisite 'SCCS/s.gambit.h.in'.
No implicit rule found for 'gambit.h.in'.
Finished prerequisites of target file 'gambit.h.in'.
No need to remake target 'gambit.h.in'.
Considering target file '../config.status'.
File '../config.status' was considered already.
Finished prerequisites of target file 'gambit.h'.
Prerequisite 'gambit.h.in' is older than target 'gambit.h'.
Prerequisite '../config.status' is older than target 'gambit.h'.
No need to remake target 'gambit.h'.
Considering target file 'all-recursive'.
File 'all-recursive' does not exist.
Considering target file 'all-pre'.
File 'all-pre' does not exist.
Finished prerequisites of target file 'all-pre'.
Must remake target 'all-pre'.
make[1]: Entering directory '/opt/gambit-src/include'
makefile:82: target 'all-pre' does not exist
major=`echo v4.9.3 | sed -e "s/v//g" -e "s/\.[^.]*\.[^.]*//g"`; \
minor=`echo v4.9.3 | sed -e "s/v[^.]*\.//g" -e "s/\.[^.]*//g"`; \
revision=`echo v4.9.3 | sed -e "s/v[^.]*\.[^.]*\.//g" -e "s///g"`; \
version_num=`eval expr "\( 100000 \\* $major \) + \( 1000 \\* $minor \) + $revision"`; \
echo "#error \"The version indicated in ___VERSION is not supported by gambit.h\"" > gambit-not$version_num.h; \
echo "#error \"You are probably compiling C code generated by a Gambit compiler earlier or later than v4.9.3\"" >> gambit-not$version_num.h; \
echo "#error \"___VERSION will be set to $version_num to reduce other errors\"" >> gambit-not$version_num.h; \
echo "#undef ___VERSION" >> gambit-not$version_num.h; \
echo "#define ___VERSION $version_num" >> gambit-not$version_num.h; \
echo "#include \"gambit.h\"" >> gambit-not$version_num.h
Putting child 0x7fc1cbb4c2d0 (all-pre) PID 22 on the chain.
Live child 0x7fc1cbb4c2d0 (all-pre) PID 22
Reaping winning child 0x7fc1cbb4c2d0 PID 22
Removing child 0x7fc1cbb4c2d0 PID 22 from chain.
Successfully remade target file 'all-pre'.
Finished prerequisites of target file 'all-recursive'.
Must remake target 'all-recursive'.
makefile:207: update target 'all-recursive' due to: all-pre
if test -n ""; then \
for subdir in ""; do \
target=`echo all-recursive | sed 's/-recursive//'`; \
echo making $target in $subdir; \
(cd $subdir && make $target) || exit 1; \
done \
fi
Putting child 0x7fc1cbb4c390 (all-recursive) PID 34 on the chain.
Live child 0x7fc1cbb4c390 (all-recursive) PID 34
Reaping winning child 0x7fc1cbb4c390 PID 34
Removing child 0x7fc1cbb4c390 PID 34 from chain.
Successfully remade target file 'all-recursive'.
Finished prerequisites of target file 'all-post'.
Must remake target 'all-post'.
Successfully remade target file 'all-post'.
Finished prerequisites of target file 'all'.
Must remake target 'all'.
Successfully remade target file 'all'.
make[1]: Leaving directory '/opt/gambit-src/include'
making all in bin
GNU Make 4.3
Built for x86_64-alpine-linux-musl
Copyright (C) 1988-2020 Free Software Foundation, Inc.
License GPLv3+: GNU GPL version 3 or later <http://gnu.org/licenses/gpl.html>
This is free software: you are free to change and redistribute it.
There is NO WARRANTY, to the extent permitted by law.
Reading makefiles...
Reading makefile 'makefile'...
Updating makefiles....
Considering target file 'makefile'.
Considering target file 'makefile.in'.
Looking for an implicit rule for 'makefile.in'.
Trying pattern rule with stem 'makefile.in'.
Trying implicit prerequisite 'makefile.in,v'.
Trying pattern rule with stem 'makefile.in'.
Trying implicit prerequisite 'RCS/makefile.in,v'.
Trying pattern rule with stem 'makefile.in'.
Trying implicit prerequisite 'RCS/makefile.in'.
Trying pattern rule with stem 'makefile.in'.
Trying implicit prerequisite 's.makefile.in'.
Trying pattern rule with stem 'makefile.in'.
Trying implicit prerequisite 'SCCS/s.makefile.in'.
No implicit rule found for 'makefile.in'.
Finished prerequisites of target file 'makefile.in'.
No need to remake target 'makefile.in'.
Considering target file '../config.status'.
Looking for an implicit rule for '../config.status'.
Trying pattern rule with stem 'config.status'.
Trying implicit prerequisite '../config.status,v'.
Trying pattern rule with stem 'config.status'.
Trying implicit prerequisite '../RCS/config.status,v'.
Trying pattern rule with stem 'config.status'.
Trying implicit prerequisite '../RCS/config.status'.
Trying pattern rule with stem 'config.status'.
Trying implicit prerequisite '../s.config.status'.
Trying pattern rule with stem 'config.status'.
Trying implicit prerequisite '../SCCS/s.config.status'.
No implicit rule found for '../config.status'.
Finished prerequisites of target file '../config.status'.
No need to remake target '../config.status'.
Finished prerequisites of target file 'makefile'.
Prerequisite 'makefile.in' is older than target 'makefile'.
Prerequisite '../config.status' is older than target 'makefile'.
No need to remake target 'makefile'.
Updating goal targets....
Considering target file 'all'.
File 'all' does not exist.
Looking for an implicit rule for 'all'.
Trying pattern rule with stem 'all'.
Trying implicit prerequisite 'all,v'.
Trying pattern rule with stem 'all'.
Trying implicit prerequisite 'RCS/all,v'.
Trying pattern rule with stem 'all'.
Trying implicit prerequisite 'RCS/all'.
Trying pattern rule with stem 'all'.
Trying implicit prerequisite 's.all'.
Trying pattern rule with stem 'all'.
Trying implicit prerequisite 'SCCS/s.all'.
No implicit rule found for 'all'.
Considering target file 'all-post'.
File 'all-post' does not exist.
Looking for an implicit rule for 'all-post'.
Trying pattern rule with stem 'all-post'.
Trying implicit prerequisite 'all-post,v'.
Trying pattern rule with stem 'all-post'.
Trying implicit prerequisite 'RCS/all-post,v'.
Trying pattern rule with stem 'all-post'.
Trying implicit prerequisite 'RCS/all-post'.
Trying pattern rule with stem 'all-post'.
Trying implicit prerequisite 's.all-post'.
Trying pattern rule with stem 'all-post'.
Trying implicit prerequisite 'SCCS/s.all-post'.
No implicit rule found for 'all-post'.
Considering target file 'gambvcs'.
Considering target file 'makefile'.
File 'makefile' was considered already.
Considering target file 'gambvcs.unix'.
Looking for an implicit rule for 'gambvcs.unix'.
Trying pattern rule with stem 'gambvcs.unix'.
Trying implicit prerequisite 'gambvcs.unix,v'.
Trying pattern rule with stem 'gambvcs.unix'.
Trying implicit prerequisite 'RCS/gambvcs.unix,v'.
Trying pattern rule with stem 'gambvcs.unix'.
Trying implicit prerequisite 'RCS/gambvcs.unix'.
Trying pattern rule with stem 'gambvcs.unix'.
Trying implicit prerequisite 's.gambvcs.unix'.
Trying pattern rule with stem 'gambvcs.unix'.
Trying implicit prerequisite 'SCCS/s.gambvcs.unix'.
No implicit rule found for 'gambvcs.unix'.
Finished prerequisites of target file 'gambvcs.unix'.
No need to remake target 'gambvcs.unix'.
Considering target file 'gambvcs.bat.windows'.
Looking for an implicit rule for 'gambvcs.bat.windows'.
Trying pattern rule with stem 'gambvcs.bat.windows'.
Trying implicit prerequisite 'gambvcs.bat.windows,v'.
Trying pattern rule with stem 'gambvcs.bat.windows'.
Trying implicit prerequisite 'RCS/gambvcs.bat.windows,v'.
Trying pattern rule with stem 'gambvcs.bat.windows'.
Trying implicit prerequisite 'RCS/gambvcs.bat.windows'.
Trying pattern rule with stem 'gambvcs.bat.windows'.
Trying implicit prerequisite 's.gambvcs.bat.windows'.
Trying pattern rule with stem 'gambvcs.bat.windows'.
Trying implicit prerequisite 'SCCS/s.gambvcs.bat.windows'.
No implicit rule found for 'gambvcs.bat.windows'.
Finished prerequisites of target file 'gambvcs.bat.windows'.
No need to remake target 'gambvcs.bat.windows'.
Finished prerequisites of target file 'gambvcs'.
Prerequisite 'makefile' is older than target 'gambvcs'.
Prerequisite 'gambvcs.unix' is older than target 'gambvcs'.
Prerequisite 'gambvcs.bat.windows' is older than target 'gambvcs'.
No need to remake target 'gambvcs'.
Considering target file 'gambuild-C'.
File 'gambuild-C' does not exist.
Pruning file 'makefile'.
Considering target file 'gambuild-C.unix'.
File 'gambuild-C.unix' does not exist.
Considering target file 'gambuild-C.unix.in'.
Looking for an implicit rule for 'gambuild-C.unix.in'.
Trying pattern rule with stem 'gambuild-C.unix.in'.
Trying implicit prerequisite 'gambuild-C.unix.in,v'.
Trying pattern rule with stem 'gambuild-C.unix.in'.
Trying implicit prerequisite 'RCS/gambuild-C.unix.in,v'.
Trying pattern rule with stem 'gambuild-C.unix.in'.
Trying implicit prerequisite 'RCS/gambuild-C.unix.in'.
Trying pattern rule with stem 'gambuild-C.unix.in'.
Trying implicit prerequisite 's.gambuild-C.unix.in'.
Trying pattern rule with stem 'gambuild-C.unix.in'.
Trying implicit prerequisite 'SCCS/s.gambuild-C.unix.in'.
No implicit rule found for 'gambuild-C.unix.in'.
Finished prerequisites of target file 'gambuild-C.unix.in'.
No need to remake target 'gambuild-C.unix.in'.
Considering target file '../config.status'.
File '../config.status' was considered already.
Finished prerequisites of target file 'gambuild-C.unix'.
Must remake target 'gambuild-C.unix'.
make[1]: Entering directory '/opt/gambit-src/bin'
makefile:580: update target 'gambuild-C.unix' due to: gambuild-C.unix.in ../config.status
cd .. && CONFIG_FILES=bin/gambuild-C.unix CONFIG_HEADERS= ./config.status
Putting child 0x7f59a3c289d0 (gambuild-C.unix) PID 39 on the chain.
Live child 0x7f59a3c289d0 (gambuild-C.unix) PID 39
config.status: creating bin/gambuild-C.unix
Reaping winning child 0x7f59a3c289d0 PID 39
Removing child 0x7f59a3c289d0 PID 39 from chain.
Successfully remade target file 'gambuild-C.unix'.
Considering target file 'gambuild-C.bat.windows'.
File 'gambuild-C.bat.windows' does not exist.
Considering target file 'gambuild-C.bat.windows.in'.
Looking for an implicit rule for 'gambuild-C.bat.windows.in'.
Trying pattern rule with stem 'gambuild-C.bat.windows.in'.
Trying implicit prerequisite 'gambuild-C.bat.windows.in,v'.
Trying pattern rule with stem 'gambuild-C.bat.windows.in'.
Trying implicit prerequisite 'RCS/gambuild-C.bat.windows.in,v'.
Trying pattern rule with stem 'gambuild-C.bat.windows.in'.
Trying implicit prerequisite 'RCS/gambuild-C.bat.windows.in'.
Trying pattern rule with stem 'gambuild-C.bat.windows.in'.
Trying implicit prerequisite 's.gambuild-C.bat.windows.in'.
Trying pattern rule with stem 'gambuild-C.bat.windows.in'.
Trying implicit prerequisite 'SCCS/s.gambuild-C.bat.windows.in'.
No implicit rule found for 'gambuild-C.bat.windows.in'.
Finished prerequisites of target file 'gambuild-C.bat.windows.in'.
No need to remake target 'gambuild-C.bat.windows.in'.
Pruning file '../config.status'.
Finished prerequisites of target file 'gambuild-C.bat.windows'.
Must remake target 'gambuild-C.bat.windows'.
makefile:583: update target 'gambuild-C.bat.windows' due to: gambuild-C.bat.windows.in ../config.status
cd .. && CONFIG_FILES=bin/gambuild-C.bat.windows CONFIG_HEADERS= ./config.status
Putting child 0x7f59a3c28a30 (gambuild-C.bat.windows) PID 103 on the chain.
Live child 0x7f59a3c28a30 (gambuild-C.bat.windows) PID 103
config.status: creating bin/gambuild-C.bat.windows
Reaping winning child 0x7f59a3c28a30 PID 103
Removing child 0x7f59a3c28a30 PID 103 from chain.
Successfully remade target file 'gambuild-C.bat.windows'.
Finished prerequisites of target file 'gambuild-C'.
Must remake target 'gambuild-C'.
makefile:131: update target 'gambuild-C' due to: makefile gambuild-C.unix gambuild-C.bat.windows
rm -f gambuild-C
Putting child 0x7f59a3c28a30 (gambuild-C) PID 167 on the chain.
Live child 0x7f59a3c28a30 (gambuild-C) PID 167
Reaping winning child 0x7f59a3c28a30 PID 167
if test "" = ""; then \
cp gambuild-C.unix gambuild-C; \
chmod +x gambuild-C; \
else \
sed "s/\$/\r/g" gambuild-C.bat.windows > gambuild-C; \
fi
Live child 0x7f59a3c28a30 (gambuild-C) PID 168
Reaping winning child 0x7f59a3c28a30 PID 168
Removing child 0x7f59a3c28a30 PID 168 from chain.
Successfully remade target file 'gambuild-C'.
Considering target file 'gambuild-js'.
File 'gambuild-js' does not exist.
Pruning file 'makefile'.
Considering target file 'gambuild-js.unix'.
File 'gambuild-js.unix' does not exist.
Considering target file 'gambuild-js.unix.in'.
Looking for an implicit rule for 'gambuild-js.unix.in'.
Trying pattern rule with stem 'gambuild-js.unix.in'.
Trying implicit prerequisite 'gambuild-js.unix.in,v'.
Trying pattern rule with stem 'gambuild-js.unix.in'.
Trying implicit prerequisite 'RCS/gambuild-js.unix.in,v'.
Trying pattern rule with stem 'gambuild-js.unix.in'.
Trying implicit prerequisite 'RCS/gambuild-js.unix.in'.
Trying pattern rule with stem 'gambuild-js.unix.in'.
Trying implicit prerequisite 's.gambuild-js.unix.in'.
Trying pattern rule with stem 'gambuild-js.unix.in'.
Trying implicit prerequisite 'SCCS/s.gambuild-js.unix.in'.
No implicit rule found for 'gambuild-js.unix.in'.
Finished prerequisites of target file 'gambuild-js.unix.in'.
No need to remake target 'gambuild-js.unix.in'.
Pruning file '../config.status'.
Finished prerequisites of target file 'gambuild-js.unix'.
Must remake target 'gambuild-js.unix'.
makefile:586: update target 'gambuild-js.unix' due to: gambuild-js.unix.in ../config.status
cd .. && CONFIG_FILES=bin/gambuild-js.unix CONFIG_HEADERS= ./config.status
Putting child 0x7f59a3c32430 (gambuild-js.unix) PID 170 on the chain.
Live child 0x7f59a3c32430 (gambuild-js.unix) PID 170
config.status: creating bin/gambuild-js.unix
Reaping winning child 0x7f59a3c32430 PID 170
Removing child 0x7f59a3c32430 PID 170 from chain.
Successfully remade target file 'gambuild-js.unix'.
Considering target file 'gambuild-js.bat.windows'.
File 'gambuild-js.bat.windows' does not exist.
Considering target file 'gambuild-js.bat.windows.in'.
Looking for an implicit rule for 'gambuild-js.bat.windows.in'.
Trying pattern rule with stem 'gambuild-js.bat.windows.in'.
Trying implicit prerequisite 'gambuild-js.bat.windows.in,v'.
Trying pattern rule with stem 'gambuild-js.bat.windows.in'.
Trying implicit prerequisite 'RCS/gambuild-js.bat.windows.in,v'.
Trying pattern rule with stem 'gambuild-js.bat.windows.in'.
Trying implicit prerequisite 'RCS/gambuild-js.bat.windows.in'.
Trying pattern rule with stem 'gambuild-js.bat.windows.in'.
Trying implicit prerequisite 's.gambuild-js.bat.windows.in'.
Trying pattern rule with stem 'gambuild-js.bat.windows.in'.
Trying implicit prerequisite 'SCCS/s.gambuild-js.bat.windows.in'.
No implicit rule found for 'gambuild-js.bat.windows.in'.
Finished prerequisites of target file 'gambuild-js.bat.windows.in'.
No need to remake target 'gambuild-js.bat.windows.in'.
Pruning file '../config.status'.
Finished prerequisites of target file 'gambuild-js.bat.windows'.
Must remake target 'gambuild-js.bat.windows'.
makefile:589: update target 'gambuild-js.bat.windows' due to: gambuild-js.bat.windows.in ../config.status
cd .. && CONFIG_FILES=bin/gambuild-js.bat.windows CONFIG_HEADERS= ./config.status
Putting child 0x7f59a3c325b0 (gambuild-js.bat.windows) PID 234 on the chain.
Live child 0x7f59a3c325b0 (gambuild-js.bat.windows) PID 234
config.status: creating bin/gambuild-js.bat.windows
Reaping winning child 0x7f59a3c325b0 PID 234
Removing child 0x7f59a3c325b0 PID 234 from chain.
Successfully remade target file 'gambuild-js.bat.windows'.
Finished prerequisites of target file 'gambuild-js'.
Must remake target 'gambuild-js'.
makefile:140: update target 'gambuild-js' due to: makefile gambuild-js.unix gambuild-js.bat.windows
rm -f gambuild-js
Putting child 0x7f59a3c326d0 (gambuild-js) PID 298 on the chain.
Live child 0x7f59a3c326d0 (gambuild-js) PID 298
Reaping winning child 0x7f59a3c326d0 PID 298
if test "" = ""; then \
cp gambuild-js.unix gambuild-js; \
chmod +x gambuild-js; \
else \
sed "s/\$/\r/g" gambuild-js.bat.windows > gambuild-js; \
fi
Live child 0x7f59a3c326d0 (gambuild-js) PID 299
Reaping winning child 0x7f59a3c326d0 PID 299
Removing child 0x7f59a3c326d0 PID 299 from chain.
Successfully remade target file 'gambuild-js'.
Considering target file 'gambuild-python'.
File 'gambuild-python' does not exist.
Pruning file 'makefile'.
Considering target file 'gambuild-python.unix'.
File 'gambuild-python.unix' does not exist.
Considering target file 'gambuild-python.unix.in'.
Looking for an implicit rule for 'gambuild-python.unix.in'.
Trying pattern rule with stem 'gambuild-python.unix.in'.
Trying implicit prerequisite 'gambuild-python.unix.in,v'.
Trying pattern rule with stem 'gambuild-python.unix.in'.
Trying implicit prerequisite 'RCS/gambuild-python.unix.in,v'.
Trying pattern rule with stem 'gambuild-python.unix.in'.
Trying implicit prerequisite 'RCS/gambuild-python.unix.in'.
Trying pattern rule with stem 'gambuild-python.unix.in'.
Trying implicit prerequisite 's.gambuild-python.unix.in'.
Trying pattern rule with stem 'gambuild-python.unix.in'.
Trying implicit prerequisite 'SCCS/s.gambuild-python.unix.in'.
No implicit rule found for 'gambuild-python.unix.in'.
Finished prerequisites of target file 'gambuild-python.unix.in'.
No need to remake target 'gambuild-python.unix.in'.
Pruning file '../config.status'.
Finished prerequisites of target file 'gambuild-python.unix'.
Must remake target 'gambuild-python.unix'.
makefile:592: update target 'gambuild-python.unix' due to: gambuild-python.unix.in ../config.status
cd .. && CONFIG_FILES=bin/gambuild-python.unix CONFIG_HEADERS= ./config.status
Putting child 0x7f59a3c325b0 (gambuild-python.unix) PID 301 on the chain.
Live child 0x7f59a3c325b0 (gambuild-python.unix) PID 301
config.status: creating bin/gambuild-python.unix
Reaping winning child 0x7f59a3c325b0 PID 301
Removing child 0x7f59a3c325b0 PID 301 from chain.
Successfully remade target file 'gambuild-python.unix'.
Considering target file 'gambuild-python.bat.windows'.
File 'gambuild-python.bat.windows' does not exist.
Considering target file 'gambuild-python.bat.windows.in'.
Looking for an implicit rule for 'gambuild-python.bat.windows.in'.
Trying pattern rule with stem 'gambuild-python.bat.windows.in'.
Trying implicit prerequisite 'gambuild-python.bat.windows.in,v'.
Trying pattern rule with stem 'gambuild-python.bat.windows.in'.
Trying implicit prerequisite 'RCS/gambuild-python.bat.windows.in,v'.
Trying pattern rule with stem 'gambuild-python.bat.windows.in'.
Trying implicit prerequisite 'RCS/gambuild-python.bat.windows.in'.
Trying pattern rule with stem 'gambuild-python.bat.windows.in'.
Trying implicit prerequisite 's.gambuild-python.bat.windows.in'.
Trying pattern rule with stem 'gambuild-python.bat.windows.in'.
Trying implicit prerequisite 'SCCS/s.gambuild-python.bat.windows.in'.
No implicit rule found for 'gambuild-python.bat.windows.in'.
Finished prerequisites of target file 'gambuild-python.bat.windows.in'.
No need to remake target 'gambuild-python.bat.windows.in'.
Pruning file '../config.status'.
Finished prerequisites of target file 'gambuild-python.bat.windows'.
Must remake target 'gambuild-python.bat.windows'.
makefile:595: update target 'gambuild-python.bat.windows' due to: gambuild-python.bat.windows.in ../config.status
cd .. && CONFIG_FILES=bin/gambuild-python.bat.windows CONFIG_HEADERS= ./config.status
Putting child 0x7f59a3c32610 (gambuild-python.bat.windows) PID 365 on the chain.
Live child 0x7f59a3c32610 (gambuild-python.bat.windows) PID 365
config.status: creating bin/gambuild-python.bat.windows
Reaping winning child 0x7f59a3c32610 PID 365
Removing child 0x7f59a3c32610 PID 365 from chain.
Successfully remade target file 'gambuild-python.bat.windows'.
Finished prerequisites of target file 'gambuild-python'.
Must remake target 'gambuild-python'.
makefile:149: update target 'gambuild-python' due to: makefile gambuild-python.unix gambuild-python.bat.windows
rm -f gambuild-python
Putting child 0x7f59a3c32610 (gambuild-python) PID 429 on the chain.
Live child 0x7f59a3c32610 (gambuild-python) PID 429
Reaping winning child 0x7f59a3c32610 PID 429
if test "" = ""; then \
cp gambuild-python.unix gambuild-python; \
chmod +x gambuild-python; \
else \
sed "s/\$/\r/g" gambuild-python.bat.windows > gambuild-python; \
fi
Live child 0x7f59a3c32610 (gambuild-python) PID 430
Reaping winning child 0x7f59a3c32610 PID 430
Removing child 0x7f59a3c32610 PID 430 from chain.
Successfully remade target file 'gambuild-python'.
Considering target file 'gambuild-ruby'.
File 'gambuild-ruby' does not exist.
Pruning file 'makefile'.
Considering target file 'gambuild-ruby.unix'.
File 'gambuild-ruby.unix' does not exist.
Considering target file 'gambuild-ruby.unix.in'.
Looking for an implicit rule for 'gambuild-ruby.unix.in'.
Trying pattern rule with stem 'gambuild-ruby.unix.in'.
Trying implicit prerequisite 'gambuild-ruby.unix.in,v'.
Trying pattern rule with stem 'gambuild-ruby.unix.in'.
Trying implicit prerequisite 'RCS/gambuild-ruby.unix.in,v'.
Trying pattern rule with stem 'gambuild-ruby.unix.in'.
Trying implicit prerequisite 'RCS/gambuild-ruby.unix.in'.
Trying pattern rule with stem 'gambuild-ruby.unix.in'.
Trying implicit prerequisite 's.gambuild-ruby.unix.in'.
Trying pattern rule with stem 'gambuild-ruby.unix.in'.
Trying implicit prerequisite 'SCCS/s.gambuild-ruby.unix.in'.
No implicit rule found for 'gambuild-ruby.unix.in'.
Finished prerequisites of target file 'gambuild-ruby.unix.in'.
No need to remake target 'gambuild-ruby.unix.in'.
Pruning file '../config.status'.
Finished prerequisites of target file 'gambuild-ruby.unix'.
Must remake target 'gambuild-ruby.unix'.
makefile:598: update target 'gambuild-ruby.unix' due to: gambuild-ruby.unix.in ../config.status
cd .. && CONFIG_FILES=bin/gambuild-ruby.unix CONFIG_HEADERS= ./config.status
Putting child 0x7f59a3c23080 (gambuild-ruby.unix) PID 432 on the chain.
Live child 0x7f59a3c23080 (gambuild-ruby.unix) PID 432
config.status: creating bin/gambuild-ruby.unix
Reaping winning child 0x7f59a3c23080 PID 432
Removing child 0x7f59a3c23080 PID 432 from chain.
Successfully remade target file 'gambuild-ruby.unix'.
Considering target file 'gambuild-ruby.bat.windows'.
File 'gambuild-ruby.bat.windows' does not exist.
Considering target file 'gambuild-ruby.bat.windows.in'.
Looking for an implicit rule for 'gambuild-ruby.bat.windows.in'.
Trying pattern rule with stem 'gambuild-ruby.bat.windows.in'.
Trying implicit prerequisite 'gambuild-ruby.bat.windows.in,v'.
Trying pattern rule with stem 'gambuild-ruby.bat.windows.in'.
Trying implicit prerequisite 'RCS/gambuild-ruby.bat.windows.in,v'.
Trying pattern rule with stem 'gambuild-ruby.bat.windows.in'.
Trying implicit prerequisite 'RCS/gambuild-ruby.bat.windows.in'.
Trying pattern rule with stem 'gambuild-ruby.bat.windows.in'.
Trying implicit prerequisite 's.gambuild-ruby.bat.windows.in'.
Trying pattern rule with stem 'gambuild-ruby.bat.windows.in'.
Trying implicit prerequisite 'SCCS/s.gambuild-ruby.bat.windows.in'.
No implicit rule found for 'gambuild-ruby.bat.windows.in'.
Finished prerequisites of target file 'gambuild-ruby.bat.windows.in'.
No need to remake target 'gambuild-ruby.bat.windows.in'.
Pruning file '../config.status'.
Finished prerequisites of target file 'gambuild-ruby.bat.windows'.
Must remake target 'gambuild-ruby.bat.windows'.
makefile:601: update target 'gambuild-ruby.bat.windows' due to: gambuild-ruby.bat.windows.in ../config.status
cd .. && CONFIG_FILES=bin/gambuild-ruby.bat.windows CONFIG_HEADERS= ./config.status
Putting child 0x7f59a3c23260 (gambuild-ruby.bat.windows) PID 496 on the chain.
Live child 0x7f59a3c23260 (gambuild-ruby.bat.windows) PID 496
config.status: creating bin/gambuild-ruby.bat.windows
Reaping winning child 0x7f59a3c23260 PID 496
Removing child 0x7f59a3c23260 PID 496 from chain.
Successfully remade target file 'gambuild-ruby.bat.windows'.
Finished prerequisites of target file 'gambuild-ruby'.
Must remake target 'gambuild-ruby'.
makefile:158: update target 'gambuild-ruby' due to: makefile gambuild-ruby.unix gambuild-ruby.bat.windows
rm -f gambuild-ruby
Putting child 0x7f59a3c23380 (gambuild-ruby) PID 560 on the chain.
Live child 0x7f59a3c23380 (gambuild-ruby) PID 560
Reaping winning child 0x7f59a3c23380 PID 560
if test "" = ""; then \
cp gambuild-ruby.unix gambuild-ruby; \
chmod +x gambuild-ruby; \
else \
sed "s/\$/\r/g" gambuild-ruby.bat.windows > gambuild-ruby; \
fi
Live child 0x7f59a3c23380 (gambuild-ruby) PID 561
Reaping winning child 0x7f59a3c23380 PID 561
Removing child 0x7f59a3c23380 PID 561 from chain.
Successfully remade target file 'gambuild-ruby'.
Considering target file 'gambuild-php'.
File 'gambuild-php' does not exist.
Pruning file 'makefile'.
Considering target file 'gambuild-php.unix'.
File 'gambuild-php.unix' does not exist.
Considering target file 'gambuild-php.unix.in'.
Looking for an implicit rule for 'gambuild-php.unix.in'.
Trying pattern rule with stem 'gambuild-php.unix.in'.
Trying implicit prerequisite 'gambuild-php.unix.in,v'.
Trying pattern rule with stem 'gambuild-php.unix.in'.
Trying implicit prerequisite 'RCS/gambuild-php.unix.in,v'.
Trying pattern rule with stem 'gambuild-php.unix.in'.
Trying implicit prerequisite 'RCS/gambuild-php.unix.in'.
Trying pattern rule with stem 'gambuild-php.unix.in'.
Trying implicit prerequisite 's.gambuild-php.unix.in'.
Trying pattern rule with stem 'gambuild-php.unix.in'.
Trying implicit prerequisite 'SCCS/s.gambuild-php.unix.in'.
No implicit rule found for 'gambuild-php.unix.in'.
Finished prerequisites of target file 'gambuild-php.unix.in'.
No need to remake target 'gambuild-php.unix.in'.
Pruning file '../config.status'.
Finished prerequisites of target file 'gambuild-php.unix'.
Must remake target 'gambuild-php.unix'.
makefile:604: update target 'gambuild-php.unix' due to: gambuild-php.unix.in ../config.status
cd .. && CONFIG_FILES=bin/gambuild-php.unix CONFIG_HEADERS= ./config.status
Putting child 0x7f59a3c23260 (gambuild-php.unix) PID 563 on the chain.
Live child 0x7f59a3c23260 (gambuild-php.unix) PID 563
config.status: creating bin/gambuild-php.unix
Reaping winning child 0x7f59a3c23260 PID 563
Removing child 0x7f59a3c23260 PID 563 from chain.
Successfully remade target file 'gambuild-php.unix'.
Considering target file 'gambuild-php.bat.windows'.
File 'gambuild-php.bat.windows' does not exist.
Considering target file 'gambuild-php.bat.windows.in'.
Looking for an implicit rule for 'gambuild-php.bat.windows.in'.
Trying pattern rule with stem 'gambuild-php.bat.windows.in'.
Trying implicit prerequisite 'gambuild-php.bat.windows.in,v'.
Trying pattern rule with stem 'gambuild-php.bat.windows.in'.
Trying implicit prerequisite 'RCS/gambuild-php.bat.windows.in,v'.
Trying pattern rule with stem 'gambuild-php.bat.windows.in'.
Trying implicit prerequisite 'RCS/gambuild-php.bat.windows.in'.
Trying pattern rule with stem 'gambuild-php.bat.windows.in'.
Trying implicit prerequisite 's.gambuild-php.bat.windows.in'.
Trying pattern rule with stem 'gambuild-php.bat.windows.in'.
Trying implicit prerequisite 'SCCS/s.gambuild-php.bat.windows.in'.
No implicit rule found for 'gambuild-php.bat.windows.in'.
Finished prerequisites of target file 'gambuild-php.bat.windows.in'.
No need to remake target 'gambuild-php.bat.windows.in'.
Pruning file '../config.status'.
Finished prerequisites of target file 'gambuild-php.bat.windows'.
Must remake target 'gambuild-php.bat.windows'.
makefile:607: update target 'gambuild-php.bat.windows' due to: gambuild-php.bat.windows.in ../config.status
cd .. && CONFIG_FILES=bin/gambuild-php.bat.windows CONFIG_HEADERS= ./config.status
Putting child 0x7f59a3c23260 (gambuild-php.bat.windows) PID 627 on the chain.
Live child 0x7f59a3c23260 (gambuild-php.bat.windows) PID 627
config.status: creating bin/gambuild-php.bat.windows
Reaping winning child 0x7f59a3c23260 PID 627
Removing child 0x7f59a3c23260 PID 627 from chain.
Successfully remade target file 'gambuild-php.bat.windows'.
Finished prerequisites of target file 'gambuild-php'.
Must remake target 'gambuild-php'.
makefile:167: update target 'gambuild-php' due to: makefile gambuild-php.unix gambuild-php.bat.windows
rm -f gambuild-php
Putting child 0x7f59a3c23260 (gambuild-php) PID 691 on the chain.
Live child 0x7f59a3c23260 (gambuild-php) PID 691
Reaping winning child 0x7f59a3c23260 PID 691
if test "" = ""; then \
cp gambuild-php.unix gambuild-php; \
chmod +x gambuild-php; \
else \
sed "s/\$/\r/g" gambuild-php.bat.windows > gambuild-php; \
fi
Live child 0x7f59a3c23260 (gambuild-php) PID 692
Reaping winning child 0x7f59a3c23260 PID 692
Removing child 0x7f59a3c23260 PID 692 from chain.
Successfully remade target file 'gambuild-php'.
Considering target file 'gambuild-java'.
File 'gambuild-java' does not exist.
Pruning file 'makefile'.
Considering target file 'gambuild-java.unix'.
File 'gambuild-java.unix' does not exist.
Considering target file 'gambuild-java.unix.in'.
Looking for an implicit rule for 'gambuild-java.unix.in'.
Trying pattern rule with stem 'gambuild-java.unix.in'.
Trying implicit prerequisite 'gambuild-java.unix.in,v'.
Trying pattern rule with stem 'gambuild-java.unix.in'.
Trying implicit prerequisite 'RCS/gambuild-java.unix.in,v'.
Trying pattern rule with stem 'gambuild-java.unix.in'.
Trying implicit prerequisite 'RCS/gambuild-java.unix.in'.
Trying pattern rule with stem 'gambuild-java.unix.in'.
Trying implicit prerequisite 's.gambuild-java.unix.in'.
Trying pattern rule with stem 'gambuild-java.unix.in'.
Trying implicit prerequisite 'SCCS/s.gambuild-java.unix.in'.
No implicit rule found for 'gambuild-java.unix.in'.
Finished prerequisites of target file 'gambuild-java.unix.in'.
No need to remake target 'gambuild-java.unix.in'.
Pruning file '../config.status'.
Finished prerequisites of target file 'gambuild-java.unix'.
Must remake target 'gambuild-java.unix'.
makefile:610: update target 'gambuild-java.unix' due to: gambuild-java.unix.in ../config.status
cd .. && CONFIG_FILES=bin/gambuild-java.unix CONFIG_HEADERS= ./config.status
Putting child 0x7f59a3c23c50 (gambuild-java.unix) PID 694 on the chain.
Live child 0x7f59a3c23c50 (gambuild-java.unix) PID 694
config.status: creating bin/gambuild-java.unix
Reaping winning child 0x7f59a3c23c50 PID 694
Removing child 0x7f59a3c23c50 PID 694 from chain.
Successfully remade target file 'gambuild-java.unix'.
Considering target file 'gambuild-java.bat.windows'.
File 'gambuild-java.bat.windows' does not exist.
Considering target file 'gambuild-java.bat.windows.in'.
Looking for an implicit rule for 'gambuild-java.bat.windows.in'.
Trying pattern rule with stem 'gambuild-java.bat.windows.in'.
Trying implicit prerequisite 'gambuild-java.bat.windows.in,v'.
Trying pattern rule with stem 'gambuild-java.bat.windows.in'.
Trying implicit prerequisite 'RCS/gambuild-java.bat.windows.in,v'.
Trying pattern rule with stem 'gambuild-java.bat.windows.in'.
Trying implicit prerequisite 'RCS/gambuild-java.bat.windows.in'.
Trying pattern rule with stem 'gambuild-java.bat.windows.in'.
Trying implicit prerequisite 's.gambuild-java.bat.windows.in'.
Trying pattern rule with stem 'gambuild-java.bat.windows.in'.
Trying implicit prerequisite 'SCCS/s.gambuild-java.bat.windows.in'.
No implicit rule found for 'gambuild-java.bat.windows.in'.
Finished prerequisites of target file 'gambuild-java.bat.windows.in'.
No need to remake target 'gambuild-java.bat.windows.in'.
Pruning file '../config.status'.
Finished prerequisites of target file 'gambuild-java.bat.windows'.
Must remake target 'gambuild-java.bat.windows'.
makefile:613: update target 'gambuild-java.bat.windows' due to: gambuild-java.bat.windows.in ../config.status
cd .. && CONFIG_FILES=bin/gambuild-java.bat.windows CONFIG_HEADERS= ./config.status
Putting child 0x7f59a3c23e30 (gambuild-java.bat.windows) PID 758 on the chain.
Live child 0x7f59a3c23e30 (gambuild-java.bat.windows) PID 758
config.status: creating bin/gambuild-java.bat.windows
Reaping winning child 0x7f59a3c23e30 PID 758
Removing child 0x7f59a3c23e30 PID 758 from chain.
Successfully remade target file 'gambuild-java.bat.windows'.
Finished prerequisites of target file 'gambuild-java'.
Must remake target 'gambuild-java'.
makefile:176: update target 'gambuild-java' due to: makefile gambuild-java.unix gambuild-java.bat.windows
rm -f gambuild-java
Putting child 0x7f59a3c23f50 (gambuild-java) PID 822 on the chain.
Live child 0x7f59a3c23f50 (gambuild-java) PID 822
Reaping winning child 0x7f59a3c23f50 PID 822
if test "" = ""; then \
cp gambuild-java.unix gambuild-java; \
chmod +x gambuild-java; \
else \
sed "s/\$/\r/g" gambuild-java.bat.windows > gambuild-java; \
fi
Live child 0x7f59a3c23f50 (gambuild-java) PID 823
Reaping winning child 0x7f59a3c23f50 PID 823
Removing child 0x7f59a3c23f50 PID 823 from chain.
Successfully remade target file 'gambuild-java'.
Considering target file 'gambuild-x86'.
File 'gambuild-x86' does not exist.
Pruning file 'makefile'.
Considering target file 'gambuild-x86.unix'.
File 'gambuild-x86.unix' does not exist.
Considering target file 'gambuild-x86.unix.in'.
Looking for an implicit rule for 'gambuild-x86.unix.in'.
Trying pattern rule with stem 'gambuild-x86.unix.in'.
Trying implicit prerequisite 'gambuild-x86.unix.in,v'.
Trying pattern rule with stem 'gambuild-x86.unix.in'.
Trying implicit prerequisite 'RCS/gambuild-x86.unix.in,v'.
Trying pattern rule with stem 'gambuild-x86.unix.in'.
Trying implicit prerequisite 'RCS/gambuild-x86.unix.in'.
Trying pattern rule with stem 'gambuild-x86.unix.in'.
Trying implicit prerequisite 's.gambuild-x86.unix.in'.
Trying pattern rule with stem 'gambuild-x86.unix.in'.
Trying implicit prerequisite 'SCCS/s.gambuild-x86.unix.in'.
No implicit rule found for 'gambuild-x86.unix.in'.
Finished prerequisites of target file 'gambuild-x86.unix.in'.
No need to remake target 'gambuild-x86.unix.in'.
Pruning file '../config.status'.
Finished prerequisites of target file 'gambuild-x86.unix'.
Must remake target 'gambuild-x86.unix'.
makefile:616: update target 'gambuild-x86.unix' due to: gambuild-x86.unix.in ../config.status
cd .. && CONFIG_FILES=bin/gambuild-x86.unix CONFIG_HEADERS= ./config.status
Putting child 0x7f59a3c23e30 (gambuild-x86.unix) PID 825 on the chain.
Live child 0x7f59a3c23e30 (gambuild-x86.unix) PID 825
config.status: creating bin/gambuild-x86.unix
Reaping winning child 0x7f59a3c23e30 PID 825
Removing child 0x7f59a3c23e30 PID 825 from chain.
Successfully remade target file 'gambuild-x86.unix'.
Considering target file 'gambuild-x86.bat.windows'.
File 'gambuild-x86.bat.windows' does not exist.
Considering target file 'gambuild-x86.bat.windows.in'.
Looking for an implicit rule for 'gambuild-x86.bat.windows.in'.
Trying pattern rule with stem 'gambuild-x86.bat.windows.in'.
Trying implicit prerequisite 'gambuild-x86.bat.windows.in,v'.
Trying pattern rule with stem 'gambuild-x86.bat.windows.in'.
Trying implicit prerequisite 'RCS/gambuild-x86.bat.windows.in,v'.
Trying pattern rule with stem 'gambuild-x86.bat.windows.in'.
Trying implicit prerequisite 'RCS/gambuild-x86.bat.windows.in'.
Trying pattern rule with stem 'gambuild-x86.bat.windows.in'.
Trying implicit prerequisite 's.gambuild-x86.bat.windows.in'.
Trying pattern rule with stem 'gambuild-x86.bat.windows.in'.
Trying implicit prerequisite 'SCCS/s.gambuild-x86.bat.windows.in'.
No implicit rule found for 'gambuild-x86.bat.windows.in'.
Finished prerequisites of target file 'gambuild-x86.bat.windows.in'.
No need to remake target 'gambuild-x86.bat.windows.in'.
Pruning file '../config.status'.
Finished prerequisites of target file 'gambuild-x86.bat.windows'.
Must remake target 'gambuild-x86.bat.windows'.
makefile:619: update target 'gambuild-x86.bat.windows' due to: gambuild-x86.bat.windows.in ../config.status
cd .. && CONFIG_FILES=bin/gambuild-x86.bat.windows CONFIG_HEADERS= ./config.status
Putting child 0x7f59a3c23e30 (gambuild-x86.bat.windows) PID 889 on the chain.
Live child 0x7f59a3c23e30 (gambuild-x86.bat.windows) PID 889
config.status: creating bin/gambuild-x86.bat.windows
Reaping winning child 0x7f59a3c23e30 PID 889
Removing child 0x7f59a3c23e30 PID 889 from chain.
Successfully remade target file 'gambuild-x86.bat.windows'.
Finished prerequisites of target file 'gambuild-x86'.
Must remake target 'gambuild-x86'.
makefile:185: update target 'gambuild-x86' due to: makefile gambuild-x86.unix gambuild-x86.bat.windows
rm -f gambuild-x86
Putting child 0x7f59a3c23e30 (gambuild-x86) PID 953 on the chain.
Live child 0x7f59a3c23e30 (gambuild-x86) PID 953
Reaping winning child 0x7f59a3c23e30 PID 953
if test "" = ""; then \
cp gambuild-x86.unix gambuild-x86; \
chmod +x gambuild-x86; \
else \
sed "s/\$/\r/g" gambuild-x86.bat.windows > gambuild-x86; \
fi
Live child 0x7f59a3c23e30 (gambuild-x86) PID 954
Reaping winning child 0x7f59a3c23e30 PID 954
Removing child 0x7f59a3c23e30 PID 954 from chain.
Successfully remade target file 'gambuild-x86'.
Considering target file 'gambuild-x86-64'.
File 'gambuild-x86-64' does not exist.
Pruning file 'makefile'.
Considering target file 'gambuild-x86-64.unix'.
File 'gambuild-x86-64.unix' does not exist.
Considering target file 'gambuild-x86-64.unix.in'.
Looking for an implicit rule for 'gambuild-x86-64.unix.in'.
Trying pattern rule with stem 'gambuild-x86-64.unix.in'.
Trying implicit prerequisite 'gambuild-x86-64.unix.in,v'.
Trying pattern rule with stem 'gambuild-x86-64.unix.in'.
Trying implicit prerequisite 'RCS/gambuild-x86-64.unix.in,v'.
Trying pattern rule with stem 'gambuild-x86-64.unix.in'.
Trying implicit prerequisite 'RCS/gambuild-x86-64.unix.in'.
Trying pattern rule with stem 'gambuild-x86-64.unix.in'.
Trying implicit prerequisite 's.gambuild-x86-64.unix.in'.
Trying pattern rule with stem 'gambuild-x86-64.unix.in'.
Trying implicit prerequisite 'SCCS/s.gambuild-x86-64.unix.in'.
No implicit rule found for 'gambuild-x86-64.unix.in'.
Finished prerequisites of target file 'gambuild-x86-64.unix.in'.
No need to remake target 'gambuild-x86-64.unix.in'.
Pruning file '../config.status'.
Finished prerequisites of target file 'gambuild-x86-64.unix'.
Must remake target 'gambuild-x86-64.unix'.
makefile:622: update target 'gambuild-x86-64.unix' due to: gambuild-x86-64.unix.in ../config.status
cd .. && CONFIG_FILES=bin/gambuild-x86-64.unix CONFIG_HEADERS= ./config.status
Putting child 0x7f59a3c24430 (gambuild-x86-64.unix) PID 956 on the chain.
Live child 0x7f59a3c24430 (gambuild-x86-64.unix) PID 956
config.status: creating bin/gambuild-x86-64.unix
Reaping winning child 0x7f59a3c24430 PID 956
Removing child 0x7f59a3c24430 PID 956 from chain.
Successfully remade target file 'gambuild-x86-64.unix'.
Considering target file 'gambuild-x86-64.bat.windows'.
File 'gambuild-x86-64.bat.windows' does not exist.
Considering target file 'gambuild-x86-64.bat.windows.in'.
Looking for an implicit rule for 'gambuild-x86-64.bat.windows.in'.
Trying pattern rule with stem 'gambuild-x86-64.bat.windows.in'.
Trying implicit prerequisite 'gambuild-x86-64.bat.windows.in,v'.
Trying pattern rule with stem 'gambuild-x86-64.bat.windows.in'.
Trying implicit prerequisite 'RCS/gambuild-x86-64.bat.windows.in,v'.
Trying pattern rule with stem 'gambuild-x86-64.bat.windows.in'.
Trying implicit prerequisite 'RCS/gambuild-x86-64.bat.windows.in'.
Trying pattern rule with stem 'gambuild-x86-64.bat.windows.in'.
Trying implicit prerequisite 's.gambuild-x86-64.bat.windows.in'.
Trying pattern rule with stem 'gambuild-x86-64.bat.windows.in'.
Trying implicit prerequisite 'SCCS/s.gambuild-x86-64.bat.windows.in'.
No implicit rule found for 'gambuild-x86-64.bat.windows.in'.
Finished prerequisites of target file 'gambuild-x86-64.bat.windows.in'.
No need to remake target 'gambuild-x86-64.bat.windows.in'.
Pruning file '../config.status'.
Finished prerequisites of target file 'gambuild-x86-64.bat.windows'.
Must remake target 'gambuild-x86-64.bat.windows'.
makefile:625: update target 'gambuild-x86-64.bat.windows' due to: gambuild-x86-64.bat.windows.in ../config.status
cd .. && CONFIG_FILES=bin/gambuild-x86-64.bat.windows CONFIG_HEADERS= ./config.status
Putting child 0x7f59a3c24610 (gambuild-x86-64.bat.windows) PID 1020 on the chain.
Live child 0x7f59a3c24610 (gambuild-x86-64.bat.windows) PID 1020
config.status: creating bin/gambuild-x86-64.bat.windows
Reaping winning child 0x7f59a3c24610 PID 1020
Removing child 0x7f59a3c24610 PID 1020 from chain.
Successfully remade target file 'gambuild-x86-64.bat.windows'.
Finished prerequisites of target file 'gambuild-x86-64'.
Must remake target 'gambuild-x86-64'.
makefile:194: update target 'gambuild-x86-64' due to: makefile gambuild-x86-64.unix gambuild-x86-64.bat.windows
rm -f gambuild-x86-64
Putting child 0x7f59a3c24730 (gambuild-x86-64) PID 1084 on the chain.
Live child 0x7f59a3c24730 (gambuild-x86-64) PID 1084
Reaping winning child 0x7f59a3c24730 PID 1084
if test "" = ""; then \
cp gambuild-x86-64.unix gambuild-x86-64; \
chmod +x gambuild-x86-64; \
else \
sed "s/\$/\r/g" gambuild-x86-64.bat.windows > gambuild-x86-64; \
fi
Live child 0x7f59a3c24730 (gambuild-x86-64) PID 1085
Reaping winning child 0x7f59a3c24730 PID 1085
Removing child 0x7f59a3c24730 PID 1085 from chain.
Successfully remade target file 'gambuild-x86-64'.
Considering target file 'gambuild-arm'.
File 'gambuild-arm' does not exist.
Pruning file 'makefile'.
Considering target file 'gambuild-arm.unix'.
File 'gambuild-arm.unix' does not exist.
Considering target file 'gambuild-arm.unix.in'.
Looking for an implicit rule for 'gambuild-arm.unix.in'.
Trying pattern rule with stem 'gambuild-arm.unix.in'.
Trying implicit prerequisite 'gambuild-arm.unix.in,v'.
Trying pattern rule with stem 'gambuild-arm.unix.in'.
Trying implicit prerequisite 'RCS/gambuild-arm.unix.in,v'.
Trying pattern rule with stem 'gambuild-arm.unix.in'.
Trying implicit prerequisite 'RCS/gambuild-arm.unix.in'.
Trying pattern rule with stem 'gambuild-arm.unix.in'.
Trying implicit prerequisite 's.gambuild-arm.unix.in'.
Trying pattern rule with stem 'gambuild-arm.unix.in'.
Trying implicit prerequisite 'SCCS/s.gambuild-arm.unix.in'.
No implicit rule found for 'gambuild-arm.unix.in'.
Finished prerequisites of target file 'gambuild-arm.unix.in'.
No need to remake target 'gambuild-arm.unix.in'.
Pruning file '../config.status'.
Finished prerequisites of target file 'gambuild-arm.unix'.
Must remake target 'gambuild-arm.unix'.
makefile:628: update target 'gambuild-arm.unix' due to: gambuild-arm.unix.in ../config.status
cd .. && CONFIG_FILES=bin/gambuild-arm.unix CONFIG_HEADERS= ./config.status
Putting child 0x7f59a3c24610 (gambuild-arm.unix) PID 1087 on the chain.
Live child 0x7f59a3c24610 (gambuild-arm.unix) PID 1087
config.status: creating bin/gambuild-arm.unix
Reaping winning child 0x7f59a3c24610 PID 1087
Removing child 0x7f59a3c24610 PID 1087 from chain.
Successfully remade target file 'gambuild-arm.unix'.
Considering target file 'gambuild-arm.bat.windows'.
File 'gambuild-arm.bat.windows' does not exist.
Considering target file 'gambuild-arm.bat.windows.in'.
Looking for an implicit rule for 'gambuild-arm.bat.windows.in'.
Trying pattern rule with stem 'gambuild-arm.bat.windows.in'.
Trying implicit prerequisite 'gambuild-arm.bat.windows.in,v'.
Trying pattern rule with stem 'gambuild-arm.bat.windows.in'.
Trying implicit prerequisite 'RCS/gambuild-arm.bat.windows.in,v'.
Trying pattern rule with stem 'gambuild-arm.bat.windows.in'.
Trying implicit prerequisite 'RCS/gambuild-arm.bat.windows.in'.
Trying pattern rule with stem 'gambuild-arm.bat.windows.in'.
Trying implicit prerequisite 's.gambuild-arm.bat.windows.in'.
Trying pattern rule with stem 'gambuild-arm.bat.windows.in'.
Trying implicit prerequisite 'SCCS/s.gambuild-arm.bat.windows.in'.
No implicit rule found for 'gambuild-arm.bat.windows.in'.
Finished prerequisites of target file 'gambuild-arm.bat.windows.in'.
No need to remake target 'gambuild-arm.bat.windows.in'.
Pruning file '../config.status'.
Finished prerequisites of target file 'gambuild-arm.bat.windows'.
Must remake target 'gambuild-arm.bat.windows'.
makefile:631: update target 'gambuild-arm.bat.windows' due to: gambuild-arm.bat.windows.in ../config.status
cd .. && CONFIG_FILES=bin/gambuild-arm.bat.windows CONFIG_HEADERS= ./config.status
Putting child 0x7f59a3c24610 (gambuild-arm.bat.windows) PID 1151 on the chain.
Live child 0x7f59a3c24610 (gambuild-arm.bat.windows) PID 1151
config.status: creating bin/gambuild-arm.bat.windows
Reaping winning child 0x7f59a3c24610 PID 1151
Removing child 0x7f59a3c24610 PID 1151 from chain.
Successfully remade target file 'gambuild-arm.bat.windows'.
Finished prerequisites of target file 'gambuild-arm'.
Must remake target 'gambuild-arm'.
makefile:203: update target 'gambuild-arm' due to: makefile gambuild-arm.unix gambuild-arm.bat.windows
rm -f gambuild-arm
Putting child 0x7f59a3c24610 (gambuild-arm) PID 1215 on the chain.
Live child 0x7f59a3c24610 (gambuild-arm) PID 1215
Reaping winning child 0x7f59a3c24610 PID 1215
if test "" = ""; then \
cp gambuild-arm.unix gambuild-arm; \
chmod +x gambuild-arm; \
else \
sed "s/\$/\r/g" gambuild-arm.bat.windows > gambuild-arm; \
fi
Live child 0x7f59a3c24610 (gambuild-arm) PID 1216
Reaping winning child 0x7f59a3c24610 PID 1216
Removing child 0x7f59a3c24610 PID 1216 from chain.
Successfully remade target file 'gambuild-arm'.
Considering target file 'gambuild-riscv-32'.
File 'gambuild-riscv-32' does not exist.
Pruning file 'makefile'.
Considering target file 'gambuild-riscv-32.unix'.
File 'gambuild-riscv-32.unix' does not exist.
Considering target file 'gambuild-riscv-32.unix.in'.
Looking for an implicit rule for 'gambuild-riscv-32.unix.in'.
Trying pattern rule with stem 'gambuild-riscv-32.unix.in'.
Trying implicit prerequisite 'gambuild-riscv-32.unix.in,v'.
Trying pattern rule with stem 'gambuild-riscv-32.unix.in'.
Trying implicit prerequisite 'RCS/gambuild-riscv-32.unix.in,v'.
Trying pattern rule with stem 'gambuild-riscv-32.unix.in'.
Trying implicit prerequisite 'RCS/gambuild-riscv-32.unix.in'.
Trying pattern rule with stem 'gambuild-riscv-32.unix.in'.
Trying implicit prerequisite 's.gambuild-riscv-32.unix.in'.
Trying pattern rule with stem 'gambuild-riscv-32.unix.in'.
Trying implicit prerequisite 'SCCS/s.gambuild-riscv-32.unix.in'.
No implicit rule found for 'gambuild-riscv-32.unix.in'.
Finished prerequisites of target file 'gambuild-riscv-32.unix.in'.
No need to remake target 'gambuild-riscv-32.unix.in'.
Pruning file '../config.status'.
Finished prerequisites of target file 'gambuild-riscv-32.unix'.
Must remake target 'gambuild-riscv-32.unix'.
makefile:634: update target 'gambuild-riscv-32.unix' due to: gambuild-riscv-32.unix.in ../config.status
cd .. && CONFIG_FILES=bin/gambuild-riscv-32.unix CONFIG_HEADERS= ./config.status
Putting child 0x7f59a3c24820 (gambuild-riscv-32.unix) PID 1218 on the chain.
Live child 0x7f59a3c24820 (gambuild-riscv-32.unix) PID 1218
config.status: creating bin/gambuild-riscv-32.unix
Reaping winning child 0x7f59a3c24820 PID 1218
Removing child 0x7f59a3c24820 PID 1218 from chain.
Successfully remade target file 'gambuild-riscv-32.unix'.
Considering target file 'gambuild-riscv-32.bat.windows'.
File 'gambuild-riscv-32.bat.windows' does not exist.
Considering target file 'gambuild-riscv-32.bat.windows.in'.
Looking for an implicit rule for 'gambuild-riscv-32.bat.windows.in'.
Trying pattern rule with stem 'gambuild-riscv-32.bat.windows.in'.
Trying implicit prerequisite 'gambuild-riscv-32.bat.windows.in,v'.
Trying pattern rule with stem 'gambuild-riscv-32.bat.windows.in'.
Trying implicit prerequisite 'RCS/gambuild-riscv-32.bat.windows.in,v'.
Trying pattern rule with stem 'gambuild-riscv-32.bat.windows.in'.
Trying implicit prerequisite 'RCS/gambuild-riscv-32.bat.windows.in'.
Trying pattern rule with stem 'gambuild-riscv-32.bat.windows.in'.
Trying implicit prerequisite 's.gambuild-riscv-32.bat.windows.in'.
Trying pattern rule with stem 'gambuild-riscv-32.bat.windows.in'.
Trying implicit prerequisite 'SCCS/s.gambuild-riscv-32.bat.windows.in'.
No implicit rule found for 'gambuild-riscv-32.bat.windows.in'.
Finished prerequisites of target file 'gambuild-riscv-32.bat.windows.in'.
No need to remake target 'gambuild-riscv-32.bat.windows.in'.
Pruning file '../config.status'.
Finished prerequisites of target file 'gambuild-riscv-32.bat.windows'.
Must remake target 'gambuild-riscv-32.bat.windows'.
makefile:637: update target 'gambuild-riscv-32.bat.windows' due to: gambuild-riscv-32.bat.windows.in ../config.status
cd .. && CONFIG_FILES=bin/gambuild-riscv-32.bat.windows CONFIG_HEADERS= ./config.status
Putting child 0x7f59a3c24a00 (gambuild-riscv-32.bat.windows) PID 1282 on the chain.
Live child 0x7f59a3c24a00 (gambuild-riscv-32.bat.windows) PID 1282
config.status: creating bin/gambuild-riscv-32.bat.windows
Reaping winning child 0x7f59a3c24a00 PID 1282
Removing child 0x7f59a3c24a00 PID 1282 from chain.
Successfully remade target file 'gambuild-riscv-32.bat.windows'.
Finished prerequisites of target file 'gambuild-riscv-32'.
Must remake target 'gambuild-riscv-32'.
makefile:212: update target 'gambuild-riscv-32' due to: makefile gambuild-riscv-32.unix gambuild-riscv-32.bat.windows
rm -f gambuild-riscv-32
Putting child 0x7f59a3c24b20 (gambuild-riscv-32) PID 1346 on the chain.
Live child 0x7f59a3c24b20 (gambuild-riscv-32) PID 1346
Reaping winning child 0x7f59a3c24b20 PID 1346
if test "" = ""; then \
cp gambuild-riscv-32.unix gambuild-riscv-32; \
chmod +x gambuild-riscv-32; \
else \
sed "s/\$/\r/g" gambuild-riscv-32.bat.windows > gambuild-riscv-32; \
fi
Live child 0x7f59a3c24b20 (gambuild-riscv-32) PID 1347
Reaping winning child 0x7f59a3c24b20 PID 1347
Removing child 0x7f59a3c24b20 PID 1347 from chain.
Successfully remade target file 'gambuild-riscv-32'.
Considering target file 'gambuild-riscv-64'.
File 'gambuild-riscv-64' does not exist.
Pruning file 'makefile'.
Considering target file 'gambuild-riscv-64.unix'.
File 'gambuild-riscv-64.unix' does not exist.
Considering target file 'gambuild-riscv-64.unix.in'.
Looking for an implicit rule for 'gambuild-riscv-64.unix.in'.
Trying pattern rule with stem 'gambuild-riscv-64.unix.in'.
Trying implicit prerequisite 'gambuild-riscv-64.unix.in,v'.
Trying pattern rule with stem 'gambuild-riscv-64.unix.in'.
Trying implicit prerequisite 'RCS/gambuild-riscv-64.unix.in,v'.
Trying pattern rule with stem 'gambuild-riscv-64.unix.in'.
Trying implicit prerequisite 'RCS/gambuild-riscv-64.unix.in'.
Trying pattern rule with stem 'gambuild-riscv-64.unix.in'.
Trying implicit prerequisite 's.gambuild-riscv-64.unix.in'.
Trying pattern rule with stem 'gambuild-riscv-64.unix.in'.
Trying implicit prerequisite 'SCCS/s.gambuild-riscv-64.unix.in'.
No implicit rule found for 'gambuild-riscv-64.unix.in'.
Finished prerequisites of target file 'gambuild-riscv-64.unix.in'.
No need to remake target 'gambuild-riscv-64.unix.in'.
Pruning file '../config.status'.
Finished prerequisites of target file 'gambuild-riscv-64.unix'.
Must remake target 'gambuild-riscv-64.unix'.
makefile:640: update target 'gambuild-riscv-64.unix' due to: gambuild-riscv-64.unix.in ../config.status
cd .. && CONFIG_FILES=bin/gambuild-riscv-64.unix CONFIG_HEADERS= ./config.status
Putting child 0x7f59a3c24a00 (gambuild-riscv-64.unix) PID 1349 on the chain.
Live child 0x7f59a3c24a00 (gambuild-riscv-64.unix) PID 1349
config.status: creating bin/gambuild-riscv-64.unix
Reaping winning child 0x7f59a3c24a00 PID 1349
Removing child 0x7f59a3c24a00 PID 1349 from chain.
Successfully remade target file 'gambuild-riscv-64.unix'.
Considering target file 'gambuild-riscv-64.bat.windows'.
File 'gambuild-riscv-64.bat.windows' does not exist.
Considering target file 'gambuild-riscv-64.bat.windows.in'.
Looking for an implicit rule for 'gambuild-riscv-64.bat.windows.in'.
Trying pattern rule with stem 'gambuild-riscv-64.bat.windows.in'.
Trying implicit prerequisite 'gambuild-riscv-64.bat.windows.in,v'.
Trying pattern rule with stem 'gambuild-riscv-64.bat.windows.in'.
Trying implicit prerequisite 'RCS/gambuild-riscv-64.bat.windows.in,v'.
Trying pattern rule with stem 'gambuild-riscv-64.bat.windows.in'.
Trying implicit prerequisite 'RCS/gambuild-riscv-64.bat.windows.in'.
Trying pattern rule with stem 'gambuild-riscv-64.bat.windows.in'.
Trying implicit prerequisite 's.gambuild-riscv-64.bat.windows.in'.
Trying pattern rule with stem 'gambuild-riscv-64.bat.windows.in'.
Trying implicit prerequisite 'SCCS/s.gambuild-riscv-64.bat.windows.in'.
No implicit rule found for 'gambuild-riscv-64.bat.windows.in'.
Finished prerequisites of target file 'gambuild-riscv-64.bat.windows.in'.
No need to remake target 'gambuild-riscv-64.bat.windows.in'.
Pruning file '../config.status'.
Finished prerequisites of target file 'gambuild-riscv-64.bat.windows'.
Must remake target 'gambuild-riscv-64.bat.windows'.
makefile:643: update target 'gambuild-riscv-64.bat.windows' due to: gambuild-riscv-64.bat.windows.in ../config.status
cd .. && CONFIG_FILES=bin/gambuild-riscv-64.bat.windows CONFIG_HEADERS= ./config.status
Putting child 0x7f59a3c24a60 (gambuild-riscv-64.bat.windows) PID 1413 on the chain.
Live child 0x7f59a3c24a60 (gambuild-riscv-64.bat.windows) PID 1413
config.status: creating bin/gambuild-riscv-64.bat.windows
Reaping winning child 0x7f59a3c24a60 PID 1413
Removing child 0x7f59a3c24a60 PID 1413 from chain.
Successfully remade target file 'gambuild-riscv-64.bat.windows'.
Finished prerequisites of target file 'gambuild-riscv-64'.
Must remake target 'gambuild-riscv-64'.
makefile:221: update target 'gambuild-riscv-64' due to: makefile gambuild-riscv-64.unix gambuild-riscv-64.bat.windows
rm -f gambuild-riscv-64
Putting child 0x7f59a3c24a60 (gambuild-riscv-64) PID 1477 on the chain.
Live child 0x7f59a3c24a60 (gambuild-riscv-64) PID 1477
Reaping winning child 0x7f59a3c24a60 PID 1477
if test "" = ""; then \
cp gambuild-riscv-64.unix gambuild-riscv-64; \
chmod +x gambuild-riscv-64; \
else \
sed "s/\$/\r/g" gambuild-riscv-64.bat.windows > gambuild-riscv-64; \
fi
Live child 0x7f59a3c24a60 (gambuild-riscv-64) PID 1478
Reaping winning child 0x7f59a3c24a60 PID 1478
Removing child 0x7f59a3c24a60 PID 1478 from chain.
Successfully remade target file 'gambuild-riscv-64'.
Considering target file 'gambdoc'.
File 'gambdoc' does not exist.
Pruning file 'makefile'.
Considering target file 'gambdoc.unix'.
File 'gambdoc.unix' does not exist.
Considering target file 'gambdoc.unix.in'.
Looking for an implicit rule for 'gambdoc.unix.in'.
Trying pattern rule with stem 'gambdoc.unix.in'.
Trying implicit prerequisite 'gambdoc.unix.in,v'.
Trying pattern rule with stem 'gambdoc.unix.in'.
Trying implicit prerequisite 'RCS/gambdoc.unix.in,v'.
Trying pattern rule with stem 'gambdoc.unix.in'.
Trying implicit prerequisite 'RCS/gambdoc.unix.in'.
Trying pattern rule with stem 'gambdoc.unix.in'.
Trying implicit prerequisite 's.gambdoc.unix.in'.
Trying pattern rule with stem 'gambdoc.unix.in'.
Trying implicit prerequisite 'SCCS/s.gambdoc.unix.in'.
No implicit rule found for 'gambdoc.unix.in'.
Finished prerequisites of target file 'gambdoc.unix.in'.
No need to remake target 'gambdoc.unix.in'.
Pruning file '../config.status'.
Finished prerequisites of target file 'gambdoc.unix'.
Must remake target 'gambdoc.unix'.
makefile:646: update target 'gambdoc.unix' due to: gambdoc.unix.in ../config.status
cd .. && CONFIG_FILES=bin/gambdoc.unix CONFIG_HEADERS= ./config.status
Putting child 0x7f59a3c1f830 (gambdoc.unix) PID 1480 on the chain.
Live child 0x7f59a3c1f830 (gambdoc.unix) PID 1480
config.status: creating bin/gambdoc.unix
Reaping winning child 0x7f59a3c1f830 PID 1480
Removing child 0x7f59a3c1f830 PID 1480 from chain.
Successfully remade target file 'gambdoc.unix'.
Considering target file 'gambdoc.bat.windows'.
File 'gambdoc.bat.windows' does not exist.
Considering target file 'gambdoc.bat.windows.in'.
Looking for an implicit rule for 'gambdoc.bat.windows.in'.
Trying pattern rule with stem 'gambdoc.bat.windows.in'.
Trying implicit prerequisite 'gambdoc.bat.windows.in,v'.
Trying pattern rule with stem 'gambdoc.bat.windows.in'.
Trying implicit prerequisite 'RCS/gambdoc.bat.windows.in,v'.
Trying pattern rule with stem 'gambdoc.bat.windows.in'.
Trying implicit prerequisite 'RCS/gambdoc.bat.windows.in'.
Trying pattern rule with stem 'gambdoc.bat.windows.in'.
Trying implicit prerequisite 's.gambdoc.bat.windows.in'.
Trying pattern rule with stem 'gambdoc.bat.windows.in'.
Trying implicit prerequisite 'SCCS/s.gambdoc.bat.windows.in'.
No implicit rule found for 'gambdoc.bat.windows.in'.
Finished prerequisites of target file 'gambdoc.bat.windows.in'.
No need to remake target 'gambdoc.bat.windows.in'.
Pruning file '../config.status'.
Finished prerequisites of target file 'gambdoc.bat.windows'.
Must remake target 'gambdoc.bat.windows'.
makefile:649: update target 'gambdoc.bat.windows' due to: gambdoc.bat.windows.in ../config.status
cd .. && CONFIG_FILES=bin/gambdoc.bat.windows CONFIG_HEADERS= ./config.status
Putting child 0x7f59a3c1fa10 (gambdoc.bat.windows) PID 1544 on the chain.
Live child 0x7f59a3c1fa10 (gambdoc.bat.windows) PID 1544
config.status: creating bin/gambdoc.bat.windows
Reaping winning child 0x7f59a3c1fa10 PID 1544
Removing child 0x7f59a3c1fa10 PID 1544 from chain.
Successfully remade target file 'gambdoc.bat.windows'.
Finished prerequisites of target file 'gambdoc'.
Must remake target 'gambdoc'.
makefile:230: update target 'gambdoc' due to: makefile gambdoc.unix gambdoc.bat.windows
rm -f gambdoc
Putting child 0x7f59a3c1fb30 (gambdoc) PID 1608 on the chain.
Live child 0x7f59a3c1fb30 (gambdoc) PID 1608
Reaping winning child 0x7f59a3c1fb30 PID 1608
if test "" = ""; then \
cp gambdoc.unix gambdoc; \
chmod +x gambdoc; \
else \
sed "s/\$/\r/g" gambdoc.bat.windows > gambdoc; \
fi
Live child 0x7f59a3c1fb30 (gambdoc) PID 1609
Reaping winning child 0x7f59a3c1fb30 PID 1609
Removing child 0x7f59a3c1fb30 PID 1609 from chain.
Successfully remade target file 'gambdoc'.
Considering target file 'six'.
File 'six' does not exist.
Pruning file 'makefile'.
Finished prerequisites of target file 'six'.
Must remake target 'six'.
makefile:239: update target 'six' due to: makefile
rm -f six six.lnk
Putting child 0x7f59a3c1fbf0 (six) PID 1611 on the chain.
Live child 0x7f59a3c1fbf0 (six) PID 1611
Reaping winning child 0x7f59a3c1fbf0 PID 1611
if test "" = ""; then \
ln -s ../gsi/gsi six; \
else \
echo "@%~dp0gsi %*" > six; \
fi
Live child 0x7f59a3c1fbf0 (six) PID 1612
Reaping winning child 0x7f59a3c1fbf0 PID 1612
Removing child 0x7f59a3c1fbf0 PID 1612 from chain.
Successfully remade target file 'six'.
Considering target file 'gsi-script'.
File 'gsi-script' does not exist.
Pruning file 'makefile'.
Finished prerequisites of target file 'gsi-script'.
Must remake target 'gsi-script'.
makefile:247: update target 'gsi-script' due to: makefile
rm -f gsi-script gsi-script.lnk
Putting child 0x7f59a3c1fd10 (gsi-script) PID 1613 on the chain.
Live child 0x7f59a3c1fd10 (gsi-script) PID 1613
Reaping winning child 0x7f59a3c1fd10 PID 1613
if test "" = ""; then \
ln -s ../gsi/gsi gsi-script; \
else \
echo "@%~dp0gsi %*" > gsi-script; \
fi
Live child 0x7f59a3c1fd10 (gsi-script) PID 1614
Reaping winning child 0x7f59a3c1fd10 PID 1614
Removing child 0x7f59a3c1fd10 PID 1614 from chain.
Successfully remade target file 'gsi-script'.
Considering target file 'gsc-script'.
File 'gsc-script' does not exist.
Pruning file 'makefile'.
Finished prerequisites of target file 'gsc-script'.
Must remake target 'gsc-script'.
makefile:255: update target 'gsc-script' due to: makefile
rm -f gsc-script gsc-script.lnk
Putting child 0x7f59a3c1fdd0 (gsc-script) PID 1615 on the chain.
Live child 0x7f59a3c1fdd0 (gsc-script) PID 1615
Reaping winning child 0x7f59a3c1fdd0 PID 1615
if test "" = ""; then \
ln -s ../gsc/gsc gsc-script; \
else \
echo "@%~dp0gsc %*" > gsc-script; \
fi
Live child 0x7f59a3c1fdd0 (gsc-script) PID 1616
Reaping winning child 0x7f59a3c1fdd0 PID 1616
Removing child 0x7f59a3c1fdd0 PID 1616 from chain.
Successfully remade target file 'gsc-script'.
Considering target file 'six-script'.
File 'six-script' does not exist.
Pruning file 'makefile'.
Finished prerequisites of target file 'six-script'.
Must remake target 'six-script'.
makefile:263: update target 'six-script' due to: makefile
rm -f six-script six-script.lnk
Putting child 0x7f59a3c1fe90 (six-script) PID 1617 on the chain.
Live child 0x7f59a3c1fe90 (six-script) PID 1617
Reaping winning child 0x7f59a3c1fe90 PID 1617
if test "" = ""; then \
ln -s ../gsi/gsi six-script; \
else \
echo "@%~dp0gsi %*" > six-script; \
fi
Live child 0x7f59a3c1fe90 (six-script) PID 1618
Reaping winning child 0x7f59a3c1fe90 PID 1618
Removing child 0x7f59a3c1fe90 PID 1618 from chain.
Successfully remade target file 'six-script'.
Considering target file 'scheme-srfi-0'.
File 'scheme-srfi-0' does not exist.
Pruning file 'makefile'.
Finished prerequisites of target file 'scheme-srfi-0'.
Must remake target 'scheme-srfi-0'.
makefile:271: update target 'scheme-srfi-0' due to: makefile
rm -f scheme-srfi-0 scheme-srfi-0.lnk
Putting child 0x7f59a3c1ff50 (scheme-srfi-0) PID 1619 on the chain.
Live child 0x7f59a3c1ff50 (scheme-srfi-0) PID 1619
Reaping winning child 0x7f59a3c1ff50 PID 1619
if test "" = ""; then \
ln -s ../gsi/gsi scheme-srfi-0; \
else \
echo "@%~dp0gsi %*" > scheme-srfi-0; \
fi
Live child 0x7f59a3c1ff50 (scheme-srfi-0) PID 1620
Reaping winning child 0x7f59a3c1ff50 PID 1620
Removing child 0x7f59a3c1ff50 PID 1620 from chain.
Successfully remade target file 'scheme-srfi-0'.
Considering target file 'scheme-r5rs'.
File 'scheme-r5rs' does not exist.
Pruning file 'makefile'.
Finished prerequisites of target file 'scheme-r5rs'.
Must remake target 'scheme-r5rs'.
makefile:279: update target 'scheme-r5rs' due to: makefile
rm -f scheme-r5rs scheme-r5rs.lnk
Putting child 0x7f59a3c1f890 (scheme-r5rs) PID 1621 on the chain.
Live child 0x7f59a3c1f890 (scheme-r5rs) PID 1621
Reaping winning child 0x7f59a3c1f890 PID 1621
if test "" = ""; then \
ln -s ../gsi/gsi scheme-r5rs; \
else \
echo "@%~dp0gsi %*" > scheme-r5rs; \
fi
Live child 0x7f59a3c1f890 (scheme-r5rs) PID 1622
Reaping winning child 0x7f59a3c1f890 PID 1622
Removing child 0x7f59a3c1f890 PID 1622 from chain.
Successfully remade target file 'scheme-r5rs'.
Considering target file 'scheme-r4rs'.
File 'scheme-r4rs' does not exist.
Pruning file 'makefile'.
Finished prerequisites of target file 'scheme-r4rs'.
Must remake target 'scheme-r4rs'.
makefile:287: update target 'scheme-r4rs' due to: makefile
rm -f scheme-r4rs scheme-r4rs.lnk
Putting child 0x7f59a3c1fa10 (scheme-r4rs) PID 1623 on the chain.
Live child 0x7f59a3c1fa10 (scheme-r4rs) PID 1623
Reaping winning child 0x7f59a3c1fa10 PID 1623
if test "" = ""; then \
ln -s ../gsi/gsi scheme-r4rs; \
else \
echo "@%~dp0gsi %*" > scheme-r4rs; \
fi
Live child 0x7f59a3c1fa10 (scheme-r4rs) PID 1624
Reaping winning child 0x7f59a3c1fa10 PID 1624
Removing child 0x7f59a3c1fa10 PID 1624 from chain.
Successfully remade target file 'scheme-r4rs'.
Considering target file 'scheme-ieee-1178-1990'.
File 'scheme-ieee-1178-1990' does not exist.
Pruning file 'makefile'.
Finished prerequisites of target file 'scheme-ieee-1178-1990'.
Must remake target 'scheme-ieee-1178-1990'.
makefile:295: update target 'scheme-ieee-1178-1990' due to: makefile
rm -f scheme-ieee-1178-1990 scheme-ieee-1178-1990.lnk
Putting child 0x7f59a3c1fad0 (scheme-ieee-1178-1990) PID 1625 on the chain.
Live child 0x7f59a3c1fad0 (scheme-ieee-1178-1990) PID 1625
Reaping winning child 0x7f59a3c1fad0 PID 1625
if test "" = ""; then \
ln -s ../gsi/gsi scheme-ieee-1178-1990; \
else \
echo "@%~dp0gsi %*" > scheme-ieee-1178-1990; \
fi
Live child 0x7f59a3c1fad0 (scheme-ieee-1178-1990) PID 1626
Reaping winning child 0x7f59a3c1fad0 PID 1626
Removing child 0x7f59a3c1fad0 PID 1626 from chain.
Successfully remade target file 'scheme-ieee-1178-1990'.
Considering target file 'all-recursive'.
File 'all-recursive' does not exist.
Considering target file 'all-pre'.
File 'all-pre' does not exist.
Looking for an implicit rule for 'all-pre'.
Trying pattern rule with stem 'all-pre'.
Trying implicit prerequisite 'all-pre,v'.
Trying pattern rule with stem 'all-pre'.
Trying implicit prerequisite 'RCS/all-pre,v'.
Trying pattern rule with stem 'all-pre'.
Trying implicit prerequisite 'RCS/all-pre'.
Trying pattern rule with stem 'all-pre'.
Trying implicit prerequisite 's.all-pre'.
Trying pattern rule with stem 'all-pre'.
Trying implicit prerequisite 'SCCS/s.all-pre'.
No implicit rule found for 'all-pre'.
Finished prerequisites of target file 'all-pre'.
Must remake target 'all-pre'.
Successfully remade target file 'all-pre'.
Finished prerequisites of target file 'all-recursive'.
Must remake target 'all-recursive'.
makefile:484: update target 'all-recursive' due to: all-pre
if test -n ""; then \
for subdir in ""; do \
target=`echo all-recursive | sed 's/-recursive//'`; \
echo making $target in $subdir; \
(cd $subdir && make $target) || exit 1; \
done \
fi
Putting child 0x7f59a3c1fbf0 (all-recursive) PID 1627 on the chain.
Live child 0x7f59a3c1fbf0 (all-recursive) PID 1627
Reaping winning child 0x7f59a3c1fbf0 PID 1627
Removing child 0x7f59a3c1fbf0 PID 1627 from chain.
Successfully remade target file 'all-recursive'.
Finished prerequisites of target file 'all-post'.
Must remake target 'all-post'.
Successfully remade target file 'all-post'.
Finished prerequisites of target file 'all'.
Must remake target 'all'.
Successfully remade target file 'all'.
make[1]: Leaving directory '/opt/gambit-src/bin'
making all in lib
GNU Make 4.3
Built for x86_64-alpine-linux-musl
Copyright (C) 1988-2020 Free Software Foundation, Inc.
License GPLv3+: GNU GPL version 3 or later <http://gnu.org/licenses/gpl.html>
This is free software: you are free to change and redistribute it.
There is NO WARRANTY, to the extent permitted by law.
Reading makefiles...
Reading makefile 'makefile'...
Updating makefiles....
Considering target file 'makefile'.
Considering target file 'makefile.in'.
Looking for an implicit rule for 'makefile.in'.
Trying pattern rule with stem 'makefile.in'.
Trying implicit prerequisite 'makefile.in.c'.
Trying pattern rule with stem 'makefile.in'.
Trying implicit prerequisite 'makefile.in.o'.
Trying pattern rule with stem 'makefile.in'.
Trying implicit prerequisite 'makefile.in,v'.
Trying pattern rule with stem 'makefile.in'.
Trying implicit prerequisite 'RCS/makefile.in,v'.
Trying pattern rule with stem 'makefile.in'.
Trying implicit prerequisite 'RCS/makefile.in'.
Trying pattern rule with stem 'makefile.in'.
Trying implicit prerequisite 's.makefile.in'.
Trying pattern rule with stem 'makefile.in'.
Trying implicit prerequisite 'SCCS/s.makefile.in'.
Trying pattern rule with stem 'makefile.in'.
Trying implicit prerequisite 'makefile.in.c'.
Looking for a rule with intermediate file 'makefile.in.c'.
Avoiding implicit rule recursion.
Trying pattern rule with stem 'makefile.in'.
Trying implicit prerequisite 'makefile.in.scm'.
Trying pattern rule with stem 'makefile.in'.
Trying implicit prerequisite 'makefile.in.w'.
Trying pattern rule with stem 'makefile.in.c'.
Trying implicit prerequisite 'makefile.in.c,v'.
Trying pattern rule with stem 'makefile.in.c'.
Trying implicit prerequisite 'RCS/makefile.in.c,v'.
Trying pattern rule with stem 'makefile.in.c'.
Trying implicit prerequisite 'RCS/makefile.in.c'.
Trying pattern rule with stem 'makefile.in.c'.
Trying implicit prerequisite 's.makefile.in.c'.
Trying pattern rule with stem 'makefile.in.c'.
Trying implicit prerequisite 'SCCS/s.makefile.in.c'.
Trying pattern rule with stem 'makefile.in'.
Trying implicit prerequisite 'makefile.in.scm'.
Looking for a rule with intermediate file 'makefile.in.scm'.
Avoiding implicit rule recursion.
Avoiding implicit rule recursion.
Trying pattern rule with stem 'makefile.in.scm'.
Trying implicit prerequisite 'makefile.in.scm,v'.
Trying pattern rule with stem 'makefile.in.scm'.
Trying implicit prerequisite 'RCS/makefile.in.scm,v'.
Trying pattern rule with stem 'makefile.in.scm'.
Trying implicit prerequisite 'RCS/makefile.in.scm'.
Trying pattern rule with stem 'makefile.in.scm'.
Trying implicit prerequisite 's.makefile.in.scm'.
Trying pattern rule with stem 'makefile.in.scm'.
Trying implicit prerequisite 'SCCS/s.makefile.in.scm'.
Trying pattern rule with stem 'makefile.in'.
Trying implicit prerequisite 'makefile.in.w'.
Looking for a rule with intermediate file 'makefile.in.w'.
Avoiding implicit rule recursion.
Avoiding implicit rule recursion.
Trying pattern rule with stem 'makefile.in.w'.
Trying implicit prerequisite 'makefile.in.w,v'.
Trying pattern rule with stem 'makefile.in.w'.
Trying implicit prerequisite 'RCS/makefile.in.w,v'.
Trying pattern rule with stem 'makefile.in.w'.
Trying implicit prerequisite 'RCS/makefile.in.w'.
Trying pattern rule with stem 'makefile.in.w'.
Trying implicit prerequisite 's.makefile.in.w'.
Trying pattern rule with stem 'makefile.in.w'.
Trying implicit prerequisite 'SCCS/s.makefile.in.w'.
Trying pattern rule with stem 'makefile.in'.
Trying implicit prerequisite 'makefile.in.o'.
Looking for a rule with intermediate file 'makefile.in.o'.
Avoiding implicit rule recursion.
Trying pattern rule with stem 'makefile.in'.
Rejecting impossible implicit prerequisite 'makefile.in.c'.
Trying pattern rule with stem 'makefile.in.o'.
Trying implicit prerequisite 'makefile.in.o,v'.
Trying pattern rule with stem 'makefile.in.o'.
Trying implicit prerequisite 'RCS/makefile.in.o,v'.
Trying pattern rule with stem 'makefile.in.o'.
Trying implicit prerequisite 'RCS/makefile.in.o'.
Trying pattern rule with stem 'makefile.in.o'.
Trying implicit prerequisite 's.makefile.in.o'.
Trying pattern rule with stem 'makefile.in.o'.
Trying implicit prerequisite 'SCCS/s.makefile.in.o'.
No implicit rule found for 'makefile.in'.
Finished prerequisites of target file 'makefile.in'.
No need to remake target 'makefile.in'.
Considering target file '../config.status'.
Looking for an implicit rule for '../config.status'.
Trying pattern rule with stem 'config.status'.
Trying implicit prerequisite '../config.status.c'.
Trying pattern rule with stem 'config.status'.
Trying implicit prerequisite '../config.status.o'.
Trying pattern rule with stem 'config.status'.
Trying implicit prerequisite '../config.status,v'.
Trying pattern rule with stem 'config.status'.
Trying implicit prerequisite '../RCS/config.status,v'.
Trying pattern rule with stem 'config.status'.
Trying implicit prerequisite '../RCS/config.status'.
Trying pattern rule with stem 'config.status'.
Trying implicit prerequisite '../s.config.status'.
Trying pattern rule with stem 'config.status'.
Trying implicit prerequisite '../SCCS/s.config.status'.
Trying pattern rule with stem 'config.status'.
Trying implicit prerequisite '../config.status.c'.
Looking for a rule with intermediate file '../config.status.c'.
Avoiding implicit rule recursion.
Trying pattern rule with stem 'config.status'.
Trying implicit prerequisite '../config.status.scm'.
Trying pattern rule with stem 'config.status'.
Trying implicit prerequisite '../config.status.w'.
Trying pattern rule with stem 'config.status.c'.
Trying implicit prerequisite '../config.status.c,v'.
Trying pattern rule with stem 'config.status.c'.
Trying implicit prerequisite '../RCS/config.status.c,v'.
Trying pattern rule with stem 'config.status.c'.
Trying implicit prerequisite '../RCS/config.status.c'.
Trying pattern rule with stem 'config.status.c'.
Trying implicit prerequisite '../s.config.status.c'.
Trying pattern rule with stem 'config.status.c'.
Trying implicit prerequisite '../SCCS/s.config.status.c'.
Trying pattern rule with stem 'config.status'.
Trying implicit prerequisite '../config.status.scm'.
Looking for a rule with intermediate file '../config.status.scm'.
Avoiding implicit rule recursion.
Avoiding implicit rule recursion.
Trying pattern rule with stem 'config.status.scm'.
Trying implicit prerequisite '../config.status.scm,v'.
Trying pattern rule with stem 'config.status.scm'.
Trying implicit prerequisite '../RCS/config.status.scm,v'.
Trying pattern rule with stem 'config.status.scm'.
Trying implicit prerequisite '../RCS/config.status.scm'.
Trying pattern rule with stem 'config.status.scm'.
Trying implicit prerequisite '../s.config.status.scm'.
Trying pattern rule with stem 'config.status.scm'.
Trying implicit prerequisite '../SCCS/s.config.status.scm'.
Trying pattern rule with stem 'config.status'.
Trying implicit prerequisite '../config.status.w'.
Looking for a rule with intermediate file '../config.status.w'.
Avoiding implicit rule recursion.
Avoiding implicit rule recursion.
Trying pattern rule with stem 'config.status.w'.
Trying implicit prerequisite '../config.status.w,v'.
Trying pattern rule with stem 'config.status.w'.
Trying implicit prerequisite '../RCS/config.status.w,v'.
Trying pattern rule with stem 'config.status.w'.
Trying implicit prerequisite '../RCS/config.status.w'.
Trying pattern rule with stem 'config.status.w'.
Trying implicit prerequisite '../s.config.status.w'.
Trying pattern rule with stem 'config.status.w'.
Trying implicit prerequisite '../SCCS/s.config.status.w'.
Trying pattern rule with stem 'config.status'.
Trying implicit prerequisite '../config.status.o'.
Looking for a rule with intermediate file '../config.status.o'.
Avoiding implicit rule recursion.
Trying pattern rule with stem 'config.status'.
Rejecting impossible implicit prerequisite '../config.status.c'.
Trying pattern rule with stem 'config.status.o'.
Trying implicit prerequisite '../config.status.o,v'.
Trying pattern rule with stem 'config.status.o'.
Trying implicit prerequisite '../RCS/config.status.o,v'.
Trying pattern rule with stem 'config.status.o'.
Trying implicit prerequisite '../RCS/config.status.o'.
Trying pattern rule with stem 'config.status.o'.
Trying implicit prerequisite '../s.config.status.o'.
Trying pattern rule with stem 'config.status.o'.
Trying implicit prerequisite '../SCCS/s.config.status.o'.
No implicit rule found for '../config.status'.
Finished prerequisites of target file '../config.status'.
No need to remake target '../config.status'.
Finished prerequisites of target file 'makefile'.
Prerequisite 'makefile.in' is older than target 'makefile'.
Prerequisite '../config.status' is older than target 'makefile'.
No need to remake target 'makefile'.
Updating goal targets....
Considering target file 'all'.
File 'all' does not exist.
Looking for an implicit rule for 'all'.
Trying pattern rule with stem 'all'.
Trying implicit prerequisite 'all.c'.
Trying pattern rule with stem 'all'.
Trying implicit prerequisite 'all.o'.
Trying pattern rule with stem 'all'.
Trying implicit prerequisite 'all,v'.
Trying pattern rule with stem 'all'.
Trying implicit prerequisite 'RCS/all,v'.
Trying pattern rule with stem 'all'.
Trying implicit prerequisite 'RCS/all'.
Trying pattern rule with stem 'all'.
Trying implicit prerequisite 's.all'.
Trying pattern rule with stem 'all'.
Trying implicit prerequisite 'SCCS/s.all'.
Trying pattern rule with stem 'all'.
Trying implicit prerequisite 'all.c'.
Looking for a rule with intermediate file 'all.c'.
Avoiding implicit rule recursion.
Trying pattern rule with stem 'all'.
Trying implicit prerequisite 'all.scm'.
Trying pattern rule with stem 'all'.
Trying implicit prerequisite 'all.w'.
Trying pattern rule with stem 'all.c'.
Trying implicit prerequisite 'all.c,v'.
Trying pattern rule with stem 'all.c'.
Trying implicit prerequisite 'RCS/all.c,v'.
Trying pattern rule with stem 'all.c'.
Trying implicit prerequisite 'RCS/all.c'.
Trying pattern rule with stem 'all.c'.
Trying implicit prerequisite 's.all.c'.
Trying pattern rule with stem 'all.c'.
Trying implicit prerequisite 'SCCS/s.all.c'.
Trying pattern rule with stem 'all'.
Trying implicit prerequisite 'all.scm'.
Looking for a rule with intermediate file 'all.scm'.
Avoiding implicit rule recursion.
Avoiding implicit rule recursion.
Trying pattern rule with stem 'all.scm'.
Trying implicit prerequisite 'all.scm,v'.
Trying pattern rule with stem 'all.scm'.
Trying implicit prerequisite 'RCS/all.scm,v'.
Trying pattern rule with stem 'all.scm'.
Trying implicit prerequisite 'RCS/all.scm'.
Trying pattern rule with stem 'all.scm'.
Trying implicit prerequisite 's.all.scm'.
Trying pattern rule with stem 'all.scm'.
Trying implicit prerequisite 'SCCS/s.all.scm'.
Trying pattern rule with stem 'all'.
Trying implicit prerequisite 'all.w'.
Looking for a rule with intermediate file 'all.w'.
Avoiding implicit rule recursion.
Avoiding implicit rule recursion.
Trying pattern rule with stem 'all.w'.
Trying implicit prerequisite 'all.w,v'.
Trying pattern rule with stem 'all.w'.
Trying implicit prerequisite 'RCS/all.w,v'.
Trying pattern rule with stem 'all.w'.
Trying implicit prerequisite 'RCS/all.w'.
Trying pattern rule with stem 'all.w'.
Trying implicit prerequisite 's.all.w'.
Trying pattern rule with stem 'all.w'.
Trying implicit prerequisite 'SCCS/s.all.w'.
Trying pattern rule with stem 'all'.
Trying implicit prerequisite 'all.o'.
Looking for a rule with intermediate file 'all.o'.
Avoiding implicit rule recursion.
Trying pattern rule with stem 'all'.
Rejecting impossible implicit prerequisite 'all.c'.
Trying pattern rule with stem 'all.o'.
Trying implicit prerequisite 'all.o,v'.
Trying pattern rule with stem 'all.o'.
Trying implicit prerequisite 'RCS/all.o,v'.
Trying pattern rule with stem 'all.o'.
Trying implicit prerequisite 'RCS/all.o'.
Trying pattern rule with stem 'all.o'.
Trying implicit prerequisite 's.all.o'.
Trying pattern rule with stem 'all.o'.
Trying implicit prerequisite 'SCCS/s.all.o'.
No implicit rule found for 'all'.
Considering target file 'all-post'.
File 'all-post' does not exist.
Considering target file 'all-recursive'.
File 'all-recursive' does not exist.
Considering target file 'all-pre'.
File 'all-pre' does not exist.
Looking for an implicit rule for 'all-pre'.
Trying pattern rule with stem 'all-pre'.
Trying implicit prerequisite 'all-pre.c'.
Trying pattern rule with stem 'all-pre'.
Trying implicit prerequisite 'all-pre.o'.
Trying pattern rule with stem 'all-pre'.
Trying implicit prerequisite 'all-pre,v'.
Trying pattern rule with stem 'all-pre'.
Trying implicit prerequisite 'RCS/all-pre,v'.
Trying pattern rule with stem 'all-pre'.
Trying implicit prerequisite 'RCS/all-pre'.
Trying pattern rule with stem 'all-pre'.
Trying implicit prerequisite 's.all-pre'.
Trying pattern rule with stem 'all-pre'.
Trying implicit prerequisite 'SCCS/s.all-pre'.
Trying pattern rule with stem 'all-pre'.
Trying implicit prerequisite 'all-pre.c'.
Looking for a rule with intermediate file 'all-pre.c'.
Avoiding implicit rule recursion.
Trying pattern rule with stem 'all-pre'.
Trying implicit prerequisite 'all-pre.scm'.
Trying pattern rule with stem 'all-pre'.
Trying implicit prerequisite 'all-pre.w'.
Trying pattern rule with stem 'all-pre.c'.
Trying implicit prerequisite 'all-pre.c,v'.
Trying pattern rule with stem 'all-pre.c'.
Trying implicit prerequisite 'RCS/all-pre.c,v'.
Trying pattern rule with stem 'all-pre.c'.
Trying implicit prerequisite 'RCS/all-pre.c'.
Trying pattern rule with stem 'all-pre.c'.
Trying implicit prerequisite 's.all-pre.c'.
Trying pattern rule with stem 'all-pre.c'.
Trying implicit prerequisite 'SCCS/s.all-pre.c'.
Trying pattern rule with stem 'all-pre'.
Trying implicit prerequisite 'all-pre.scm'.
Looking for a rule with intermediate file 'all-pre.scm'.
Avoiding implicit rule recursion.
Avoiding implicit rule recursion.
Trying pattern rule with stem 'all-pre.scm'.
Trying implicit prerequisite 'all-pre.scm,v'.
Trying pattern rule with stem 'all-pre.scm'.
Trying implicit prerequisite 'RCS/all-pre.scm,v'.
Trying pattern rule with stem 'all-pre.scm'.
Trying implicit prerequisite 'RCS/all-pre.scm'.
Trying pattern rule with stem 'all-pre.scm'.
Trying implicit prerequisite 's.all-pre.scm'.
Trying pattern rule with stem 'all-pre.scm'.
Trying implicit prerequisite 'SCCS/s.all-pre.scm'.
Trying pattern rule with stem 'all-pre'.
Trying implicit prerequisite 'all-pre.w'.
Looking for a rule with intermediate file 'all-pre.w'.
Avoiding implicit rule recursion.
Avoiding implicit rule recursion.
Trying pattern rule with stem 'all-pre.w'.
Trying implicit prerequisite 'all-pre.w,v'.
Trying pattern rule with stem 'all-pre.w'.
Trying implicit prerequisite 'RCS/all-pre.w,v'.
Trying pattern rule with stem 'all-pre.w'.
Trying implicit prerequisite 'RCS/all-pre.w'.
Trying pattern rule with stem 'all-pre.w'.
Trying implicit prerequisite 's.all-pre.w'.
Trying pattern rule with stem 'all-pre.w'.
Trying implicit prerequisite 'SCCS/s.all-pre.w'.
Trying pattern rule with stem 'all-pre'.
Trying implicit prerequisite 'all-pre.o'.
Looking for a rule with intermediate file 'all-pre.o'.
Avoiding implicit rule recursion.
Trying pattern rule with stem 'all-pre'.
Rejecting impossible implicit prerequisite 'all-pre.c'.
Trying pattern rule with stem 'all-pre.o'.
Trying implicit prerequisite 'all-pre.o,v'.
Trying pattern rule with stem 'all-pre.o'.
Trying implicit prerequisite 'RCS/all-pre.o,v'.
Trying pattern rule with stem 'all-pre.o'.
Trying implicit prerequisite 'RCS/all-pre.o'.
Trying pattern rule with stem 'all-pre.o'.
Trying implicit prerequisite 's.all-pre.o'.
Trying pattern rule with stem 'all-pre.o'.
Trying implicit prerequisite 'SCCS/s.all-pre.o'.
No implicit rule found for 'all-pre'.
Considering target file 'libgambit.a'.
File 'libgambit.a' does not exist.
Considering target file '_io.o'.
File '_io.o' does not exist.
Considering target file '_io.c'.
File '_io.c' does not exist.
Looking for an implicit rule for '_io.c'.
Trying pattern rule with stem '_io'.
Trying implicit prerequisite '_io.scm'.
Found an implicit rule for '_io.c'.
Considering target file '_io.scm'.
Looking for an implicit rule for '_io.scm'.
Trying pattern rule with stem '_io.scm'.
Trying implicit prerequisite '_io.scm,v'.
Trying pattern rule with stem '_io.scm'.
Trying implicit prerequisite 'RCS/_io.scm,v'.
Trying pattern rule with stem '_io.scm'.
Trying implicit prerequisite 'RCS/_io.scm'.
Trying pattern rule with stem '_io.scm'.
Trying implicit prerequisite 's._io.scm'.
Trying pattern rule with stem '_io.scm'.
Trying implicit prerequisite 'SCCS/s._io.scm'.
No implicit rule found for '_io.scm'.
Finished prerequisites of target file '_io.scm'.
No need to remake target '_io.scm'.
Considering target file '../lib/header.scm'.
Looking for an implicit rule for '../lib/header.scm'.
Trying pattern rule with stem 'header.scm'.
Trying implicit prerequisite '../lib/header.scm,v'.
Trying pattern rule with stem 'header.scm'.
Trying implicit prerequisite '../lib/RCS/header.scm,v'.
Trying pattern rule with stem 'header.scm'.
Trying implicit prerequisite '../lib/RCS/header.scm'.
Trying pattern rule with stem 'header.scm'.
Trying implicit prerequisite '../lib/s.header.scm'.
Trying pattern rule with stem 'header.scm'.
Trying implicit prerequisite '../lib/SCCS/s.header.scm'.
No implicit rule found for '../lib/header.scm'.
Finished prerequisites of target file '../lib/header.scm'.
No need to remake target '../lib/header.scm'.
Considering target file '../lib/gambit#.scm'.
Looking for an implicit rule for '../lib/gambit#.scm'.
Trying pattern rule with stem 'gambit#.scm'.
Trying implicit prerequisite '../lib/gambit#.scm,v'.
Trying pattern rule with stem 'gambit#.scm'.
Trying implicit prerequisite '../lib/RCS/gambit#.scm,v'.
Trying pattern rule with stem 'gambit#.scm'.
Trying implicit prerequisite '../lib/RCS/gambit#.scm'.
Trying pattern rule with stem 'gambit#.scm'.
Trying implicit prerequisite '../lib/s.gambit#.scm'.
Trying pattern rule with stem 'gambit#.scm'.
Trying implicit prerequisite '../lib/SCCS/s.gambit#.scm'.
No implicit rule found for '../lib/gambit#.scm'.
Finished prerequisites of target file '../lib/gambit#.scm'.
No need to remake target '../lib/gambit#.scm'.
Considering target file '../lib/_gambit#.scm'.
Looking for an implicit rule for '../lib/_gambit#.scm'.
Trying pattern rule with stem '_gambit#.scm'.
Trying implicit prerequisite '../lib/_gambit#.scm,v'.
Trying pattern rule with stem '_gambit#.scm'.
Trying implicit prerequisite '../lib/RCS/_gambit#.scm,v'.
Trying pattern rule with stem '_gambit#.scm'.
Trying implicit prerequisite '../lib/RCS/_gambit#.scm'.
Trying pattern rule with stem '_gambit#.scm'.
Trying implicit prerequisite '../lib/s._gambit#.scm'.
Trying pattern rule with stem '_gambit#.scm'.
Trying implicit prerequisite '../lib/SCCS/s._gambit#.scm'.
No implicit rule found for '../lib/_gambit#.scm'.
Finished prerequisites of target file '../lib/_gambit#.scm'.
No need to remake target '../lib/_gambit#.scm'.
Considering target file '../lib/_kernel#.scm'.
Looking for an implicit rule for '../lib/_kernel#.scm'.
Trying pattern rule with stem '_kernel#.scm'.
Trying implicit prerequisite '../lib/_kernel#.scm,v'.
Trying pattern rule with stem '_kernel#.scm'.
Trying implicit prerequisite '../lib/RCS/_kernel#.scm,v'.
Trying pattern rule with stem '_kernel#.scm'.
Trying implicit prerequisite '../lib/RCS/_kernel#.scm'.
Trying pattern rule with stem '_kernel#.scm'.
Trying implicit prerequisite '../lib/s._kernel#.scm'.
Trying pattern rule with stem '_kernel#.scm'.
Trying implicit prerequisite '../lib/SCCS/s._kernel#.scm'.
No implicit rule found for '../lib/_kernel#.scm'.
Finished prerequisites of target file '../lib/_kernel#.scm'.
No need to remake target '../lib/_kernel#.scm'.
Considering target file '../lib/_system#.scm'.
Looking for an implicit rule for '../lib/_system#.scm'.
Trying pattern rule with stem '_system#.scm'.
Trying implicit prerequisite '../lib/_system#.scm,v'.
Trying pattern rule with stem '_system#.scm'.
Trying implicit prerequisite '../lib/RCS/_system#.scm,v'.
Trying pattern rule with stem '_system#.scm'.
Trying implicit prerequisite '../lib/RCS/_system#.scm'.
Trying pattern rule with stem '_system#.scm'.
Trying implicit prerequisite '../lib/s._system#.scm'.
Trying pattern rule with stem '_system#.scm'.
Trying implicit prerequisite '../lib/SCCS/s._system#.scm'.
No implicit rule found for '../lib/_system#.scm'.
Finished prerequisites of target file '../lib/_system#.scm'.
No need to remake target '../lib/_system#.scm'.
Considering target file '../lib/_num#.scm'.
Looking for an implicit rule for '../lib/_num#.scm'.
Trying pattern rule with stem '_num#.scm'.
Trying implicit prerequisite '../lib/_num#.scm,v'.
Trying pattern rule with stem '_num#.scm'.
Trying implicit prerequisite '../lib/RCS/_num#.scm,v'.
Trying pattern rule with stem '_num#.scm'.
Trying implicit prerequisite '../lib/RCS/_num#.scm'.
Trying pattern rule with stem '_num#.scm'.
Trying implicit prerequisite '../lib/s._num#.scm'.
Trying pattern rule with stem '_num#.scm'.
Trying implicit prerequisite '../lib/SCCS/s._num#.scm'.
No implicit rule found for '../lib/_num#.scm'.
Finished prerequisites of target file '../lib/_num#.scm'.
No need to remake target '../lib/_num#.scm'.
Considering target file '../lib/_std#.scm'.
Looking for an implicit rule for '../lib/_std#.scm'.
Trying pattern rule with stem '_std#.scm'.
Trying implicit prerequisite '../lib/_std#.scm,v'.
Trying pattern rule with stem '_std#.scm'.
Trying implicit prerequisite '../lib/RCS/_std#.scm,v'.
Trying pattern rule with stem '_std#.scm'.
Trying implicit prerequisite '../lib/RCS/_std#.scm'.
Trying pattern rule with stem '_std#.scm'.
Trying implicit prerequisite '../lib/s._std#.scm'.
Trying pattern rule with stem '_std#.scm'.
Trying implicit prerequisite '../lib/SCCS/s._std#.scm'.
No implicit rule found for '../lib/_std#.scm'.
Finished prerequisites of target file '../lib/_std#.scm'.
No need to remake target '../lib/_std#.scm'.
Considering target file '../lib/_eval#.scm'.
Looking for an implicit rule for '../lib/_eval#.scm'.
Trying pattern rule with stem '_eval#.scm'.
Trying implicit prerequisite '../lib/_eval#.scm,v'.
Trying pattern rule with stem '_eval#.scm'.
Trying implicit prerequisite '../lib/RCS/_eval#.scm,v'.
Trying pattern rule with stem '_eval#.scm'.
Trying implicit prerequisite '../lib/RCS/_eval#.scm'.
Trying pattern rule with stem '_eval#.scm'.
Trying implicit prerequisite '../lib/s._eval#.scm'.
Trying pattern rule with stem '_eval#.scm'.
Trying implicit prerequisite '../lib/SCCS/s._eval#.scm'.
No implicit rule found for '../lib/_eval#.scm'.
Finished prerequisites of target file '../lib/_eval#.scm'.
No need to remake target '../lib/_eval#.scm'.
Considering target file '../lib/_module#.scm'.
Looking for an implicit rule for '../lib/_module#.scm'.
Trying pattern rule with stem '_module#.scm'.
Trying implicit prerequisite '../lib/_module#.scm,v'.
Trying pattern rule with stem '_module#.scm'.
Trying implicit prerequisite '../lib/RCS/_module#.scm,v'.
Trying pattern rule with stem '_module#.scm'.
Trying implicit prerequisite '../lib/RCS/_module#.scm'.
Trying pattern rule with stem '_module#.scm'.
Trying implicit prerequisite '../lib/s._module#.scm'.
Trying pattern rule with stem '_module#.scm'.
Trying implicit prerequisite '../lib/SCCS/s._module#.scm'.
No implicit rule found for '../lib/_module#.scm'.
Finished prerequisites of target file '../lib/_module#.scm'.
No need to remake target '../lib/_module#.scm'.
Considering target file '../lib/_io#.scm'.
Looking for an implicit rule for '../lib/_io#.scm'.
Trying pattern rule with stem '_io#.scm'.
Trying implicit prerequisite '../lib/_io#.scm,v'.
Trying pattern rule with stem '_io#.scm'.
Trying implicit prerequisite '../lib/RCS/_io#.scm,v'.
Trying pattern rule with stem '_io#.scm'.
Trying implicit prerequisite '../lib/RCS/_io#.scm'.
Trying pattern rule with stem '_io#.scm'.
Trying implicit prerequisite '../lib/s._io#.scm'.
Trying pattern rule with stem '_io#.scm'.
Trying implicit prerequisite '../lib/SCCS/s._io#.scm'.
No implicit rule found for '../lib/_io#.scm'.
Finished prerequisites of target file '../lib/_io#.scm'.
No need to remake target '../lib/_io#.scm'.
Considering target file '../lib/_nonstd#.scm'.
Looking for an implicit rule for '../lib/_nonstd#.scm'.
Trying pattern rule with stem '_nonstd#.scm'.
Trying implicit prerequisite '../lib/_nonstd#.scm,v'.
Trying pattern rule with stem '_nonstd#.scm'.
Trying implicit prerequisite '../lib/RCS/_nonstd#.scm,v'.
Trying pattern rule with stem '_nonstd#.scm'.
Trying implicit prerequisite '../lib/RCS/_nonstd#.scm'.
Trying pattern rule with stem '_nonstd#.scm'.
Trying implicit prerequisite '../lib/s._nonstd#.scm'.
Trying pattern rule with stem '_nonstd#.scm'.
Trying implicit prerequisite '../lib/SCCS/s._nonstd#.scm'.
No implicit rule found for '../lib/_nonstd#.scm'.
Finished prerequisites of target file '../lib/_nonstd#.scm'.
No need to remake target '../lib/_nonstd#.scm'.
Considering target file '../lib/_thread#.scm'.
Looking for an implicit rule for '../lib/_thread#.scm'.
Trying pattern rule with stem '_thread#.scm'.
Trying implicit prerequisite '../lib/_thread#.scm,v'.
Trying pattern rule with stem '_thread#.scm'.
Trying implicit prerequisite '../lib/RCS/_thread#.scm,v'.
Trying pattern rule with stem '_thread#.scm'.
Trying implicit prerequisite '../lib/RCS/_thread#.scm'.
Trying pattern rule with stem '_thread#.scm'.
Trying implicit prerequisite '../lib/s._thread#.scm'.
Trying pattern rule with stem '_thread#.scm'.
Trying implicit prerequisite '../lib/SCCS/s._thread#.scm'.
No implicit rule found for '../lib/_thread#.scm'.
Finished prerequisites of target file '../lib/_thread#.scm'.
No need to remake target '../lib/_thread#.scm'.
Considering target file '../lib/_repl#.scm'.
Looking for an implicit rule for '../lib/_repl#.scm'.
Trying pattern rule with stem '_repl#.scm'.
Trying implicit prerequisite '../lib/_repl#.scm,v'.
Trying pattern rule with stem '_repl#.scm'.
Trying implicit prerequisite '../lib/RCS/_repl#.scm,v'.
Trying pattern rule with stem '_repl#.scm'.
Trying implicit prerequisite '../lib/RCS/_repl#.scm'.
Trying pattern rule with stem '_repl#.scm'.
Trying implicit prerequisite '../lib/s._repl#.scm'.
Trying pattern rule with stem '_repl#.scm'.
Trying implicit prerequisite '../lib/SCCS/s._repl#.scm'.
No implicit rule found for '../lib/_repl#.scm'.
Finished prerequisites of target file '../lib/_repl#.scm'.
No need to remake target '../lib/_repl#.scm'.
Considering target file '../lib/_define-syntax.scm'.
Looking for an implicit rule for '../lib/_define-syntax.scm'.
Trying pattern rule with stem '_define-syntax.scm'.
Trying implicit prerequisite '../lib/_define-syntax.scm,v'.
Trying pattern rule with stem '_define-syntax.scm'.
Trying implicit prerequisite '../lib/RCS/_define-syntax.scm,v'.
Trying pattern rule with stem '_define-syntax.scm'.
Trying implicit prerequisite '../lib/RCS/_define-syntax.scm'.
Trying pattern rule with stem '_define-syntax.scm'.
Trying implicit prerequisite '../lib/s._define-syntax.scm'.
Trying pattern rule with stem '_define-syntax.scm'.
Trying implicit prerequisite '../lib/SCCS/s._define-syntax.scm'.
No implicit rule found for '../lib/_define-syntax.scm'.
Finished prerequisites of target file '../lib/_define-syntax.scm'.
No need to remake target '../lib/_define-syntax.scm'.
Considering target file '../lib/_syntax-boot.scm'.
Looking for an implicit rule for '../lib/_syntax-boot.scm'.
Trying pattern rule with stem '_syntax-boot.scm'.
Trying implicit prerequisite '../lib/_syntax-boot.scm,v'.
Trying pattern rule with stem '_syntax-boot.scm'.
Trying implicit prerequisite '../lib/RCS/_syntax-boot.scm,v'.
Trying pattern rule with stem '_syntax-boot.scm'.
Trying implicit prerequisite '../lib/RCS/_syntax-boot.scm'.
Trying pattern rule with stem '_syntax-boot.scm'.
Trying implicit prerequisite '../lib/s._syntax-boot.scm'.
Trying pattern rule with stem '_syntax-boot.scm'.
Trying implicit prerequisite '../lib/SCCS/s._syntax-boot.scm'.
No implicit rule found for '../lib/_syntax-boot.scm'.
Finished prerequisites of target file '../lib/_syntax-boot.scm'.
No need to remake target '../lib/_syntax-boot.scm'.
Considering target file '../lib/_syntax-case-xform-boot.scm'.
Looking for an implicit rule for '../lib/_syntax-case-xform-boot.scm'.
Trying pattern rule with stem '_syntax-case-xform-boot.scm'.
Trying implicit prerequisite '../lib/_syntax-case-xform-boot.scm,v'.
Trying pattern rule with stem '_syntax-case-xform-boot.scm'.
Trying implicit prerequisite '../lib/RCS/_syntax-case-xform-boot.scm,v'.
Trying pattern rule with stem '_syntax-case-xform-boot.scm'.
Trying implicit prerequisite '../lib/RCS/_syntax-case-xform-boot.scm'.
Trying pattern rule with stem '_syntax-case-xform-boot.scm'.
Trying implicit prerequisite '../lib/s._syntax-case-xform-boot.scm'.
Trying pattern rule with stem '_syntax-case-xform-boot.scm'.
Trying implicit prerequisite '../lib/SCCS/s._syntax-case-xform-boot.scm'.
No implicit rule found for '../lib/_syntax-case-xform-boot.scm'.
Finished prerequisites of target file '../lib/_syntax-case-xform-boot.scm'.
No need to remake target '../lib/_syntax-case-xform-boot.scm'.
Considering target file '../lib/_syntax-case-xform.scm'.
Looking for an implicit rule for '../lib/_syntax-case-xform.scm'.
Trying pattern rule with stem '_syntax-case-xform.scm'.
Trying implicit prerequisite '../lib/_syntax-case-xform.scm,v'.
Trying pattern rule with stem '_syntax-case-xform.scm'.
Trying implicit prerequisite '../lib/RCS/_syntax-case-xform.scm,v'.
Trying pattern rule with stem '_syntax-case-xform.scm'.
Trying implicit prerequisite '../lib/RCS/_syntax-case-xform.scm'.
Trying pattern rule with stem '_syntax-case-xform.scm'.
Trying implicit prerequisite '../lib/s._syntax-case-xform.scm'.
Trying pattern rule with stem '_syntax-case-xform.scm'.
Trying implicit prerequisite '../lib/SCCS/s._syntax-case-xform.scm'.
No implicit rule found for '../lib/_syntax-case-xform.scm'.
Finished prerequisites of target file '../lib/_syntax-case-xform.scm'.
No need to remake target '../lib/_syntax-case-xform.scm'.
Considering target file '../lib/_syntax-common.scm'.
Looking for an implicit rule for '../lib/_syntax-common.scm'.
Trying pattern rule with stem '_syntax-common.scm'.
Trying implicit prerequisite '../lib/_syntax-common.scm,v'.
Trying pattern rule with stem '_syntax-common.scm'.
Trying implicit prerequisite '../lib/RCS/_syntax-common.scm,v'.
Trying pattern rule with stem '_syntax-common.scm'.
Trying implicit prerequisite '../lib/RCS/_syntax-common.scm'.
Trying pattern rule with stem '_syntax-common.scm'.
Trying implicit prerequisite '../lib/s._syntax-common.scm'.
Trying pattern rule with stem '_syntax-common.scm'.
Trying implicit prerequisite '../lib/SCCS/s._syntax-common.scm'.
No implicit rule found for '../lib/_syntax-common.scm'.
Finished prerequisites of target file '../lib/_syntax-common.scm'.
No need to remake target '../lib/_syntax-common.scm'.
Considering target file '../lib/_syntax-pattern.scm'.
Looking for an implicit rule for '../lib/_syntax-pattern.scm'.
Trying pattern rule with stem '_syntax-pattern.scm'.
Trying implicit prerequisite '../lib/_syntax-pattern.scm,v'.
Trying pattern rule with stem '_syntax-pattern.scm'.
Trying implicit prerequisite '../lib/RCS/_syntax-pattern.scm,v'.
Trying pattern rule with stem '_syntax-pattern.scm'.
Trying implicit prerequisite '../lib/RCS/_syntax-pattern.scm'.
Trying pattern rule with stem '_syntax-pattern.scm'.
Trying implicit prerequisite '../lib/s._syntax-pattern.scm'.
Trying pattern rule with stem '_syntax-pattern.scm'.
Trying implicit prerequisite '../lib/SCCS/s._syntax-pattern.scm'.
No implicit rule found for '../lib/_syntax-pattern.scm'.
Finished prerequisites of target file '../lib/_syntax-pattern.scm'.
No need to remake target '../lib/_syntax-pattern.scm'.
Considering target file '../lib/_syntax-rules-xform.scm'.
Looking for an implicit rule for '../lib/_syntax-rules-xform.scm'.
Trying pattern rule with stem '_syntax-rules-xform.scm'.
Trying implicit prerequisite '../lib/_syntax-rules-xform.scm,v'.
Trying pattern rule with stem '_syntax-rules-xform.scm'.
Trying implicit prerequisite '../lib/RCS/_syntax-rules-xform.scm,v'.
Trying pattern rule with stem '_syntax-rules-xform.scm'.
Trying implicit prerequisite '../lib/RCS/_syntax-rules-xform.scm'.
Trying pattern rule with stem '_syntax-rules-xform.scm'.
Trying implicit prerequisite '../lib/s._syntax-rules-xform.scm'.
Trying pattern rule with stem '_syntax-rules-xform.scm'.
Trying implicit prerequisite '../lib/SCCS/s._syntax-rules-xform.scm'.
No implicit rule found for '../lib/_syntax-rules-xform.scm'.
Finished prerequisites of target file '../lib/_syntax-rules-xform.scm'.
No need to remake target '../lib/_syntax-rules-xform.scm'.
Considering target file '../lib/_syntax-template.scm'.
Looking for an implicit rule for '../lib/_syntax-template.scm'.
Trying pattern rule with stem '_syntax-template.scm'.
Trying implicit prerequisite '../lib/_syntax-template.scm,v'.
Trying pattern rule with stem '_syntax-template.scm'.
Trying implicit prerequisite '../lib/RCS/_syntax-template.scm,v'.
Trying pattern rule with stem '_syntax-template.scm'.
Trying implicit prerequisite '../lib/RCS/_syntax-template.scm'.
Trying pattern rule with stem '_syntax-template.scm'.
Trying implicit prerequisite '../lib/s._syntax-template.scm'.
Trying pattern rule with stem '_syntax-template.scm'.
Trying implicit prerequisite '../lib/SCCS/s._syntax-template.scm'.
No implicit rule found for '../lib/_syntax-template.scm'.
Finished prerequisites of target file '../lib/_syntax-template.scm'.
No need to remake target '../lib/_syntax-template.scm'.
Considering target file '../lib/_syntax-xform-boot.scm'.
Looking for an implicit rule for '../lib/_syntax-xform-boot.scm'.
Trying pattern rule with stem '_syntax-xform-boot.scm'.
Trying implicit prerequisite '../lib/_syntax-xform-boot.scm,v'.
Trying pattern rule with stem '_syntax-xform-boot.scm'.
Trying implicit prerequisite '../lib/RCS/_syntax-xform-boot.scm,v'.
Trying pattern rule with stem '_syntax-xform-boot.scm'.
Trying implicit prerequisite '../lib/RCS/_syntax-xform-boot.scm'.
Trying pattern rule with stem '_syntax-xform-boot.scm'.
Trying implicit prerequisite '../lib/s._syntax-xform-boot.scm'.
Trying pattern rule with stem '_syntax-xform-boot.scm'.
Trying implicit prerequisite '../lib/SCCS/s._syntax-xform-boot.scm'.
No implicit rule found for '../lib/_syntax-xform-boot.scm'.
Finished prerequisites of target file '../lib/_syntax-xform-boot.scm'.
No need to remake target '../lib/_syntax-xform-boot.scm'.
Considering target file '../lib/_syntax-xform.scm'.
Looking for an implicit rule for '../lib/_syntax-xform.scm'.
Trying pattern rule with stem '_syntax-xform.scm'.
Trying implicit prerequisite '../lib/_syntax-xform.scm,v'.
Trying pattern rule with stem '_syntax-xform.scm'.
Trying implicit prerequisite '../lib/RCS/_syntax-xform.scm,v'.
Trying pattern rule with stem '_syntax-xform.scm'.
Trying implicit prerequisite '../lib/RCS/_syntax-xform.scm'.
Trying pattern rule with stem '_syntax-xform.scm'.
Trying implicit prerequisite '../lib/s._syntax-xform.scm'.
Trying pattern rule with stem '_syntax-xform.scm'.
Trying implicit prerequisite '../lib/SCCS/s._syntax-xform.scm'.
No implicit rule found for '../lib/_syntax-xform.scm'.
Finished prerequisites of target file '../lib/_syntax-xform.scm'.
No need to remake target '../lib/_syntax-xform.scm'.
Considering target file '../lib/_syntax.scm'.
Looking for an implicit rule for '../lib/_syntax.scm'.
Trying pattern rule with stem '_syntax.scm'.
Trying implicit prerequisite '../lib/_syntax.scm,v'.
Trying pattern rule with stem '_syntax.scm'.
Trying implicit prerequisite '../lib/RCS/_syntax.scm,v'.
Trying pattern rule with stem '_syntax.scm'.
Trying implicit prerequisite '../lib/RCS/_syntax.scm'.
Trying pattern rule with stem '_syntax.scm'.
Trying implicit prerequisite '../lib/s._syntax.scm'.
Trying pattern rule with stem '_syntax.scm'.
Trying implicit prerequisite '../lib/SCCS/s._syntax.scm'.
No implicit rule found for '../lib/_syntax.scm'.
Finished prerequisites of target file '../lib/_syntax.scm'.
No need to remake target '../lib/_syntax.scm'.
Considering target file '../lib/_with-syntax-boot.scm'.
Looking for an implicit rule for '../lib/_with-syntax-boot.scm'.
Trying pattern rule with stem '_with-syntax-boot.scm'.
Trying implicit prerequisite '../lib/_with-syntax-boot.scm,v'.
Trying pattern rule with stem '_with-syntax-boot.scm'.
Trying implicit prerequisite '../lib/RCS/_with-syntax-boot.scm,v'.
Trying pattern rule with stem '_with-syntax-boot.scm'.
Trying implicit prerequisite '../lib/RCS/_with-syntax-boot.scm'.
Trying pattern rule with stem '_with-syntax-boot.scm'.
Trying implicit prerequisite '../lib/s._with-syntax-boot.scm'.
Trying pattern rule with stem '_with-syntax-boot.scm'.
Trying implicit prerequisite '../lib/SCCS/s._with-syntax-boot.scm'.
No implicit rule found for '../lib/_with-syntax-boot.scm'.
Finished prerequisites of target file '../lib/_with-syntax-boot.scm'.
No need to remake target '../lib/_with-syntax-boot.scm'.
Finished prerequisites of target file '_io.c'.
Must remake target '_io.c'.
make[1]: Entering directory '/opt/gambit-src/lib'
makefile:179: update target '_io.c' due to: _io.scm ../lib/header.scm ../lib/gambit#.scm ../lib/_gambit#.scm ../lib/_kernel#.scm ../lib/_system#.scm ../lib/_num#.scm ../lib/_std#.scm ../lib/_eval#.scm ../lib/_module#.scm ../lib/_io#.scm ../lib/_nonstd#.scm ../lib/_thread#.scm ../lib/_repl#.scm ../lib/_define-syntax.scm ../lib/_syntax-boot.scm ../lib/_syntax-case-xform-boot.scm ../lib/_syntax-case-xform.scm ../lib/_syntax-common.scm ../lib/_syntax-pattern.scm ../lib/_syntax-rules-xform.scm ../lib/_syntax-template.scm ../lib/_syntax-xform-boot.scm ../lib/_syntax-xform.scm ../lib/_syntax.scm ../lib/_with-syntax-boot.scm
../gsc-boot -:~~bin=../bin,~~lib=../lib,~~include=../include -f -c -prelude "(define-cond-expand-feature|enable-type-checking|)(define-cond-expand-feature|disable-auto-forcing|)(define-cond-expand-feature|enable-sharp-dot|)(define-cond-expand-feature|enable-bignum|)(define-cond-expand-feature|enable-ratnum|)(define-cond-expand-feature|enable-cpxnum|)(define-cond-expand-feature|enable-smp|)(##include\"../lib/header.scm\")" _io.scm
Putting child 0x7f6539ed87e0 (_io.c) PID 1632 on the chain.
Live child 0x7f6539ed87e0 (_io.c) PID 1632
Reaping losing child 0x7f6539ed87e0 PID 1632
Removing child 0x7f6539ed87e0 PID 1632 from chain.
make[1]: Leaving directory '/opt/gambit-src/lib'
Reaping losing child 0x7f818f002e70 PID 17
Removing child 0x7f818f002e70 PID 17 from chain.
make[1]: *** [makefile:179: _io.c] Segmentation fault (core dumped)
make: *** [makefile:534: all-recursive] Error 1
The command '/bin/sh -c cd /opt/gambit-src && make --trace -d #-j4' returned a non-zero code: 2
make: *** [Makefile:39: alpine-current-static] Error 2
Compilation exited abnormally with code 2 at Mon Apr 5 20:55:05
Sign up for free to join this conversation on GitHub. Already have an account? Sign in to comment