Skip to content

Embed URL

HTTPS clone URL

Subversion checkout URL

You can clone with
or
.
Download ZIP
SAS 2.0 build
beat:2.0 olli$ mvn clean install -DskipTests=true
[INFO] Scanning for projects...
[WARNING]
[WARNING] Some problems were encountered while building the effective model for org.springextensions.actionscript:spring-actionscript-core:swc:2.0-SNAPSHOT
[WARNING] 'build.plugins.plugin.version' for org.apache.maven.plugins:maven-resources-plugin is missing. @ org.springextensions.actionscript:spring-actionscript-superpom:2.0-SNAPSHOT, /[...]/se-springactionscript-as/repo/branches/2.0/pom.xml, line 337, column 12
[WARNING] 'build.plugins.plugin.version' for org.apache.maven.plugins:maven-clean-plugin is missing. @ org.springextensions.actionscript:spring-actionscript-superpom:2.0-SNAPSHOT, /[...]/se-springactionscript-as/repo/branches/2.0/pom.xml, line 323, column 12
[WARNING] 'dependencies.dependency.scope' for org.as3commons:as3commons-bytecode:swc must be one of [provided, compile, runtime, test, system] but is 'external'. @ org.springextensions.actionscript:spring-actionscript-superpom:2.0-SNAPSHOT, /[...]/se-springactionscript-as/repo/branches/2.0/pom.xml, line 463, column 11
[WARNING] 'dependencies.dependency.scope' for org.as3commons:as3commons-stageprocessing:swc must be one of [provided, compile, runtime, test, system] but is 'external'. @ org.springextensions.actionscript:spring-actionscript-superpom:2.0-SNAPSHOT, /[...]/se-springactionscript-as/repo/branches/2.0/pom.xml, line 481, column 11
[WARNING] 'dependencies.dependency.scope' for org.as3commons:as3commons-async:swc must be one of [provided, compile, runtime, test, system] but is 'external'. @ org.springextensions.actionscript:spring-actionscript-superpom:2.0-SNAPSHOT, /[...]/se-springactionscript-as/repo/branches/2.0/pom.xml, line 499, column 11
[WARNING] 'dependencies.dependency.scope' for org.as3commons:as3commons-eventbus:swc must be one of [provided, compile, runtime, test, system] but is 'external'. @ org.springextensions.actionscript:spring-actionscript-superpom:2.0-SNAPSHOT, /[...]/se-springactionscript-as/repo/branches/2.0/pom.xml, line 517, column 11
[WARNING] 'dependencies.dependency.scope' for org.as3commons:as3commons-lang:swc must be one of [provided, compile, runtime, test, system] but is 'external'. @ org.springextensions.actionscript:spring-actionscript-superpom:2.0-SNAPSHOT, /[...]/se-springactionscript-as/repo/branches/2.0/pom.xml, line 535, column 11
[WARNING] 'dependencies.dependency.scope' for org.as3commons:as3commons-reflect:swc must be one of [provided, compile, runtime, test, system] but is 'external'. @ org.springextensions.actionscript:spring-actionscript-superpom:2.0-SNAPSHOT, /[...]/se-springactionscript-as/repo/branches/2.0/pom.xml, line 553, column 11
[WARNING] 'dependencies.dependency.scope' for org.as3commons:as3commons-logging:swc must be one of [provided, compile, runtime, test, system] but is 'external'. @ org.springextensions.actionscript:spring-actionscript-superpom:2.0-SNAPSHOT, /[...]/se-springactionscript-as/repo/branches/2.0/pom.xml, line 571, column 11
[WARNING] 'dependencies.dependency.scope' for org.as3commons:as3commons-metadata:swc must be one of [provided, compile, runtime, test, system] but is 'external'. @ org.springextensions.actionscript:spring-actionscript-superpom:2.0-SNAPSHOT, /[...]/se-springactionscript-as/repo/branches/2.0/pom.xml, line 585, column 11
[WARNING] 'dependencies.dependency.scope' for com.adobe.flex.framework:playerglobal:swc:10.2 must be one of [provided, compile, runtime, test, system] but is 'external'. @ org.springextensions.actionscript:spring-actionscript-superpom:2.0-SNAPSHOT, /[...]/se-springactionscript-as/repo/branches/2.0/pom.xml, line 598, column 11
[WARNING] 'reporting.plugins.plugin.version' for org.apache.maven.plugins:maven-surefire-report-plugin is missing. @ org.springextensions.actionscript:spring-actionscript-superpom:2.0-SNAPSHOT, /[...]/se-springactionscript-as/repo/branches/2.0/pom.xml, line 380, column 15
[WARNING] 'reporting.plugins.plugin.version' for org.apache.maven.plugins:maven-changes-plugin is missing. @ org.springextensions.actionscript:spring-actionscript-superpom:2.0-SNAPSHOT, /[...]/se-springactionscript-as/repo/branches/2.0/pom.xml, line 413, column 15
[WARNING]
[WARNING] Some problems were encountered while building the effective model for org.springextensions.actionscript:spring-actionscript-flex:swc:2.0-SNAPSHOT
[WARNING] 'build.plugins.plugin.version' for org.apache.maven.plugins:maven-resources-plugin is missing. @ org.springextensions.actionscript:spring-actionscript-superpom:2.0-SNAPSHOT, /[...]/se-springactionscript-as/repo/branches/2.0/pom.xml, line 337, column 12
[WARNING] 'build.plugins.plugin.version' for org.apache.maven.plugins:maven-clean-plugin is missing. @ org.springextensions.actionscript:spring-actionscript-superpom:2.0-SNAPSHOT, /[...]/se-springactionscript-as/repo/branches/2.0/pom.xml, line 323, column 12
[WARNING] 'dependencies.dependency.scope' for org.springextensions.actionscript:spring-actionscript-core:swc must be one of [provided, compile, runtime, test, system] but is 'internal'. @ line 90, column 14
[WARNING] 'dependencies.dependency.scope' for com.adobe.flex.framework:framework:swc must be one of [provided, compile, runtime, test, system] but is 'external'. @ line 98, column 11
[WARNING] 'dependencies.dependency.scope' for com.adobe.flex.framework:mx:swc must be one of [provided, compile, runtime, test, system] but is 'external'. @ line 105, column 11
[WARNING] 'dependencies.dependency.scope' for com.adobe.flex.framework:rpc:swc must be one of [provided, compile, runtime, test, system] but is 'external'. @ line 112, column 11
[WARNING] 'dependencies.dependency.scope' for org.as3commons:flex-async:swc must be one of [provided, compile, runtime, test, system] but is 'external'. @ line 119, column 11
[WARNING] 'dependencies.dependency.scope' for org.as3commons:as3commons-bytecode:swc must be one of [provided, compile, runtime, test, system] but is 'external'. @ org.springextensions.actionscript:spring-actionscript-superpom:2.0-SNAPSHOT, /[...]/se-springactionscript-as/repo/branches/2.0/pom.xml, line 463, column 11
[WARNING] 'dependencies.dependency.scope' for org.as3commons:as3commons-stageprocessing:swc must be one of [provided, compile, runtime, test, system] but is 'external'. @ org.springextensions.actionscript:spring-actionscript-superpom:2.0-SNAPSHOT, /[...]/se-springactionscript-as/repo/branches/2.0/pom.xml, line 481, column 11
[WARNING] 'dependencies.dependency.scope' for org.as3commons:as3commons-async:swc must be one of [provided, compile, runtime, test, system] but is 'external'. @ org.springextensions.actionscript:spring-actionscript-superpom:2.0-SNAPSHOT, /[...]/se-springactionscript-as/repo/branches/2.0/pom.xml, line 499, column 11
[WARNING] 'dependencies.dependency.scope' for org.as3commons:as3commons-eventbus:swc must be one of [provided, compile, runtime, test, system] but is 'external'. @ org.springextensions.actionscript:spring-actionscript-superpom:2.0-SNAPSHOT, /[...]/se-springactionscript-as/repo/branches/2.0/pom.xml, line 517, column 11
[WARNING] 'dependencies.dependency.scope' for org.as3commons:as3commons-lang:swc must be one of [provided, compile, runtime, test, system] but is 'external'. @ org.springextensions.actionscript:spring-actionscript-superpom:2.0-SNAPSHOT, /[...]/se-springactionscript-as/repo/branches/2.0/pom.xml, line 535, column 11
[WARNING] 'dependencies.dependency.scope' for org.as3commons:as3commons-reflect:swc must be one of [provided, compile, runtime, test, system] but is 'external'. @ org.springextensions.actionscript:spring-actionscript-superpom:2.0-SNAPSHOT, /[...]/se-springactionscript-as/repo/branches/2.0/pom.xml, line 553, column 11
[WARNING] 'dependencies.dependency.scope' for org.as3commons:as3commons-logging:swc must be one of [provided, compile, runtime, test, system] but is 'external'. @ org.springextensions.actionscript:spring-actionscript-superpom:2.0-SNAPSHOT, /[...]/se-springactionscript-as/repo/branches/2.0/pom.xml, line 571, column 11
[WARNING] 'dependencies.dependency.scope' for org.as3commons:as3commons-metadata:swc must be one of [provided, compile, runtime, test, system] but is 'external'. @ org.springextensions.actionscript:spring-actionscript-superpom:2.0-SNAPSHOT, /[...]/se-springactionscript-as/repo/branches/2.0/pom.xml, line 585, column 11
[WARNING] 'dependencies.dependency.scope' for com.adobe.flex.framework:playerglobal:swc:10.2 must be one of [provided, compile, runtime, test, system] but is 'external'. @ org.springextensions.actionscript:spring-actionscript-superpom:2.0-SNAPSHOT, /[...]/se-springactionscript-as/repo/branches/2.0/pom.xml, line 598, column 11
[WARNING] 'reporting.plugins.plugin.version' for org.apache.maven.plugins:maven-surefire-report-plugin is missing. @ org.springextensions.actionscript:spring-actionscript-superpom:2.0-SNAPSHOT, /[...]/se-springactionscript-as/repo/branches/2.0/pom.xml, line 380, column 15
[WARNING] 'reporting.plugins.plugin.version' for org.apache.maven.plugins:maven-changes-plugin is missing. @ org.springextensions.actionscript:spring-actionscript-superpom:2.0-SNAPSHOT, /[...]/se-springactionscript-as/repo/branches/2.0/pom.xml, line 413, column 15
[WARNING]
[WARNING] Some problems were encountered while building the effective model for org.springextensions.actionscript:spring-actionscript-mvc:swc:2.0-SNAPSHOT
[WARNING] 'build.plugins.plugin.version' for org.apache.maven.plugins:maven-resources-plugin is missing. @ org.springextensions.actionscript:spring-actionscript-superpom:2.0-SNAPSHOT, /[...]/se-springactionscript-as/repo/branches/2.0/pom.xml, line 337, column 12
[WARNING] 'build.plugins.plugin.version' for org.apache.maven.plugins:maven-clean-plugin is missing. @ org.springextensions.actionscript:spring-actionscript-superpom:2.0-SNAPSHOT, /[...]/se-springactionscript-as/repo/branches/2.0/pom.xml, line 323, column 12
[WARNING] 'dependencies.dependency.scope' for org.springextensions.actionscript:spring-actionscript-core:swc must be one of [provided, compile, runtime, test, system] but is 'external'. @ line 56, column 14
[WARNING] 'dependencies.dependency.scope' for org.as3commons:as3commons-bytecode:swc must be one of [provided, compile, runtime, test, system] but is 'external'. @ org.springextensions.actionscript:spring-actionscript-superpom:2.0-SNAPSHOT, /[...]/se-springactionscript-as/repo/branches/2.0/pom.xml, line 463, column 11
[WARNING] 'dependencies.dependency.scope' for org.as3commons:as3commons-stageprocessing:swc must be one of [provided, compile, runtime, test, system] but is 'external'. @ org.springextensions.actionscript:spring-actionscript-superpom:2.0-SNAPSHOT, /[...]/se-springactionscript-as/repo/branches/2.0/pom.xml, line 481, column 11
[WARNING] 'dependencies.dependency.scope' for org.as3commons:as3commons-async:swc must be one of [provided, compile, runtime, test, system] but is 'external'. @ org.springextensions.actionscript:spring-actionscript-superpom:2.0-SNAPSHOT, /[...]/se-springactionscript-as/repo/branches/2.0/pom.xml, line 499, column 11
[WARNING] 'dependencies.dependency.scope' for org.as3commons:as3commons-eventbus:swc must be one of [provided, compile, runtime, test, system] but is 'external'. @ org.springextensions.actionscript:spring-actionscript-superpom:2.0-SNAPSHOT, /[...]/se-springactionscript-as/repo/branches/2.0/pom.xml, line 517, column 11
[WARNING] 'dependencies.dependency.scope' for org.as3commons:as3commons-lang:swc must be one of [provided, compile, runtime, test, system] but is 'external'. @ org.springextensions.actionscript:spring-actionscript-superpom:2.0-SNAPSHOT, /[...]/se-springactionscript-as/repo/branches/2.0/pom.xml, line 535, column 11
[WARNING] 'dependencies.dependency.scope' for org.as3commons:as3commons-reflect:swc must be one of [provided, compile, runtime, test, system] but is 'external'. @ org.springextensions.actionscript:spring-actionscript-superpom:2.0-SNAPSHOT, /[...]/se-springactionscript-as/repo/branches/2.0/pom.xml, line 553, column 11
[WARNING] 'dependencies.dependency.scope' for org.as3commons:as3commons-logging:swc must be one of [provided, compile, runtime, test, system] but is 'external'. @ org.springextensions.actionscript:spring-actionscript-superpom:2.0-SNAPSHOT, /[...]/se-springactionscript-as/repo/branches/2.0/pom.xml, line 571, column 11
[WARNING] 'dependencies.dependency.scope' for org.as3commons:as3commons-metadata:swc must be one of [provided, compile, runtime, test, system] but is 'external'. @ org.springextensions.actionscript:spring-actionscript-superpom:2.0-SNAPSHOT, /[...]/se-springactionscript-as/repo/branches/2.0/pom.xml, line 585, column 11
[WARNING] 'dependencies.dependency.scope' for com.adobe.flex.framework:playerglobal:swc:10.2 must be one of [provided, compile, runtime, test, system] but is 'external'. @ org.springextensions.actionscript:spring-actionscript-superpom:2.0-SNAPSHOT, /[...]/se-springactionscript-as/repo/branches/2.0/pom.xml, line 598, column 11
[WARNING] 'reporting.plugins.plugin.version' for org.apache.maven.plugins:maven-surefire-report-plugin is missing. @ org.springextensions.actionscript:spring-actionscript-superpom:2.0-SNAPSHOT, /[...]/se-springactionscript-as/repo/branches/2.0/pom.xml, line 380, column 15
[WARNING] 'reporting.plugins.plugin.version' for org.apache.maven.plugins:maven-changes-plugin is missing. @ org.springextensions.actionscript:spring-actionscript-superpom:2.0-SNAPSHOT, /[...]/se-springactionscript-as/repo/branches/2.0/pom.xml, line 413, column 15
[WARNING]
[WARNING] Some problems were encountered while building the effective model for org.springextensions.actionscript:spring-actionscript-security:swc:2.0-SNAPSHOT
[WARNING] 'build.plugins.plugin.version' for org.apache.maven.plugins:maven-resources-plugin is missing. @ org.springextensions.actionscript:spring-actionscript-superpom:2.0-SNAPSHOT, /[...]/se-springactionscript-as/repo/branches/2.0/pom.xml, line 337, column 12
[WARNING] 'build.plugins.plugin.version' for org.apache.maven.plugins:maven-clean-plugin is missing. @ org.springextensions.actionscript:spring-actionscript-superpom:2.0-SNAPSHOT, /[...]/se-springactionscript-as/repo/branches/2.0/pom.xml, line 323, column 12
[WARNING] 'dependencies.dependency.scope' for org.springextensions.actionscript:spring-actionscript-core:swc must be one of [provided, compile, runtime, test, system] but is 'external'. @ line 57, column 14
[WARNING] 'dependencies.dependency.scope' for org.as3commons:as3commons-bytecode:swc must be one of [provided, compile, runtime, test, system] but is 'external'. @ org.springextensions.actionscript:spring-actionscript-superpom:2.0-SNAPSHOT, /[...]/se-springactionscript-as/repo/branches/2.0/pom.xml, line 463, column 11
[WARNING] 'dependencies.dependency.scope' for org.as3commons:as3commons-stageprocessing:swc must be one of [provided, compile, runtime, test, system] but is 'external'. @ org.springextensions.actionscript:spring-actionscript-superpom:2.0-SNAPSHOT, /[...]/se-springactionscript-as/repo/branches/2.0/pom.xml, line 481, column 11
[WARNING] 'dependencies.dependency.scope' for org.as3commons:as3commons-async:swc must be one of [provided, compile, runtime, test, system] but is 'external'. @ org.springextensions.actionscript:spring-actionscript-superpom:2.0-SNAPSHOT, /[...]/se-springactionscript-as/repo/branches/2.0/pom.xml, line 499, column 11
[WARNING] 'dependencies.dependency.scope' for org.as3commons:as3commons-eventbus:swc must be one of [provided, compile, runtime, test, system] but is 'external'. @ org.springextensions.actionscript:spring-actionscript-superpom:2.0-SNAPSHOT, /[...]/se-springactionscript-as/repo/branches/2.0/pom.xml, line 517, column 11
[WARNING] 'dependencies.dependency.scope' for org.as3commons:as3commons-lang:swc must be one of [provided, compile, runtime, test, system] but is 'external'. @ org.springextensions.actionscript:spring-actionscript-superpom:2.0-SNAPSHOT, /[...]/se-springactionscript-as/repo/branches/2.0/pom.xml, line 535, column 11
[WARNING] 'dependencies.dependency.scope' for org.as3commons:as3commons-reflect:swc must be one of [provided, compile, runtime, test, system] but is 'external'. @ org.springextensions.actionscript:spring-actionscript-superpom:2.0-SNAPSHOT, /[...]/se-springactionscript-as/repo/branches/2.0/pom.xml, line 553, column 11
[WARNING] 'dependencies.dependency.scope' for org.as3commons:as3commons-logging:swc must be one of [provided, compile, runtime, test, system] but is 'external'. @ org.springextensions.actionscript:spring-actionscript-superpom:2.0-SNAPSHOT, /[...]/se-springactionscript-as/repo/branches/2.0/pom.xml, line 571, column 11
[WARNING] 'dependencies.dependency.scope' for org.as3commons:as3commons-metadata:swc must be one of [provided, compile, runtime, test, system] but is 'external'. @ org.springextensions.actionscript:spring-actionscript-superpom:2.0-SNAPSHOT, /[...]/se-springactionscript-as/repo/branches/2.0/pom.xml, line 585, column 11
[WARNING] 'dependencies.dependency.scope' for com.adobe.flex.framework:playerglobal:swc:10.2 must be one of [provided, compile, runtime, test, system] but is 'external'. @ org.springextensions.actionscript:spring-actionscript-superpom:2.0-SNAPSHOT, /[...]/se-springactionscript-as/repo/branches/2.0/pom.xml, line 598, column 11
[WARNING] 'reporting.plugins.plugin.version' for org.apache.maven.plugins:maven-surefire-report-plugin is missing. @ org.springextensions.actionscript:spring-actionscript-superpom:2.0-SNAPSHOT, /[...]/se-springactionscript-as/repo/branches/2.0/pom.xml, line 380, column 15
[WARNING] 'reporting.plugins.plugin.version' for org.apache.maven.plugins:maven-changes-plugin is missing. @ org.springextensions.actionscript:spring-actionscript-superpom:2.0-SNAPSHOT, /[...]/se-springactionscript-as/repo/branches/2.0/pom.xml, line 413, column 15
[WARNING]
[WARNING] Some problems were encountered while building the effective model for org.springextensions.actionscript:spring-actionscript-superpom:pom:2.0-SNAPSHOT
[WARNING] 'build.plugins.plugin.version' for org.apache.maven.plugins:maven-resources-plugin is missing. @ line 337, column 12
[WARNING] 'build.plugins.plugin.version' for org.apache.maven.plugins:maven-clean-plugin is missing. @ line 323, column 12
[WARNING] 'dependencies.dependency.scope' for org.as3commons:as3commons-bytecode:swc must be one of [provided, compile, runtime, test, system] but is 'external'. @ line 463, column 11
[WARNING] 'dependencies.dependency.scope' for org.as3commons:as3commons-stageprocessing:swc must be one of [provided, compile, runtime, test, system] but is 'external'. @ line 481, column 11
[WARNING] 'dependencies.dependency.scope' for org.as3commons:as3commons-async:swc must be one of [provided, compile, runtime, test, system] but is 'external'. @ line 499, column 11
[WARNING] 'dependencies.dependency.scope' for org.as3commons:as3commons-eventbus:swc must be one of [provided, compile, runtime, test, system] but is 'external'. @ line 517, column 11
[WARNING] 'dependencies.dependency.scope' for org.as3commons:as3commons-lang:swc must be one of [provided, compile, runtime, test, system] but is 'external'. @ line 535, column 11
[WARNING] 'dependencies.dependency.scope' for org.as3commons:as3commons-reflect:swc must be one of [provided, compile, runtime, test, system] but is 'external'. @ line 553, column 11
[WARNING] 'dependencies.dependency.scope' for org.as3commons:as3commons-logging:swc must be one of [provided, compile, runtime, test, system] but is 'external'. @ line 571, column 11
[WARNING] 'dependencies.dependency.scope' for org.as3commons:as3commons-metadata:swc must be one of [provided, compile, runtime, test, system] but is 'external'. @ line 585, column 11
[WARNING] 'dependencies.dependency.scope' for com.adobe.flex.framework:playerglobal:swc:10.2 must be one of [provided, compile, runtime, test, system] but is 'external'. @ line 598, column 11
[WARNING] 'reporting.plugins.plugin.version' for org.apache.maven.plugins:maven-surefire-report-plugin is missing. @ line 380, column 15
[WARNING] 'reporting.plugins.plugin.version' for org.apache.maven.plugins:maven-changes-plugin is missing. @ line 413, column 15
[WARNING]
[WARNING] It is highly recommended to fix these problems because they threaten the stability of your build.
[WARNING]
[WARNING] For this reason, future Maven versions might no longer support building such malformed projects.
[WARNING]
[INFO] ------------------------------------------------------------------------
[INFO] Reactor Build Order:
[INFO]
[INFO] Spring Actionscript
[INFO] Spring Actionscript Core
[INFO] Spring Actionscript Flex Extensions
[INFO] Spring Actionscript MVC
[INFO] Spring Actionscript Security
[INFO]
[INFO] ------------------------------------------------------------------------
[INFO] Building Spring Actionscript 2.0-SNAPSHOT
[INFO] ------------------------------------------------------------------------
[INFO]
[INFO] --- maven-clean-plugin:2.4.1:clean (default-clean) @ spring-actionscript-superpom ---
[INFO]
[INFO] >>> flexmojos-maven-plugin:4.0-RC2:sources (default) @ spring-actionscript-superpom >>>
[INFO]
[INFO] <<< flexmojos-maven-plugin:4.0-RC2:sources (default) @ spring-actionscript-superpom <<<
[INFO]
[INFO] --- flexmojos-maven-plugin:4.0-RC2:sources (default) @ spring-actionscript-superpom ---
[INFO]
[INFO] --- maven-install-plugin:2.3.1:install (default-install) @ spring-actionscript-superpom ---
[INFO] Installing /[...]/se-springactionscript-as/repo/branches/2.0/pom.xml to /Users/olli/.m2/repository/org/springextensions/actionscript/spring-actionscript-superpom/2.0-SNAPSHOT/spring-actionscript-superpom-2.0-SNAPSHOT.pom
[INFO]
[INFO] ------------------------------------------------------------------------
[INFO] Building Spring Actionscript Core 2.0-SNAPSHOT
[INFO] ------------------------------------------------------------------------
[WARNING] The POM for com.adobe.flexunit:flexunit:swc:4.1-RC2 is missing, no dependency information available
[INFO]
[INFO] --- maven-clean-plugin:2.4.1:clean (default-clean) @ spring-actionscript-core ---
[INFO] Deleting /[...]/se-springactionscript-as/repo/branches/2.0/spring-actionscript-core/target
[INFO] Deleting /[...]/se-springactionscript-as/repo/branches/2.0/spring-actionscript-core/src/main/actionscript (includes = [FlexUnitApplication.mxml], excludes = [])
[INFO]
[INFO] --- maven-dependency-plugin:2.1:copy-dependencies (copy-dependencies) @ spring-actionscript-core ---
[INFO] Copying as3commons-async-1.0-RC2-SNAPSHOT.swc to /[...]/se-springactionscript-as/repo/branches/2.0/spring-actionscript-core/target/dependency/as3commons-async-1.0-RC2-SNAPSHOT.swc
[INFO] Copying as3commons-bytecode-1.1-SNAPSHOT.swc to /[...]/se-springactionscript-as/repo/branches/2.0/spring-actionscript-core/target/dependency/as3commons-bytecode-1.1-SNAPSHOT.swc
[INFO] Copying as3commons-eventbus-1.1.2-SNAPSHOT.swc to /[...]/se-springactionscript-as/repo/branches/2.0/spring-actionscript-core/target/dependency/as3commons-eventbus-1.1.2-SNAPSHOT.swc
[INFO] Copying as3commons-lang-0.3.5-SNAPSHOT.swc to /[...]/se-springactionscript-as/repo/branches/2.0/spring-actionscript-core/target/dependency/as3commons-lang-0.3.5-SNAPSHOT.swc
[INFO] Copying as3commons-logging-2.6.swc to /[...]/se-springactionscript-as/repo/branches/2.0/spring-actionscript-core/target/dependency/as3commons-logging-2.6.swc
[INFO] Copying as3commons-metadata-1.0-RC2-SNAPSHOT.swc to /[...]/se-springactionscript-as/repo/branches/2.0/spring-actionscript-core/target/dependency/as3commons-metadata-1.0-RC2-SNAPSHOT.swc
[INFO] Copying as3commons-reflect-1.5.1-SNAPSHOT.swc to /[...]/se-springactionscript-as/repo/branches/2.0/spring-actionscript-core/target/dependency/as3commons-reflect-1.5.1-SNAPSHOT.swc
[INFO] Copying as3commons-stageprocessing-1.1-SNAPSHOT.swc to /[...]/se-springactionscript-as/repo/branches/2.0/spring-actionscript-core/target/dependency/as3commons-stageprocessing-1.1-SNAPSHOT.swc
[INFO]
[INFO] --- maven-resources-plugin:2.5:resources (default-resources) @ spring-actionscript-core ---
[debug] execute contextualize
[INFO] Using 'UTF-8' encoding to copy filtered resources.
[INFO] Copying 1 resource
[INFO]
[INFO] --- flexmojos-maven-plugin:4.0-RC2:compile-swc (default-compile-swc) @ spring-actionscript-core ---
[INFO] Flexmojos 4.0-RC2
[INFO] Apache License - Version 2.0 (NO WARRANTY) - See COPYRIGHT file
[WARNING] No themes are explicitly defined in the <theme> section or in any scope="theme" dependencies. Flexmojos is now attempting to figure out which themes to include. (to avoid this warning you should explicitly state your theme dependencies)
Writing configuration dump to /[...]/se-springactionscript-as/repo/branches/2.0/spring-actionscript-core/target/spring-actionscript-core-2.0-SNAPSHOT-configs.xml
/[...]/se-springactionscript-as/repo/branches/2.0/spring-actionscript-core/target/spring-actionscript-core-2.0-SNAPSHOT.swc (222769 bytes)
[INFO]
[INFO] --- maven-resources-plugin:2.5:testResources (default-testResources) @ spring-actionscript-core ---
[debug] execute contextualize
[INFO] Using 'UTF-8' encoding to copy filtered resources.
[INFO] Copying 5 resources
[INFO]
[INFO] --- flexmojos-maven-plugin:4.0-RC2:test-compile (default-test-compile) @ spring-actionscript-core ---
[INFO] Flexmojos 4.0-RC2
[INFO] Apache License - Version 2.0 (NO WARRANTY) - See COPYRIGHT file
[INFO] Compiling test class: [integration.eventbus.EventBusUserRegistryIntegrationTest, integration.objectfactory.ObjectFactoryIntegrationTest, integration.testtypes.TestEvent, integration.testtypes.TestEventInterceptor, org.springextensions.actionscript.context.impl.ApplicationContextTest, org.springextensions.actionscript.eventbus.impl.DefaultEventBusUserRegistryTest, org.springextensions.actionscript.ioc.autowire.impl.DefaultAutowireProcessorTest, org.springextensions.actionscript.ioc.config.impl.TextFilesLoaderTest, org.springextensions.actionscript.ioc.config.impl.metadata.ConfigurationClassScannerTest, org.springextensions.actionscript.ioc.config.impl.metadata.MetadataObjectDefinitionsProviderTest, org.springextensions.actionscript.ioc.config.impl.xml.XMLObjectDefinitionsProviderTest, org.springextensions.actionscript.ioc.config.impl.xml.namespacehandler.impl.ParsingUtilsTest, org.springextensions.actionscript.ioc.config.impl.xml.namespacehandler.impl.eventbus.customconfiguration.EventHandlerCustomConfiguratorTest, org.springextensions.actionscript.ioc.config.impl.xml.namespacehandler.impl.eventbus.customconfiguration.EventInterceptorCustomConfiguratorTest, org.springextensions.actionscript.ioc.config.impl.xml.namespacehandler.impl.eventbus.customconfiguration.EventListenerInterceptorCustomConfiguratorTest, org.springextensions.actionscript.ioc.config.impl.xml.namespacehandler.impl.eventbus.customconfiguration.RouteEventsCustomConfiguratorTest, org.springextensions.actionscript.ioc.config.impl.xml.namespacehandler.impl.eventbus.nodeparser.AbstractNodeParserTest, org.springextensions.actionscript.ioc.config.impl.xml.namespacehandler.impl.eventbus.nodeparser.EventHandlerNodeParserTest, org.springextensions.actionscript.ioc.config.impl.xml.namespacehandler.impl.eventbus.nodeparser.EventInterceptorNodeParserTest, org.springextensions.actionscript.ioc.config.impl.xml.namespacehandler.impl.eventbus.nodeparser.EventListenerInterceptorNodeParserTest, org.springextensions.actionscript.ioc.config.impl.xml.namespacehandler.impl.eventbus.nodeparser.EventRouterNodeParserTest, org.springextensions.actionscript.ioc.config.impl.xml.namespacehandler.impl.stageprocessing.nodeparser.AutowiringStageProcessorNodeParserTest, org.springextensions.actionscript.ioc.config.impl.xml.namespacehandler.impl.stageprocessing.nodeparser.GenericStageProcessorNodeParserTest, org.springextensions.actionscript.ioc.config.impl.xml.namespacehandler.impl.stageprocessing.nodeparser.StageProcessorNodeParserTest, org.springextensions.actionscript.ioc.config.impl.xml.namespacehandler.impl.task.TaskElementsPreprocessorTest, org.springextensions.actionscript.ioc.config.impl.xml.namespacehandler.impl.task.TaskNamespaceHandlerTest, org.springextensions.actionscript.ioc.config.impl.xml.namespacehandler.impl.task.nodeparser.BlockNodeParserTest, org.springextensions.actionscript.ioc.config.impl.xml.namespacehandler.impl.task.nodeparser.CompositeCommandNodeParserTest, org.springextensions.actionscript.ioc.config.impl.xml.namespacehandler.impl.task.nodeparser.CountProviderNodeParserTest, org.springextensions.actionscript.ioc.config.impl.xml.namespacehandler.impl.task.nodeparser.IfNodeParserTest, org.springextensions.actionscript.ioc.config.impl.xml.namespacehandler.impl.task.nodeparser.LoadURLStreamNodeParserTest, org.springextensions.actionscript.ioc.config.impl.xml.namespacehandler.impl.task.nodeparser.PauseCommandNodeParserTest, org.springextensions.actionscript.ioc.config.impl.xml.namespacehandler.impl.task.nodeparser.TaskNodeParserTest, org.springextensions.actionscript.ioc.config.impl.xml.namespacehandler.impl.util.customconfiguration.FactoryObjectCustomConfiguratorTest, org.springextensions.actionscript.ioc.config.impl.xml.namespacehandler.impl.util.nodeparser.ConstantNodeParserTest, org.springextensions.actionscript.ioc.config.impl.xml.namespacehandler.impl.util.nodeparser.FactoryNodeParserTest, org.springextensions.actionscript.ioc.config.impl.xml.namespacehandler.impl.util.nodeparser.InvokeNodeParserTest, org.springextensions.actionscript.ioc.config.impl.xml.parser.impl.XmlObjectDefinitionsParserTest, org.springextensions.actionscript.ioc.config.impl.xml.parser.impl.nodeparser.ArrayCollectionNodeParserTest, org.springextensions.actionscript.ioc.config.impl.xml.parser.impl.nodeparser.ArrayNodeParserTest, org.springextensions.actionscript.ioc.config.impl.xml.parser.impl.nodeparser.DictionaryNodeParserTest, org.springextensions.actionscript.ioc.config.impl.xml.parser.impl.nodeparser.KeyValueNodeParserTest, org.springextensions.actionscript.ioc.config.impl.xml.parser.impl.nodeparser.NanNodeParserTest, org.springextensions.actionscript.ioc.config.impl.xml.parser.impl.nodeparser.NullNodeParserTest, org.springextensions.actionscript.ioc.config.impl.xml.parser.impl.nodeparser.ObjectNodeParserTest, org.springextensions.actionscript.ioc.config.impl.xml.parser.impl.nodeparser.RefNodeParserTest, org.springextensions.actionscript.ioc.config.impl.xml.parser.impl.nodeparser.UndefinedNodeParserTest, org.springextensions.actionscript.ioc.config.impl.xml.parser.impl.nodeparser.VectorNodeParserTest, org.springextensions.actionscript.ioc.config.impl.xml.preprocess.impl.AttributeToElementPreprocessorTest, org.springextensions.actionscript.ioc.config.impl.xml.preprocess.impl.IdAttributePreprocessorTest, org.springextensions.actionscript.ioc.config.impl.xml.preprocess.impl.InnerObjectsPreprocessorTest, org.springextensions.actionscript.ioc.config.impl.xml.preprocess.impl.MethodInvocationPreprocessorTest, org.springextensions.actionscript.ioc.config.impl.xml.preprocess.impl.PropertyElementsPreprocessorTest, org.springextensions.actionscript.ioc.config.impl.xml.preprocess.impl.PropertyImportPreprocessorTest, org.springextensions.actionscript.ioc.config.impl.xml.preprocess.impl.ScopeAttributePreprocessorTest, org.springextensions.actionscript.ioc.config.impl.xml.preprocess.impl.SpringNamesPreprocessorTest, org.springextensions.actionscript.ioc.config.property.impl.KeyValuePropertiesParserTest, org.springextensions.actionscript.ioc.config.property.impl.PropertiesTest, org.springextensions.actionscript.ioc.config.property.impl.PropertyPlaceholderResolverTest, org.springextensions.actionscript.ioc.factory.impl.DefaultInstanceCacheTest, org.springextensions.actionscript.ioc.factory.impl.DefaultObjectFactoryTest, org.springextensions.actionscript.ioc.factory.impl.FieldRetrievingFactoryObjectTest, org.springextensions.actionscript.ioc.factory.impl.GenericFactoryObjectTest, org.springextensions.actionscript.ioc.factory.impl.referenceresolver.AbstractReferenceResolverTest, org.springextensions.actionscript.ioc.factory.impl.referenceresolver.ArrayCollectionReferenceResolverTest, org.springextensions.actionscript.ioc.factory.impl.referenceresolver.ArrayReferenceResolverTest, org.springextensions.actionscript.ioc.factory.impl.referenceresolver.DictionaryReferenceResolverTest, org.springextensions.actionscript.ioc.factory.impl.referenceresolver.ObjectReferenceResolverTest, org.springextensions.actionscript.ioc.factory.impl.referenceresolver.ThisReferenceResolverTest, org.springextensions.actionscript.ioc.factory.impl.referenceresolver.VectorReferenceResolverTest, org.springextensions.actionscript.ioc.factory.process.impl.factory.ClassScannerObjectFactoryPostProcessorTest, org.springextensions.actionscript.ioc.factory.process.impl.factory.FactoryObjectFactoryPostProcessorTest, org.springextensions.actionscript.ioc.factory.process.impl.factory.ObjectDefinitonFactoryPostProcessorTest, org.springextensions.actionscript.ioc.factory.process.impl.factory.RegisterObjectFactoryPostProcessorsFactoryPostProcessorTest, org.springextensions.actionscript.ioc.factory.process.impl.factory.RegisterObjectPostProcessorsFactoryPostProcessorTest, org.springextensions.actionscript.ioc.factory.process.impl.object.ApplicationContextAwareObjectPostProcessorTest, org.springextensions.actionscript.ioc.factory.process.impl.object.ApplicationDomainAwarePostProcessorTest, org.springextensions.actionscript.ioc.factory.process.impl.object.ObjectFactoryAwarePostProcessorTest, org.springextensions.actionscript.ioc.impl.DefaultDependencyInjectorTest, org.springextensions.actionscript.ioc.objectdefinition.impl.DefaultObjectDefinitionRegistryTest, org.springextensions.actionscript.ioc.objectdefinition.impl.ObjectDefinitionTest, org.springextensions.actionscript.metadata.MetadataProcessorObjectFactoryPostProcessorTest, org.springextensions.actionscript.metadata.MetadataProcessorObjectPostProcessorTest, org.springextensions.actionscript.object.SimpleTypeConverterTest, org.springextensions.actionscript.object.propertyeditor.BooleanPropertyEditorTest, org.springextensions.actionscript.object.propertyeditor.ClassPropertyEditorTest, org.springextensions.actionscript.object.propertyeditor.NumberPropertyEditorTest, org.springextensions.actionscript.test.testtypes.TestClassFactory, org.springextensions.actionscript.test.testtypes.TestClassWithMetadata, org.springextensions.actionscript.test.testtypes.TestFactoryObject, org.springextensions.actionscript.test.testtypes.TestInjectionClass, org.springextensions.actionscript.test.testtypes.TestInvalidFactoryObject, org.springextensions.actionscript.test.testtypes.eventbus.TestEventHandler, org.springextensions.actionscript.test.testtypes.metadatascan.TestConfigurationClass, org.springextensions.actionscript.test.testtypes.stage.TestStageProcessor, org.springextensions.actionscript.util.ContextUtilsTest, org.springextensions.actionscript.util.MultilineStringTest, org.springextensions.actionscript.util.TypeUtilsTest]
[WARNING] No themes are explicitly defined in the <theme> section or in any scope="theme" dependencies. Flexmojos is now attempting to figure out which themes to include. (to avoid this warning you should explicitly state your theme dependencies)
[WARNING] Adding spark.css theme because spark.swc was included as a dependency
Writing configuration dump to /[...]/se-springactionscript-as/repo/branches/2.0/spring-actionscript-core/target/test-classes/TestRunner-configs.xml
_TestRunner_Styles.as(1099): col: 50 Error: Access of undefined property BorderSkin.
this.borderSkin = mx.skins.spark.BorderSkin;
^
_TestRunner_Styles.as(1139): col: 44 Error: Access of undefined property AccordionHeaderSkin.
this.skin = mx.skins.spark.AccordionHeaderSkin;
^
_TestRunner_Styles.as(1284): col: 54 Error: Access of undefined property DefaultButtonSkin.
this.emphasizedSkin = mx.skins.spark.DefaultButtonSkin;
^
_TestRunner_Styles.as(1287): col: 44 Error: Access of undefined property ButtonSkin.
this.skin = mx.skins.spark.ButtonSkin;
^
_TestRunner_Styles.as(1357): col: 44 Error: Access of undefined property ButtonBarFirstButtonSkin.
this.skin = mx.skins.spark.ButtonBarFirstButtonSkin;
^
_TestRunner_Styles.as(1387): col: 44 Error: Access of undefined property ButtonBarLastButtonSkin.
this.skin = mx.skins.spark.ButtonBarLastButtonSkin;
^
_TestRunner_Styles.as(1423): col: 44 Error: Access of undefined property ButtonBarMiddleButtonSkin.
this.skin = mx.skins.spark.ButtonBarMiddleButtonSkin;
^
_TestRunner_Styles.as(1504): col: 44 Error: Access of undefined property CheckBoxSkin.
this.icon = mx.skins.spark.CheckBoxSkin;
^
_TestRunner_Styles.as(1548): col: 44 Error: Access of undefined property ColorPickerSkin.
this.skin = mx.skins.spark.ColorPickerSkin;
^
_TestRunner_Styles.as(1579): col: 50 Error: Access of undefined property BorderSkin.
this.borderSkin = mx.skins.spark.BorderSkin;
^
_TestRunner_Styles.as(1613): col: 52 Error: Access of undefined property EditableComboBoxSkin.
this.editableSkin = mx.skins.spark.EditableComboBoxSkin;
^
_TestRunner_Styles.as(1614): col: 44 Error: Access of undefined property ComboBoxSkin.
this.skin = mx.skins.spark.ComboBoxSkin;
^
_TestRunner_Styles.as(1684): col: 50 Error: Access of undefined property ContainerBorderSkin.
this.borderSkin = mx.skins.spark.ContainerBorderSkin;
^
_TestRunner_Styles.as(1751): col: 53 Error: Access of undefined property DataGridSortArrow.
this.sortArrowSkin = mx.skins.spark.DataGridSortArrow;
^
_TestRunner_Styles.as(1756): col: 59 Error: Access of undefined property DataGridHeaderSeparatorSkin.
this.headerSeparatorSkin = mx.skins.spark.DataGridHeaderSeparatorSkin;
^
_TestRunner_Styles.as(1757): col: 60 Error: Access of undefined property DataGridHeaderBackgroundSkin.
this.headerBackgroundSkin = mx.skins.spark.DataGridHeaderBackgroundSkin;
^
_TestRunner_Styles.as(1819): col: 52 Error: Access of undefined property DateChooserNextYearSkin.
this.nextYearSkin = mx.skins.spark.DateChooserNextYearSkin;
^
_TestRunner_Styles.as(1820): col: 53 Error: Access of undefined property DateChooserNextMonthSkin.
this.nextMonthSkin = mx.skins.spark.DateChooserNextMonthSkin;
^
_TestRunner_Styles.as(1821): col: 62 Error: Access of undefined property DateChooserSelectionIndicatorSkin.
this.selectionIndicatorSkin = mx.skins.spark.DateChooserSelectionIndicatorSkin;
^
_TestRunner_Styles.as(1823): col: 53 Error: Access of undefined property DateChooserPrevMonthSkin.
this.prevMonthSkin = mx.skins.spark.DateChooserPrevMonthSkin;
^
_TestRunner_Styles.as(1825): col: 50 Error: Access of undefined property BorderSkin.
this.borderSkin = mx.skins.spark.BorderSkin;
^
_TestRunner_Styles.as(1827): col: 61 Error: Access of undefined property DateChooserRollOverIndicatorSkin.
this.rollOverIndicatorSkin = mx.skins.spark.DateChooserRollOverIndicatorSkin;
^
_TestRunner_Styles.as(1829): col: 58 Error: Access of undefined property DateChooserTodayIndicatorSkin.
this.todayIndicatorSkin = mx.skins.spark.DateChooserTodayIndicatorSkin;
^
_TestRunner_Styles.as(1830): col: 52 Error: Access of undefined property DateChooserPrevYearSkin.
this.prevYearSkin = mx.skins.spark.DateChooserPrevYearSkin;
^
_TestRunner_Styles.as(2225): col: 44 Error: Access of undefined property LinkButtonSkin.
this.skin = mx.skins.spark.LinkButtonSkin;
^
_TestRunner_Styles.as(2364): col: 49 Error: Access of undefined property MenuRadio.
this.radioIcon = mx.skins.spark.MenuRadio;
^
_TestRunner_Styles.as(2368): col: 50 Error: Access of undefined property MenuArrow.
this.branchIcon = mx.skins.spark.MenuArrow;
^
_TestRunner_Styles.as(2369): col: 57 Error: Access of undefined property MenuCheckDisabled.
this.checkDisabledIcon = mx.skins.spark.MenuCheckDisabled;
^
_TestRunner_Styles.as(2373): col: 49 Error: Access of undefined property MenuCheck.
this.checkIcon = mx.skins.spark.MenuCheck;
^
_TestRunner_Styles.as(2374): col: 57 Error: Access of undefined property MenuRadioDisabled.
this.radioDisabledIcon = mx.skins.spark.MenuRadioDisabled;
^
_TestRunner_Styles.as(2376): col: 58 Error: Access of undefined property MenuArrowDisabled.
this.branchDisabledIcon = mx.skins.spark.MenuArrowDisabled;
^
_TestRunner_Styles.as(2378): col: 53 Error: Access of undefined property MenuSeparatorSkin.
this.separatorSkin = mx.skins.spark.MenuSeparatorSkin;
^
_TestRunner_Styles.as(2441): col: 48 Error: Access of undefined property MenuItemSkin.
this.itemSkin = mx.skins.spark.MenuItemSkin;
^
_TestRunner_Styles.as(2442): col: 54 Error: Access of undefined property ButtonSkin.
this.backgroundSkin = mx.skins.spark.ButtonSkin;
^
_TestRunner_Styles.as(2472): col: 50 Error: Access of undefined property BorderSkin.
this.borderSkin = mx.skins.spark.BorderSkin;
^
_TestRunner_Styles.as(2502): col: 53 Error: Access of undefined property StepperDecrButtonSkin.
this.downArrowSkin = mx.skins.spark.StepperDecrButtonSkin;
^
_TestRunner_Styles.as(2503): col: 51 Error: Access of undefined property StepperIncrButtonSkin.
this.upArrowSkin = mx.skins.spark.StepperIncrButtonSkin;
^
_TestRunner_Styles.as(2548): col: 50 Error: Access of undefined property PanelBorderSkin.
this.borderSkin = mx.skins.spark.PanelBorderSkin;
^
_TestRunner_Styles.as(2590): col: 44 Error: Access of undefined property PopUpButtonSkin.
this.skin = mx.skins.spark.PopUpButtonSkin;
^
_TestRunner_Styles.as(2653): col: 53 Error: Access of undefined property DataGridSortArrow.
this.sortArrowSkin = mx.skins.spark.DataGridSortArrow;
^
_TestRunner_Styles.as(2693): col: 47 Error: Access of undefined property ProgressBarSkin.
this.barSkin = mx.skins.spark.ProgressBarSkin;
^
_TestRunner_Styles.as(2694): col: 49 Error: Access of undefined property ProgressBarTrackSkin.
this.trackSkin = mx.skins.spark.ProgressBarTrackSkin;
^
_TestRunner_Styles.as(2696): col: 48 Error: Access of undefined property ProgressMaskSkin.
this.maskSkin = mx.skins.spark.ProgressMaskSkin;
^
_TestRunner_Styles.as(2697): col: 57 Error: Access of undefined property ProgressIndeterminateSkin.
this.indeterminateSkin = mx.skins.spark.ProgressIndeterminateSkin;
^
_TestRunner_Styles.as(2740): col: 44 Error: Access of undefined property RadioButtonSkin.
this.icon = mx.skins.spark.RadioButtonSkin;
^
_TestRunner_Styles.as(2874): col: 49 Error: Access of undefined property ScrollBarTrackSkin.
this.trackSkin = mx.skins.spark.ScrollBarTrackSkin;
^
_TestRunner_Styles.as(2875): col: 53 Error: Access of undefined property ScrollBarDownButtonSkin.
this.downArrowSkin = mx.skins.spark.ScrollBarDownButtonSkin;
^
_TestRunner_Styles.as(2876): col: 51 Error: Access of undefined property ScrollBarUpButtonSkin.
this.upArrowSkin = mx.skins.spark.ScrollBarUpButtonSkin;
^
_TestRunner_Styles.as(2879): col: 49 Error: Access of undefined property ScrollBarThumbSkin.
this.thumbSkin = mx.skins.spark.ScrollBarThumbSkin;
^
_TestRunner_Styles.as(2910): col: 50 Error: Access of undefined property BorderSkin.
this.borderSkin = mx.skins.spark.BorderSkin;
^
_TestRunner_Styles.as(2946): col: 49 Error: Access of undefined property SliderTrackSkin.
this.trackSkin = mx.skins.spark.SliderTrackSkin;
^
_TestRunner_Styles.as(2948): col: 58 Error: Access of undefined property SliderTrackHighlightSkin.
this.trackHighlightSkin = mx.skins.spark.SliderTrackHighlightSkin;
^
_TestRunner_Styles.as(2952): col: 49 Error: Access of undefined property SliderThumbSkin.
this.thumbSkin = mx.skins.spark.SliderThumbSkin;
^
_TestRunner_Styles.as(3043): col: 44 Error: Access of undefined property TabSkin.
this.skin = mx.skins.spark.TabSkin;
^
_TestRunner_Styles.as(3208): col: 50 Error: Access of undefined property TextInputBorderSkin.
this.borderSkin = mx.skins.spark.TextInputBorderSkin;
^
_TestRunner_Styles.as(3388): col: 50 Error: Access of undefined property BorderSkin.
this.borderSkin = mx.skins.spark.BorderSkin;
^
_TestRunner_Styles.as(12): col: 22 Error: Definition mx.skins.spark:BorderSkin could not be found.
import mx.skins.spark.BorderSkin;
^
_TestRunner_Styles.as(13): col: 22 Error: Definition mx.skins.spark:ScrollBarDownButtonSkin could not be found.
import mx.skins.spark.ScrollBarDownButtonSkin;
^
_TestRunner_Styles.as(14): col: 22 Error: Definition mx.skins.spark:PopUpButtonSkin could not be found.
import mx.skins.spark.PopUpButtonSkin;
^
_TestRunner_Styles.as(16): col: 22 Error: Definition mx.skins.spark:DateChooserPrevMonthSkin could not be found.
import mx.skins.spark.DateChooserPrevMonthSkin;
^
_TestRunner_Styles.as(17): col: 22 Error: Definition mx.skins.spark:MenuCheckDisabled could not be found.
import mx.skins.spark.MenuCheckDisabled;
^
_TestRunner_Styles.as(18): col: 22 Error: Definition mx.skins.spark:DateChooserPrevYearSkin could not be found.
import mx.skins.spark.DateChooserPrevYearSkin;
^
_TestRunner_Styles.as(19): col: 22 Error: Definition mx.skins.spark:TabSkin could not be found.
import mx.skins.spark.TabSkin;
^
_TestRunner_Styles.as(20): col: 22 Error: Definition mx.skins.spark:ButtonBarLastButtonSkin could not be found.
import mx.skins.spark.ButtonBarLastButtonSkin;
^
_TestRunner_Styles.as(21): col: 22 Error: Definition mx.skins.spark:DateChooserTodayIndicatorSkin could not be found.
import mx.skins.spark.DateChooserTodayIndicatorSkin;
^
_TestRunner_Styles.as(22): col: 22 Error: Definition mx.skins.spark:ScrollBarUpButtonSkin could not be found.
import mx.skins.spark.ScrollBarUpButtonSkin;
^
_TestRunner_Styles.as(23): col: 22 Error: Definition mx.skins.spark:MenuSeparatorSkin could not be found.
import mx.skins.spark.MenuSeparatorSkin;
^
_TestRunner_Styles.as(27): col: 22 Error: Definition mx.skins.spark:ScrollBarThumbSkin could not be found.
import mx.skins.spark.ScrollBarThumbSkin;
^
_TestRunner_Styles.as(28): col: 22 Error: Definition mx.skins.spark:ColorPickerSkin could not be found.
import mx.skins.spark.ColorPickerSkin;
^
_TestRunner_Styles.as(29): col: 22 Error: Definition mx.skins.spark:CheckBoxSkin could not be found.
import mx.skins.spark.CheckBoxSkin;
^
_TestRunner_Styles.as(30): col: 22 Error: Definition mx.skins.spark:MenuRadioDisabled could not be found.
import mx.skins.spark.MenuRadioDisabled;
^
_TestRunner_Styles.as(31): col: 22 Error: Definition mx.skins.spark:SliderTrackHighlightSkin could not be found.
import mx.skins.spark.SliderTrackHighlightSkin;
^
_TestRunner_Styles.as(32): col: 22 Error: Definition mx.skins.spark:DefaultButtonSkin could not be found.
import mx.skins.spark.DefaultButtonSkin;
^
_TestRunner_Styles.as(33): col: 22 Error: Definition mx.skins.spark:MenuArrow could not be found.
import mx.skins.spark.MenuArrow;
^
_TestRunner_Styles.as(34): col: 22 Error: Definition mx.skins.spark:PanelBorderSkin could not be found.
import mx.skins.spark.PanelBorderSkin;
^
_TestRunner_Styles.as(35): col: 22 Error: Definition mx.skins.spark:AccordionHeaderSkin could not be found.
import mx.skins.spark.AccordionHeaderSkin;
^
_TestRunner_Styles.as(36): col: 22 Error: Definition mx.skins.spark:MenuCheck could not be found.
import mx.skins.spark.MenuCheck;
^
_TestRunner_Styles.as(37): col: 22 Error: Definition mx.skins.spark:DataGridHeaderBackgroundSkin could not be found.
import mx.skins.spark.DataGridHeaderBackgroundSkin;
^
_TestRunner_Styles.as(39): col: 22 Error: Definition mx.skins.spark:ScrollBarTrackSkin could not be found.
import mx.skins.spark.ScrollBarTrackSkin;
^
_TestRunner_Styles.as(40): col: 22 Error: Definition mx.skins.spark:DataGridSortArrow could not be found.
import mx.skins.spark.DataGridSortArrow;
^
_TestRunner_Styles.as(41): col: 22 Error: Definition mx.skins.spark:DateChooserNextMonthSkin could not be found.
import mx.skins.spark.DateChooserNextMonthSkin;
^
_TestRunner_Styles.as(42): col: 22 Error: Definition mx.skins.spark:MenuArrowDisabled could not be found.
import mx.skins.spark.MenuArrowDisabled;
^
_TestRunner_Styles.as(43): col: 22 Error: Definition mx.skins.spark:MenuRadio could not be found.
import mx.skins.spark.MenuRadio;
^
_TestRunner_Styles.as(46): col: 22 Error: Definition mx.skins.spark:ProgressBarSkin could not be found.
import mx.skins.spark.ProgressBarSkin;
^
_TestRunner_Styles.as(47): col: 22 Error: Definition mx.skins.spark:ButtonBarFirstButtonSkin could not be found.
import mx.skins.spark.ButtonBarFirstButtonSkin;
^
_TestRunner_Styles.as(49): col: 22 Error: Definition mx.skins.spark:StepperIncrButtonSkin could not be found.
import mx.skins.spark.StepperIncrButtonSkin;
^
_TestRunner_Styles.as(50): col: 22 Error: Definition mx.skins.spark:ProgressMaskSkin could not be found.
import mx.skins.spark.ProgressMaskSkin;
^
_TestRunner_Styles.as(51): col: 22 Error: Definition mx.skins.spark:ButtonBarMiddleButtonSkin could not be found.
import mx.skins.spark.ButtonBarMiddleButtonSkin;
^
_TestRunner_Styles.as(52): col: 22 Error: Definition mx.skins.spark:ProgressBarTrackSkin could not be found.
import mx.skins.spark.ProgressBarTrackSkin;
^
_TestRunner_Styles.as(54): col: 22 Error: Definition mx.skins.spark:StepperDecrButtonSkin could not be found.
import mx.skins.spark.StepperDecrButtonSkin;
^
_TestRunner_Styles.as(55): col: 22 Error: Definition mx.skins.spark:ProgressIndeterminateSkin could not be found.
import mx.skins.spark.ProgressIndeterminateSkin;
^
_TestRunner_Styles.as(56): col: 22 Error: Definition mx.skins.spark:TextInputBorderSkin could not be found.
import mx.skins.spark.TextInputBorderSkin;
^
_TestRunner_Styles.as(58): col: 22 Error: Definition mx.skins.spark:SliderThumbSkin could not be found.
import mx.skins.spark.SliderThumbSkin;
^
_TestRunner_Styles.as(60): col: 22 Error: Definition mx.skins.spark:RadioButtonSkin could not be found.
import mx.skins.spark.RadioButtonSkin;
^
_TestRunner_Styles.as(61): col: 22 Error: Definition mx.skins.spark:ComboBoxSkin could not be found.
import mx.skins.spark.ComboBoxSkin;
^
_TestRunner_Styles.as(62): col: 22 Error: Definition mx.skins.spark:ButtonSkin could not be found.
import mx.skins.spark.ButtonSkin;
^
_TestRunner_Styles.as(66): col: 22 Error: Definition mx.skins.spark:DataGridHeaderSeparatorSkin could not be found.
import mx.skins.spark.DataGridHeaderSeparatorSkin;
^
_TestRunner_Styles.as(67): col: 22 Error: Definition mx.skins.spark:EditableComboBoxSkin could not be found.
import mx.skins.spark.EditableComboBoxSkin;
^
_TestRunner_Styles.as(68): col: 22 Error: Definition mx.skins.spark:DateChooserRollOverIndicatorSkin could not be found.
import mx.skins.spark.DateChooserRollOverIndicatorSkin;
^
_TestRunner_Styles.as(69): col: 22 Error: Definition mx.skins.spark:LinkButtonSkin could not be found.
import mx.skins.spark.LinkButtonSkin;
^
_TestRunner_Styles.as(71): col: 22 Error: Definition mx.skins.spark:SliderTrackSkin could not be found.
import mx.skins.spark.SliderTrackSkin;
^
_TestRunner_Styles.as(72): col: 22 Error: Definition mx.skins.spark:DateChooserSelectionIndicatorSkin could not be found.
import mx.skins.spark.DateChooserSelectionIndicatorSkin;
^
_TestRunner_Styles.as(77): col: 22 Error: Definition mx.skins.spark:MenuItemSkin could not be found.
import mx.skins.spark.MenuItemSkin;
^
_TestRunner_Styles.as(78): col: 22 Error: Definition mx.skins.spark:DateChooserNextYearSkin could not be found.
import mx.skins.spark.DateChooserNextYearSkin;
^
_TestRunner_Styles.as(80): col: 22 Error: Definition mx.skins.spark:ContainerBorderSkin could not be found.
import mx.skins.spark.ContainerBorderSkin;
^
Encountered too many errors!
[INFO] ------------------------------------------------------------------------
[INFO] Reactor Summary:
[INFO]
[INFO] Spring Actionscript ............................... SUCCESS [1.592s]
[INFO] Spring Actionscript Core .......................... FAILURE [39.882s]
[INFO] Spring Actionscript Flex Extensions ............... SKIPPED
[INFO] Spring Actionscript MVC ........................... SKIPPED
[INFO] Spring Actionscript Security ...................... SKIPPED
[INFO] ------------------------------------------------------------------------
[INFO] BUILD FAILURE
[INFO] ------------------------------------------------------------------------
[INFO] Total time: 49.996s
[INFO] Finished at: Thu Oct 13 11:42:53 CEST 2011
[INFO] Final Memory: 14M/1040M
[INFO] ------------------------------------------------------------------------
[ERROR] Failed to execute goal org.sonatype.flexmojos:flexmojos-maven-plugin:4.0-RC2:test-compile (default-test-compile) on project spring-actionscript-core: Got 105 errors building project, check logs -> [Help 1]
[ERROR]
[ERROR] To see the full stack trace of the errors, re-run Maven with the -e switch.
[ERROR] Re-run Maven using the -X switch to enable full debug logging.
[ERROR]
[ERROR] For more information about the errors and possible solutions, please read the following articles:
[ERROR] [Help 1] http://cwiki.apache.org/confluence/display/MAVEN/MojoFailureException
[ERROR]
[ERROR] After correcting the problems, you can resume the build with the command
[ERROR] mvn <goals> -rf :spring-actionscript-core
beat:2.0 olli$
Sign up for free to join this conversation on GitHub. Already have an account? Sign in to comment
Something went wrong with that request. Please try again.