Skip to content

@pmros /gist:6254407
Created

Embed URL

HTTPS clone URL

Subversion checkout URL

You can clone with
or
.
Download ZIP
Error when I try to install lives from AUR.
asf_decoder.c:66:21: error: return type is an incomplete type
static enum CodecID ff_codec_get_id(const AVCodecTag *tags, unsigned int tag)
^
asf_decoder.c: In function 'ff_codec_get_id':
asf_decoder.c:71:7: warning: 'return' with a value, in function returning void [enabled by default]
return tags[i].id;
^
asf_decoder.c:74:5: warning: implicit declaration of function 'toupper' [-Wimplicit-function-declaration]
if( toupper((tag >> 0)&0xFF) == toupper((tags[i].tag >> 0)&0xFF)
^
asf_decoder.c:78:7: warning: 'return' with a value, in function returning void [enabled by default]
return tags[i].id;
^
asf_decoder.c:80:3: warning: 'return' with a value, in function returning void [enabled by default]
return CODEC_ID_NONE;
^
asf_decoder.c: In function 'attach_stream':
asf_decoder.c:1351:30: error: void value not ignored as it ought to be
priv->st->codec->codec_id = ff_codec_get_id((const AVCodecTag*)(codec_bmp_tags), tag1);
^
asf_decoder.c:2006:3: warning: implicit declaration of function 'avcodec_open' [-Wimplicit-function-declaration]
if ((retval=avcodec_open(vidst->codec, codec)) < 0) {
^
make[3]: *** [asf_decoder_la-asf_decoder.lo] Error 1
make[3]: se sale del directorio `/tmp/yaourt-tmp-pmros/aur-lives/src/lives-2.0.5/lives-plugins/plugins/decoders'
make[2]: *** [all-recursive] Error 1
make[2]: se sale del directorio `/tmp/yaourt-tmp-pmros/aur-lives/src/lives-2.0.5/lives-plugins/plugins'
make[1]: *** [all-recursive] Error 1
make[1]: se sale del directorio `/tmp/yaourt-tmp-pmros/aur-lives/src/lives-2.0.5/lives-plugins'
make: *** [all-recursive] Error 1
@djehauti

got the same error, you ever find a way around it?

Sign up for free to join this conversation on GitHub. Already have an account? Sign in to comment
Something went wrong with that request. Please try again.