Skip to content

Instantly share code, notes, and snippets.

@raku-cat

raku-cat/debug

Created Apr 19, 2016
Embed
What would you like to do?
12:14:35.157 [DEBUG] [org.gradle.internal.nativeintegration.services.NativeServices] Unable to load from native-platform backed ConsoleDetector. Continuing with fallback. Failure: net.rubygrapefruit.platform.NativeException: Failed to load native library 'libnative-platform-curses.so' for Linux amd64.
caused by: java.lang.UnsatisfiedLinkError: /home/josh/.gradle/native/19/linux-amd64/libnative-platform-curses.so: libncurses.so.5: cannot open shared object file: No such file or directory
12:14:35.880 [INFO] [org.gradle.BuildLogger] Starting Build
12:14:35.884 [DEBUG] [org.gradle.BuildLogger] Gradle user home: /home/josh/.gradle
12:14:35.884 [DEBUG] [org.gradle.BuildLogger] Current dir: /home/josh/AndroidN-ify
12:14:35.885 [DEBUG] [org.gradle.BuildLogger] Settings file: null
12:14:35.886 [DEBUG] [org.gradle.BuildLogger] Build file: null
12:14:35.897 [DEBUG] [org.gradle.initialization.buildsrc.BuildSourceBuilder] Starting to build the build sources.
12:14:35.898 [DEBUG] [org.gradle.initialization.buildsrc.BuildSourceBuilder] Gradle source dir does not exist. We leave.
12:14:35.900 [DEBUG] [org.gradle.initialization.DefaultGradlePropertiesLoader] Found env project properties: []
12:14:35.901 [DEBUG] [org.gradle.initialization.DefaultGradlePropertiesLoader] Found system project properties: []
12:14:36.065 [DEBUG] [org.gradle.api.internal.artifacts.mvnsettings.DefaultLocalMavenRepositoryLocator] No local repository in Settings file defined. Using default path: /home/josh/.m2/repository
12:14:36.239 [DEBUG] [org.gradle.messaging.remote.internal.inet.InetAddressFactory] Adding IP addresses for network interface enp5s0
12:14:36.241 [DEBUG] [org.gradle.messaging.remote.internal.inet.InetAddressFactory] Is this a loopback interface? false
12:14:36.245 [DEBUG] [org.gradle.messaging.remote.internal.inet.InetAddressFactory] Is this a multicast interface? true
12:14:36.247 [DEBUG] [org.gradle.messaging.remote.internal.inet.InetAddressFactory] Adding remote address /fd66:beef:0:0:d01d:ba04:e376:2a0f%enp5s0
12:14:36.249 [DEBUG] [org.gradle.messaging.remote.internal.inet.InetAddressFactory] Adding remote address /2601:2c7:4002:b500:dbd8:af69:8d12:e52%enp5s0
12:14:36.249 [DEBUG] [org.gradle.messaging.remote.internal.inet.InetAddressFactory] Adding remote address /fd66:beef:0:0:0:0:0:f84%enp5s0
12:14:36.250 [DEBUG] [org.gradle.messaging.remote.internal.inet.InetAddressFactory] Adding remote address /fd66:beef:0:0:dacb:8aff:fe98:5a00%enp5s0
12:14:36.251 [DEBUG] [org.gradle.messaging.remote.internal.inet.InetAddressFactory] Adding remote address /2601:2c7:4002:b500:dacb:8aff:fe98:5a00%enp5s0
12:14:36.251 [DEBUG] [org.gradle.messaging.remote.internal.inet.InetAddressFactory] Adding remote address /fe80:0:0:0:dacb:8aff:fe98:5a00%enp5s0
12:14:36.252 [DEBUG] [org.gradle.messaging.remote.internal.inet.InetAddressFactory] Adding remote address /192.168.1.5
12:14:36.252 [DEBUG] [org.gradle.messaging.remote.internal.inet.InetAddressFactory] Adding remote multicast interface enp5s0
12:14:36.253 [DEBUG] [org.gradle.messaging.remote.internal.inet.InetAddressFactory] Adding IP addresses for network interface lo
12:14:36.253 [DEBUG] [org.gradle.messaging.remote.internal.inet.InetAddressFactory] Is this a loopback interface? true
12:14:36.254 [DEBUG] [org.gradle.messaging.remote.internal.inet.InetAddressFactory] Is this a multicast interface? false
12:14:36.254 [DEBUG] [org.gradle.messaging.remote.internal.inet.InetAddressFactory] Adding loopback address /0:0:0:0:0:0:0:1%lo
12:14:36.255 [DEBUG] [org.gradle.messaging.remote.internal.inet.InetAddressFactory] Adding loopback address /127.0.0.1
12:14:36.263 [DEBUG] [org.gradle.cache.internal.DefaultFileLockManager] Waiting to acquire shared lock on buildscript class cache for settings file '/home/josh/AndroidN-ify/settings.gradle' (/home/josh/.gradle/caches/2.2/scripts/settings_cj0dezzn9ypvmt0ekb7itqae2/SettingsScript/buildscript).
12:14:36.264 [DEBUG] [org.gradle.cache.internal.DefaultFileLockManager] Lock acquired.
12:14:36.337 [DEBUG] [org.gradle.cache.internal.DefaultFileLockManager] Waiting to acquire shared lock on no_buildscript class cache for settings file '/home/josh/AndroidN-ify/settings.gradle' (/home/josh/.gradle/caches/2.2/scripts/settings_cj0dezzn9ypvmt0ekb7itqae2/SettingsScript/no_buildscript).
12:14:36.337 [DEBUG] [org.gradle.cache.internal.DefaultFileLockManager] Lock acquired.
12:14:36.410 [DEBUG] [org.gradle.initialization.ScriptEvaluatingSettingsProcessor] Timing: Processing settings took: 0.509 secs
12:14:36.412 [INFO] [org.gradle.BuildLogger] Settings evaluated using settings file '/home/josh/AndroidN-ify/settings.gradle'.
12:14:36.476 [DEBUG] [org.gradle.initialization.ProjectPropertySettingBuildLoader] Looking for project properties from: /home/josh/AndroidN-ify/gradle.properties
12:14:36.476 [DEBUG] [org.gradle.initialization.ProjectPropertySettingBuildLoader] Adding project properties (if not overwritten by user properties): []
12:14:36.477 [DEBUG] [org.gradle.initialization.ProjectPropertySettingBuildLoader] Looking for project properties from: /home/josh/AndroidN-ify/app/gradle.properties
12:14:36.478 [DEBUG] [org.gradle.initialization.ProjectPropertySettingBuildLoader] project property file does not exists. We continue!
12:14:36.478 [INFO] [org.gradle.BuildLogger] Projects loaded. Root project using build file '/home/josh/AndroidN-ify/build.gradle'.
12:14:36.479 [INFO] [org.gradle.BuildLogger] Included projects: [root project 'AndroidN-ify', project ':app']
12:14:36.641 [INFO] [org.gradle.configuration.project.BuildScriptProcessor] Evaluating root project 'AndroidN-ify' using build file '/home/josh/AndroidN-ify/build.gradle'.
12:14:36.646 [DEBUG] [org.gradle.cache.internal.DefaultFileLockManager] Waiting to acquire shared lock on buildscript class cache for build file '/home/josh/AndroidN-ify/build.gradle' (/home/josh/.gradle/caches/2.2/scripts/build_42yf2uvlfewnck4p2tlhrwowm/ProjectScript/buildscript).
12:14:36.646 [DEBUG] [org.gradle.cache.internal.DefaultFileLockManager] Lock acquired.
12:14:36.724 [DEBUG] [org.gradle.cache.internal.DefaultFileLockManager] Waiting to acquire exclusive lock on artifact cache (/home/josh/.gradle/caches/modules-2).
12:14:36.726 [DEBUG] [org.gradle.cache.internal.DefaultFileLockManager] Lock acquired.
12:14:36.728 [DEBUG] [org.gradle.cache.internal.locklistener.DefaultFileLockContentionHandler] Starting file lock listener thread.
12:14:36.728 [DEBUG] [org.gradle.api.internal.artifacts.ivyservice.resolveengine.DefaultDependencyResolver] Resolving configuration ':classpath'
12:14:36.830 [DEBUG] [org.gradle.api.internal.artifacts.ivyservice.IvyLoggingAdaper] setting 'ivy.default.settings.dir' to 'jar:file:/home/josh/.gradle/wrapper/dists/gradle-2.2-all/vk5dmipuddvq5mpa6rlusql2u/gradle-2.2/lib/plugins/ivy-2.2.0.jar!/org/apache/ivy/core/settings'
12:14:36.832 [DEBUG] [org.gradle.api.internal.artifacts.ivyservice.IvyLoggingAdaper] setting 'ivy.basedir' to '/home/josh/AndroidN-ify/.'
12:14:36.834 [DEBUG] [org.gradle.api.internal.artifacts.ivyservice.IvyLoggingAdaper] setting 'ivy.default.conf.dir' to 'jar:file:/home/josh/.gradle/wrapper/dists/gradle-2.2-all/vk5dmipuddvq5mpa6rlusql2u/gradle-2.2/lib/plugins/ivy-2.2.0.jar!/org/apache/ivy/core/settings'
12:14:36.865 [DEBUG] [org.gradle.api.internal.artifacts.ivyservice.IvyLoggingAdaper] setting 'java.runtime.name' to 'OpenJDK Runtime Environment'
12:14:36.866 [DEBUG] [org.gradle.api.internal.artifacts.ivyservice.IvyLoggingAdaper] setting 'java.vm.version' to '25.77-b03'
12:14:36.866 [DEBUG] [org.gradle.api.internal.artifacts.ivyservice.IvyLoggingAdaper] setting 'sun.boot.library.path' to '/usr/lib/jvm/java-8-openjdk/jre/lib/amd64'
12:14:36.868 [DEBUG] [org.gradle.api.internal.artifacts.ivyservice.IvyLoggingAdaper] setting 'java.vm.vendor' to 'Oracle Corporation'
12:14:36.868 [DEBUG] [org.gradle.api.internal.artifacts.ivyservice.IvyLoggingAdaper] setting 'java.vendor.url' to 'http://java.oracle.com/'
12:14:36.869 [DEBUG] [org.gradle.api.internal.artifacts.ivyservice.IvyLoggingAdaper] setting 'path.separator' to ':'
12:14:36.869 [DEBUG] [org.gradle.api.internal.artifacts.ivyservice.IvyLoggingAdaper] setting 'java.vm.name' to 'OpenJDK 64-Bit Server VM'
12:14:36.877 [DEBUG] [org.gradle.api.internal.artifacts.ivyservice.IvyLoggingAdaper] setting 'file.encoding.pkg' to 'sun.io'
12:14:36.877 [DEBUG] [org.gradle.api.internal.artifacts.ivyservice.IvyLoggingAdaper] setting 'sun.os.patch.level' to 'unknown'
12:14:36.878 [DEBUG] [org.gradle.api.internal.artifacts.ivyservice.IvyLoggingAdaper] setting 'user.country' to 'US'
12:14:36.878 [DEBUG] [org.gradle.api.internal.artifacts.ivyservice.IvyLoggingAdaper] setting 'sun.java.launcher' to 'SUN_STANDARD'
12:14:36.878 [DEBUG] [org.gradle.api.internal.artifacts.ivyservice.IvyLoggingAdaper] setting 'java.vm.specification.name' to 'Java Virtual Machine Specification'
12:14:36.879 [DEBUG] [org.gradle.api.internal.artifacts.ivyservice.IvyLoggingAdaper] setting 'user.dir' to '/home/josh/AndroidN-ify'
12:14:36.879 [DEBUG] [org.gradle.api.internal.artifacts.ivyservice.IvyLoggingAdaper] setting 'java.runtime.version' to '1.8.0_77-b03'
12:14:36.879 [DEBUG] [org.gradle.api.internal.artifacts.ivyservice.IvyLoggingAdaper] setting 'java.awt.graphicsenv' to 'sun.awt.X11GraphicsEnvironment'
12:14:36.880 [DEBUG] [org.gradle.api.internal.artifacts.ivyservice.IvyLoggingAdaper] setting 'os.arch' to 'amd64'
12:14:36.881 [DEBUG] [org.gradle.api.internal.artifacts.ivyservice.IvyLoggingAdaper] setting 'java.endorsed.dirs' to '/usr/lib/jvm/java-8-openjdk/jre/lib/endorsed'
12:14:36.881 [DEBUG] [org.gradle.api.internal.artifacts.ivyservice.IvyLoggingAdaper] setting 'java.io.tmpdir' to '/tmp'
12:14:36.882 [DEBUG] [org.gradle.api.internal.artifacts.ivyservice.IvyLoggingAdaper] setting 'line.separator' to '
'
12:14:36.882 [DEBUG] [org.gradle.api.internal.artifacts.ivyservice.IvyLoggingAdaper] setting 'org.gradle.appname' to 'gradlew'
12:14:36.882 [DEBUG] [org.gradle.api.internal.artifacts.ivyservice.IvyLoggingAdaper] setting 'java.vm.specification.vendor' to 'Oracle Corporation'
12:14:36.883 [DEBUG] [org.gradle.api.internal.artifacts.ivyservice.IvyLoggingAdaper] setting 'os.name' to 'Linux'
12:14:36.883 [DEBUG] [org.gradle.api.internal.artifacts.ivyservice.IvyLoggingAdaper] setting 'sun.jnu.encoding' to 'UTF-8'
12:14:36.886 [DEBUG] [org.gradle.api.internal.artifacts.ivyservice.IvyLoggingAdaper] setting 'java.library.path' to '/usr/java/packages/lib/amd64:/usr/lib64:/lib64:/lib:/usr/lib'
12:14:36.886 [DEBUG] [org.gradle.api.internal.artifacts.ivyservice.IvyLoggingAdaper] setting 'http.keepAlive' to 'true'
12:14:36.886 [DEBUG] [org.gradle.api.internal.artifacts.ivyservice.IvyLoggingAdaper] setting 'java.class.version' to '52.0'
12:14:36.886 [DEBUG] [org.gradle.api.internal.artifacts.ivyservice.IvyLoggingAdaper] setting 'java.specification.name' to 'Java Platform API Specification'
12:14:36.887 [DEBUG] [org.gradle.api.internal.artifacts.ivyservice.IvyLoggingAdaper] setting 'sun.management.compiler' to 'HotSpot 64-Bit Tiered Compilers'
12:14:36.887 [DEBUG] [org.gradle.api.internal.artifacts.ivyservice.IvyLoggingAdaper] setting 'os.version' to '4.5.0-1-ARCH'
12:14:36.887 [DEBUG] [org.gradle.api.internal.artifacts.ivyservice.IvyLoggingAdaper] setting 'user.home' to '/home/josh'
12:14:36.888 [DEBUG] [org.gradle.api.internal.artifacts.ivyservice.IvyLoggingAdaper] setting 'user.timezone' to 'America/Chicago'
12:14:36.888 [DEBUG] [org.gradle.api.internal.artifacts.ivyservice.IvyLoggingAdaper] setting 'java.awt.printerjob' to 'sun.print.PSPrinterJob'
12:14:36.888 [DEBUG] [org.gradle.api.internal.artifacts.ivyservice.IvyLoggingAdaper] setting 'file.encoding' to 'UTF-8'
12:14:36.889 [DEBUG] [org.gradle.api.internal.artifacts.ivyservice.IvyLoggingAdaper] setting 'java.specification.version' to '1.8'
12:14:36.889 [DEBUG] [org.gradle.api.internal.artifacts.ivyservice.IvyLoggingAdaper] setting 'user.name' to 'josh'
12:14:36.889 [DEBUG] [org.gradle.api.internal.artifacts.ivyservice.IvyLoggingAdaper] setting 'java.class.path' to '/home/josh/AndroidN-ify/gradle/wrapper/gradle-wrapper.jar'
12:14:36.889 [DEBUG] [org.gradle.api.internal.artifacts.ivyservice.IvyLoggingAdaper] setting 'java.vm.specification.version' to '1.8'
12:14:36.890 [DEBUG] [org.gradle.api.internal.artifacts.ivyservice.IvyLoggingAdaper] setting 'sun.arch.data.model' to '64'
12:14:36.890 [DEBUG] [org.gradle.api.internal.artifacts.ivyservice.IvyLoggingAdaper] setting 'sun.java.command' to 'org.gradle.wrapper.GradleWrapperMain assemble --stacktrace --debug'
12:14:36.890 [DEBUG] [org.gradle.api.internal.artifacts.ivyservice.IvyLoggingAdaper] setting 'java.home' to '/usr/lib/jvm/java-8-openjdk/jre'
12:14:36.891 [DEBUG] [org.gradle.api.internal.artifacts.ivyservice.IvyLoggingAdaper] setting 'user.language' to 'en'
12:14:36.891 [DEBUG] [org.gradle.api.internal.artifacts.ivyservice.IvyLoggingAdaper] setting 'java.specification.vendor' to 'Oracle Corporation'
12:14:36.891 [DEBUG] [org.gradle.api.internal.artifacts.ivyservice.IvyLoggingAdaper] setting 'awt.toolkit' to 'sun.awt.X11.XToolkit'
12:14:36.891 [DEBUG] [org.gradle.api.internal.artifacts.ivyservice.IvyLoggingAdaper] setting 'java.vm.info' to 'mixed mode'
12:14:36.892 [DEBUG] [org.gradle.api.internal.artifacts.ivyservice.IvyLoggingAdaper] setting 'java.version' to '1.8.0_77'
12:14:36.892 [DEBUG] [org.gradle.api.internal.artifacts.ivyservice.IvyLoggingAdaper] setting 'java.ext.dirs' to '/usr/lib/jvm/java-8-openjdk/jre/lib/ext:/usr/java/packages/lib/ext'
12:14:36.892 [DEBUG] [org.gradle.api.internal.artifacts.ivyservice.IvyLoggingAdaper] setting 'sun.boot.class.path' to '/usr/lib/jvm/java-8-openjdk/jre/lib/resources.jar:/usr/lib/jvm/java-8-openjdk/jre/lib/rt.jar:/usr/lib/jvm/java-8-openjdk/jre/lib/sunrsasign.jar:/usr/lib/jvm/java-8-openjdk/jre/lib/jsse.jar:/usr/lib/jvm/java-8-openjdk/jre/lib/jce.jar:/usr/lib/jvm/java-8-openjdk/jre/lib/charsets.jar:/usr/lib/jvm/java-8-openjdk/jre/lib/jfr.jar:/usr/lib/jvm/java-8-openjdk/jre/classes'
12:14:36.893 [DEBUG] [org.gradle.api.internal.artifacts.ivyservice.IvyLoggingAdaper] setting 'java.vendor' to 'Oracle Corporation'
12:14:36.893 [DEBUG] [org.gradle.api.internal.artifacts.ivyservice.IvyLoggingAdaper] setting 'file.separator' to '/'
12:14:36.893 [DEBUG] [org.gradle.api.internal.artifacts.ivyservice.IvyLoggingAdaper] setting 'java.vendor.url.bug' to 'http://bugreport.sun.com/bugreport/'
12:14:36.893 [DEBUG] [org.gradle.api.internal.artifacts.ivyservice.IvyLoggingAdaper] setting 'sun.io.unicode.encoding' to 'UnicodeLittle'
12:14:36.894 [DEBUG] [org.gradle.api.internal.artifacts.ivyservice.IvyLoggingAdaper] setting 'sun.cpu.endian' to 'little'
12:14:36.894 [DEBUG] [org.gradle.api.internal.artifacts.ivyservice.IvyLoggingAdaper] setting 'sun.cpu.isalist' to ''
12:14:36.941 [DEBUG] [org.gradle.api.internal.artifacts.ivyservice.ivyresolve.memcache.InMemoryCachedRepositoryFactory] Creating new in-memory cache for repo 'BintrayJCenter' [22da77b0d76ea8df17298218f3ec1f87].
12:14:36.997 [DEBUG] [org.gradle.api.internal.artifacts.ivyservice.resolveengine.graph.DependencyGraphBuilder] Visiting configuration :AndroidN-ify:unspecified(classpath).
12:14:37.001 [DEBUG] [org.gradle.api.internal.artifacts.ivyservice.resolveengine.graph.DependencyGraphBuilder] Visiting dependency :AndroidN-ify:unspecified(classpath) -> com.android.tools.build:gradle:1.2.3(dependency: com.android.tools.build#gradle;1.2.3 {classpath=[default]})
12:14:37.004 [DEBUG] [org.gradle.api.internal.artifacts.ivyservice.resolveengine.graph.DependencyGraphBuilder] Selecting new module version com.android.tools.build:gradle:1.2.3
12:14:37.005 [DEBUG] [org.gradle.api.internal.artifacts.ivyservice.ivyresolve.RepositoryChainDependencyResolver] Attempting to resolve com.android.tools.build:gradle:1.2.3 using repositories [BintrayJCenter]
12:14:37.018 [DEBUG] [org.gradle.cache.internal.btree.BTreePersistentIndexedCache] Opening cache module-metadata.bin (/home/josh/.gradle/caches/modules-2/metadata-2.14/module-metadata.bin)
12:14:37.079 [DEBUG] [org.gradle.api.internal.artifacts.ivyservice.ivyresolve.parser.IvyXmlModuleDescriptorParser] post 1.3 ivy file: using exact as default matcher
12:14:37.091 [DEBUG] [org.gradle.api.internal.artifacts.ivyservice.ivyresolve.CachingModuleComponentRepository] Using cached module metadata for module 'com.android.tools.build:gradle:1.2.3' in 'BintrayJCenter'
12:14:37.094 [DEBUG] [org.gradle.api.internal.artifacts.ivyservice.ivyresolve.RepositoryChainDependencyResolver] Using com.android.tools.build:gradle:1.2.3 from Maven repository 'BintrayJCenter'
12:14:37.095 [DEBUG] [org.gradle.api.internal.artifacts.ivyservice.resolveengine.graph.DependencyGraphBuilder] Visiting configuration com.android.tools.build:gradle:1.2.3(default).
12:14:37.095 [DEBUG] [org.gradle.api.internal.artifacts.ivyservice.resolveengine.graph.DependencyGraphBuilder] Visiting dependency com.android.tools.build:gradle:1.2.3(default) -> com.android.tools.build:gradle-core:1.2.3(dependency: com.android.tools.build#gradle-core;1.2.3 {runtime=[compile(*), runtime(*), master(*)]})
12:14:37.096 [DEBUG] [org.gradle.api.internal.artifacts.ivyservice.resolveengine.graph.DependencyGraphBuilder] Selecting new module version com.android.tools.build:gradle-core:1.2.3
12:14:37.096 [DEBUG] [org.gradle.api.internal.artifacts.ivyservice.ivyresolve.RepositoryChainDependencyResolver] Attempting to resolve com.android.tools.build:gradle-core:1.2.3 using repositories [BintrayJCenter]
12:14:37.099 [DEBUG] [org.gradle.api.internal.artifacts.ivyservice.ivyresolve.parser.IvyXmlModuleDescriptorParser] post 1.3 ivy file: using exact as default matcher
12:14:37.104 [DEBUG] [org.gradle.api.internal.artifacts.ivyservice.ivyresolve.CachingModuleComponentRepository] Using cached module metadata for module 'com.android.tools.build:gradle-core:1.2.3' in 'BintrayJCenter'
12:14:37.104 [DEBUG] [org.gradle.api.internal.artifacts.ivyservice.ivyresolve.RepositoryChainDependencyResolver] Using com.android.tools.build:gradle-core:1.2.3 from Maven repository 'BintrayJCenter'
12:14:37.105 [DEBUG] [org.gradle.api.internal.artifacts.ivyservice.resolveengine.graph.DependencyGraphBuilder] Visiting configuration com.android.tools.build:gradle-core:1.2.3(compile).
12:14:37.105 [DEBUG] [org.gradle.api.internal.artifacts.ivyservice.resolveengine.graph.DependencyGraphBuilder] Visiting configuration com.android.tools.build:gradle-core:1.2.3(runtime).
12:14:37.107 [DEBUG] [org.gradle.api.internal.artifacts.ivyservice.resolveengine.graph.DependencyGraphBuilder] Visiting dependency com.android.tools.build:gradle-core:1.2.3(runtime) -> com.android.tools.build:builder:1.2.3(dependency: com.android.tools.build#builder;1.2.3 {runtime=[compile(*), runtime(*), master(*)]})
12:14:37.108 [DEBUG] [org.gradle.api.internal.artifacts.ivyservice.resolveengine.graph.DependencyGraphBuilder] Selecting new module version com.android.tools.build:builder:1.2.3
12:14:37.109 [DEBUG] [org.gradle.api.internal.artifacts.ivyservice.ivyresolve.RepositoryChainDependencyResolver] Attempting to resolve com.android.tools.build:builder:1.2.3 using repositories [BintrayJCenter]
12:14:37.116 [DEBUG] [org.gradle.api.internal.artifacts.ivyservice.ivyresolve.parser.IvyXmlModuleDescriptorParser] post 1.3 ivy file: using exact as default matcher
12:14:37.130 [DEBUG] [org.gradle.api.internal.artifacts.ivyservice.ivyresolve.CachingModuleComponentRepository] Using cached module metadata for module 'com.android.tools.build:builder:1.2.3' in 'BintrayJCenter'
12:14:37.130 [DEBUG] [org.gradle.api.internal.artifacts.ivyservice.ivyresolve.RepositoryChainDependencyResolver] Using com.android.tools.build:builder:1.2.3 from Maven repository 'BintrayJCenter'
12:14:37.131 [DEBUG] [org.gradle.api.internal.artifacts.ivyservice.resolveengine.graph.DependencyGraphBuilder] Visiting dependency com.android.tools.build:gradle-core:1.2.3(runtime) -> com.android.tools.lint:lint:24.2.3(dependency: com.android.tools.lint#lint;24.2.3 {runtime=[compile(*), runtime(*), master(*)]})
12:14:37.131 [DEBUG] [org.gradle.api.internal.artifacts.ivyservice.resolveengine.graph.DependencyGraphBuilder] Selecting new module version com.android.tools.lint:lint:24.2.3
12:14:37.131 [DEBUG] [org.gradle.api.internal.artifacts.ivyservice.ivyresolve.RepositoryChainDependencyResolver] Attempting to resolve com.android.tools.lint:lint:24.2.3 using repositories [BintrayJCenter]
12:14:37.134 [DEBUG] [org.gradle.api.internal.artifacts.ivyservice.ivyresolve.parser.IvyXmlModuleDescriptorParser] post 1.3 ivy file: using exact as default matcher
12:14:37.137 [DEBUG] [org.gradle.api.internal.artifacts.ivyservice.ivyresolve.CachingModuleComponentRepository] Using cached module metadata for module 'com.android.tools.lint:lint:24.2.3' in 'BintrayJCenter'
12:14:37.138 [DEBUG] [org.gradle.api.internal.artifacts.ivyservice.ivyresolve.RepositoryChainDependencyResolver] Using com.android.tools.lint:lint:24.2.3 from Maven repository 'BintrayJCenter'
12:14:37.138 [DEBUG] [org.gradle.api.internal.artifacts.ivyservice.resolveengine.graph.DependencyGraphBuilder] Visiting dependency com.android.tools.build:gradle-core:1.2.3(runtime) -> net.sf.proguard:proguard-gradle:5.1(dependency: net.sf.proguard#proguard-gradle;5.1 {runtime=[compile(*), runtime(*), master(*)]})
12:14:37.138 [DEBUG] [org.gradle.api.internal.artifacts.ivyservice.resolveengine.graph.DependencyGraphBuilder] Selecting new module version net.sf.proguard:proguard-gradle:5.1
12:14:37.139 [DEBUG] [org.gradle.api.internal.artifacts.ivyservice.ivyresolve.RepositoryChainDependencyResolver] Attempting to resolve net.sf.proguard:proguard-gradle:5.1 using repositories [BintrayJCenter]
12:14:37.141 [DEBUG] [org.gradle.api.internal.artifacts.ivyservice.ivyresolve.parser.IvyXmlModuleDescriptorParser] post 1.3 ivy file: using exact as default matcher
12:14:37.146 [DEBUG] [org.gradle.api.internal.artifacts.ivyservice.ivyresolve.CachingModuleComponentRepository] Using cached module metadata for module 'net.sf.proguard:proguard-gradle:5.1' in 'BintrayJCenter'
12:14:37.146 [DEBUG] [org.gradle.api.internal.artifacts.ivyservice.ivyresolve.RepositoryChainDependencyResolver] Using net.sf.proguard:proguard-gradle:5.1 from Maven repository 'BintrayJCenter'
12:14:37.147 [DEBUG] [org.gradle.api.internal.artifacts.ivyservice.resolveengine.graph.DependencyGraphBuilder] Visiting configuration com.android.tools.build:gradle-core:1.2.3(master).
12:14:37.147 [DEBUG] [org.gradle.api.internal.artifacts.ivyservice.resolveengine.graph.DependencyGraphBuilder] Visiting configuration com.android.tools.build:builder:1.2.3(compile).
12:14:37.148 [DEBUG] [org.gradle.api.internal.artifacts.ivyservice.resolveengine.graph.DependencyGraphBuilder] Visiting configuration com.android.tools.build:builder:1.2.3(runtime).
12:14:37.148 [DEBUG] [org.gradle.api.internal.artifacts.ivyservice.resolveengine.graph.DependencyGraphBuilder] Visiting dependency com.android.tools.build:builder:1.2.3(runtime) -> com.android.tools.build:builder-model:1.2.3(dependency: com.android.tools.build#builder-model;1.2.3 {runtime=[compile(*), runtime(*), master(*)]})
12:14:37.148 [DEBUG] [org.gradle.api.internal.artifacts.ivyservice.resolveengine.graph.DependencyGraphBuilder] Selecting new module version com.android.tools.build:builder-model:1.2.3
12:14:37.149 [DEBUG] [org.gradle.api.internal.artifacts.ivyservice.ivyresolve.RepositoryChainDependencyResolver] Attempting to resolve com.android.tools.build:builder-model:1.2.3 using repositories [BintrayJCenter]
12:14:37.151 [DEBUG] [org.gradle.api.internal.artifacts.ivyservice.ivyresolve.parser.IvyXmlModuleDescriptorParser] post 1.3 ivy file: using exact as default matcher
12:14:37.153 [DEBUG] [org.gradle.api.internal.artifacts.ivyservice.ivyresolve.CachingModuleComponentRepository] Using cached module metadata for module 'com.android.tools.build:builder-model:1.2.3' in 'BintrayJCenter'
12:14:37.154 [DEBUG] [org.gradle.api.internal.artifacts.ivyservice.ivyresolve.RepositoryChainDependencyResolver] Using com.android.tools.build:builder-model:1.2.3 from Maven repository 'BintrayJCenter'
12:14:37.154 [DEBUG] [org.gradle.api.internal.artifacts.ivyservice.resolveengine.graph.DependencyGraphBuilder] Visiting dependency com.android.tools.build:builder:1.2.3(runtime) -> com.android.tools.build:builder-test-api:1.2.3(dependency: com.android.tools.build#builder-test-api;1.2.3 {runtime=[compile(*), runtime(*), master(*)]})
12:14:37.154 [DEBUG] [org.gradle.api.internal.artifacts.ivyservice.resolveengine.graph.DependencyGraphBuilder] Selecting new module version com.android.tools.build:builder-test-api:1.2.3
12:14:37.155 [DEBUG] [org.gradle.api.internal.artifacts.ivyservice.ivyresolve.RepositoryChainDependencyResolver] Attempting to resolve com.android.tools.build:builder-test-api:1.2.3 using repositories [BintrayJCenter]
12:14:37.157 [DEBUG] [org.gradle.api.internal.artifacts.ivyservice.ivyresolve.parser.IvyXmlModuleDescriptorParser] post 1.3 ivy file: using exact as default matcher
12:14:37.160 [DEBUG] [org.gradle.api.internal.artifacts.ivyservice.ivyresolve.CachingModuleComponentRepository] Using cached module metadata for module 'com.android.tools.build:builder-test-api:1.2.3' in 'BintrayJCenter'
12:14:37.160 [DEBUG] [org.gradle.api.internal.artifacts.ivyservice.ivyresolve.RepositoryChainDependencyResolver] Using com.android.tools.build:builder-test-api:1.2.3 from Maven repository 'BintrayJCenter'
12:14:37.160 [DEBUG] [org.gradle.api.internal.artifacts.ivyservice.resolveengine.graph.DependencyGraphBuilder] Visiting dependency com.android.tools.build:builder:1.2.3(runtime) -> com.android.tools:sdklib:24.2.3(dependency: com.android.tools#sdklib;24.2.3 {runtime=[compile(*), runtime(*), master(*)]})
12:14:37.161 [DEBUG] [org.gradle.api.internal.artifacts.ivyservice.resolveengine.graph.DependencyGraphBuilder] Selecting new module version com.android.tools:sdklib:24.2.3
12:14:37.161 [DEBUG] [org.gradle.api.internal.artifacts.ivyservice.ivyresolve.RepositoryChainDependencyResolver] Attempting to resolve com.android.tools:sdklib:24.2.3 using repositories [BintrayJCenter]
12:14:37.164 [DEBUG] [org.gradle.api.internal.artifacts.ivyservice.ivyresolve.parser.IvyXmlModuleDescriptorParser] post 1.3 ivy file: using exact as default matcher
12:14:37.166 [DEBUG] [org.gradle.api.internal.artifacts.ivyservice.ivyresolve.CachingModuleComponentRepository] Using cached module metadata for module 'com.android.tools:sdklib:24.2.3' in 'BintrayJCenter'
12:14:37.167 [DEBUG] [org.gradle.api.internal.artifacts.ivyservice.ivyresolve.RepositoryChainDependencyResolver] Using com.android.tools:sdklib:24.2.3 from Maven repository 'BintrayJCenter'
12:14:37.167 [DEBUG] [org.gradle.api.internal.artifacts.ivyservice.resolveengine.graph.DependencyGraphBuilder] Visiting dependency com.android.tools.build:builder:1.2.3(runtime) -> com.android.tools:sdk-common:24.2.3(dependency: com.android.tools#sdk-common;24.2.3 {runtime=[compile(*), runtime(*), master(*)]})
12:14:37.167 [DEBUG] [org.gradle.api.internal.artifacts.ivyservice.resolveengine.graph.DependencyGraphBuilder] Selecting new module version com.android.tools:sdk-common:24.2.3
12:14:37.168 [DEBUG] [org.gradle.api.internal.artifacts.ivyservice.ivyresolve.RepositoryChainDependencyResolver] Attempting to resolve com.android.tools:sdk-common:24.2.3 using repositories [BintrayJCenter]
12:14:37.170 [DEBUG] [org.gradle.api.internal.artifacts.ivyservice.ivyresolve.parser.IvyXmlModuleDescriptorParser] post 1.3 ivy file: using exact as default matcher
12:14:37.173 [DEBUG] [org.gradle.api.internal.artifacts.ivyservice.ivyresolve.CachingModuleComponentRepository] Using cached module metadata for module 'com.android.tools:sdk-common:24.2.3' in 'BintrayJCenter'
12:14:37.173 [DEBUG] [org.gradle.api.internal.artifacts.ivyservice.ivyresolve.RepositoryChainDependencyResolver] Using com.android.tools:sdk-common:24.2.3 from Maven repository 'BintrayJCenter'
12:14:37.174 [DEBUG] [org.gradle.api.internal.artifacts.ivyservice.resolveengine.graph.DependencyGraphBuilder] Visiting dependency com.android.tools.build:builder:1.2.3(runtime) -> com.android.tools:common:24.2.3(dependency: com.android.tools#common;24.2.3 {runtime=[compile(*), runtime(*), master(*)]})
12:14:37.174 [DEBUG] [org.gradle.api.internal.artifacts.ivyservice.resolveengine.graph.DependencyGraphBuilder] Selecting new module version com.android.tools:common:24.2.3
12:14:37.174 [DEBUG] [org.gradle.api.internal.artifacts.ivyservice.ivyresolve.RepositoryChainDependencyResolver] Attempting to resolve com.android.tools:common:24.2.3 using repositories [BintrayJCenter]
12:14:37.176 [DEBUG] [org.gradle.api.internal.artifacts.ivyservice.ivyresolve.parser.IvyXmlModuleDescriptorParser] post 1.3 ivy file: using exact as default matcher
12:14:37.178 [DEBUG] [org.gradle.api.internal.artifacts.ivyservice.ivyresolve.CachingModuleComponentRepository] Using cached module metadata for module 'com.android.tools:common:24.2.3' in 'BintrayJCenter'
12:14:37.179 [DEBUG] [org.gradle.api.internal.artifacts.ivyservice.ivyresolve.RepositoryChainDependencyResolver] Using com.android.tools:common:24.2.3 from Maven repository 'BintrayJCenter'
12:14:37.179 [DEBUG] [org.gradle.api.internal.artifacts.ivyservice.resolveengine.graph.DependencyGraphBuilder] Visiting dependency com.android.tools.build:builder:1.2.3(runtime) -> com.android.tools.build:manifest-merger:24.2.3(dependency: com.android.tools.build#manifest-merger;24.2.3 {runtime=[compile(*), runtime(*), master(*)]})
12:14:37.179 [DEBUG] [org.gradle.api.internal.artifacts.ivyservice.resolveengine.graph.DependencyGraphBuilder] Selecting new module version com.android.tools.build:manifest-merger:24.2.3
12:14:37.180 [DEBUG] [org.gradle.api.internal.artifacts.ivyservice.ivyresolve.RepositoryChainDependencyResolver] Attempting to resolve com.android.tools.build:manifest-merger:24.2.3 using repositories [BintrayJCenter]
12:14:37.182 [DEBUG] [org.gradle.api.internal.artifacts.ivyservice.ivyresolve.parser.IvyXmlModuleDescriptorParser] post 1.3 ivy file: using exact as default matcher
12:14:37.184 [DEBUG] [org.gradle.api.internal.artifacts.ivyservice.ivyresolve.CachingModuleComponentRepository] Using cached module metadata for module 'com.android.tools.build:manifest-merger:24.2.3' in 'BintrayJCenter'
12:14:37.185 [DEBUG] [org.gradle.api.internal.artifacts.ivyservice.ivyresolve.RepositoryChainDependencyResolver] Using com.android.tools.build:manifest-merger:24.2.3 from Maven repository 'BintrayJCenter'
12:14:37.185 [DEBUG] [org.gradle.api.internal.artifacts.ivyservice.resolveengine.graph.DependencyGraphBuilder] Visiting dependency com.android.tools.build:builder:1.2.3(runtime) -> com.android.tools.ddms:ddmlib:24.2.3(dependency: com.android.tools.ddms#ddmlib;24.2.3 {runtime=[compile(*), runtime(*), master(*)]})
12:14:37.185 [DEBUG] [org.gradle.api.internal.artifacts.ivyservice.resolveengine.graph.DependencyGraphBuilder] Selecting new module version com.android.tools.ddms:ddmlib:24.2.3
12:14:37.186 [DEBUG] [org.gradle.api.internal.artifacts.ivyservice.ivyresolve.RepositoryChainDependencyResolver] Attempting to resolve com.android.tools.ddms:ddmlib:24.2.3 using repositories [BintrayJCenter]
12:14:37.188 [DEBUG] [org.gradle.api.internal.artifacts.ivyservice.ivyresolve.parser.IvyXmlModuleDescriptorParser] post 1.3 ivy file: using exact as default matcher
12:14:37.190 [DEBUG] [org.gradle.api.internal.artifacts.ivyservice.ivyresolve.CachingModuleComponentRepository] Using cached module metadata for module 'com.android.tools.ddms:ddmlib:24.2.3' in 'BintrayJCenter'
12:14:37.190 [DEBUG] [org.gradle.api.internal.artifacts.ivyservice.ivyresolve.RepositoryChainDependencyResolver] Using com.android.tools.ddms:ddmlib:24.2.3 from Maven repository 'BintrayJCenter'
12:14:37.190 [DEBUG] [org.gradle.api.internal.artifacts.ivyservice.resolveengine.graph.DependencyGraphBuilder] Visiting dependency com.android.tools.build:builder:1.2.3(runtime) -> com.squareup:javawriter:2.5.0(dependency: com.squareup#javawriter;2.5.0 {runtime=[compile(*), runtime(*), master(*)]})
12:14:37.191 [DEBUG] [org.gradle.api.internal.artifacts.ivyservice.resolveengine.graph.DependencyGraphBuilder] Selecting new module version com.squareup:javawriter:2.5.0
12:14:37.191 [DEBUG] [org.gradle.api.internal.artifacts.ivyservice.ivyresolve.RepositoryChainDependencyResolver] Attempting to resolve com.squareup:javawriter:2.5.0 using repositories [BintrayJCenter]
12:14:37.193 [DEBUG] [org.gradle.api.internal.artifacts.ivyservice.ivyresolve.parser.IvyXmlModuleDescriptorParser] post 1.3 ivy file: using exact as default matcher
12:14:37.194 [DEBUG] [org.gradle.api.internal.artifacts.ivyservice.ivyresolve.CachingModuleComponentRepository] Using cached module metadata for module 'com.squareup:javawriter:2.5.0' in 'BintrayJCenter'
12:14:37.194 [DEBUG] [org.gradle.api.internal.artifacts.ivyservice.ivyresolve.RepositoryChainDependencyResolver] Using com.squareup:javawriter:2.5.0 from Maven repository 'BintrayJCenter'
12:14:37.195 [DEBUG] [org.gradle.api.internal.artifacts.ivyservice.resolveengine.graph.DependencyGraphBuilder] Visiting dependency com.android.tools.build:builder:1.2.3(runtime) -> org.bouncycastle:bcpkix-jdk15on:1.48(dependency: org.bouncycastle#bcpkix-jdk15on;1.48 {runtime=[compile(*), runtime(*), master(*)]})
12:14:37.195 [DEBUG] [org.gradle.api.internal.artifacts.ivyservice.resolveengine.graph.DependencyGraphBuilder] Selecting new module version org.bouncycastle:bcpkix-jdk15on:1.48
12:14:37.196 [DEBUG] [org.gradle.api.internal.artifacts.ivyservice.ivyresolve.RepositoryChainDependencyResolver] Attempting to resolve org.bouncycastle:bcpkix-jdk15on:1.48 using repositories [BintrayJCenter]
12:14:37.198 [DEBUG] [org.gradle.api.internal.artifacts.ivyservice.ivyresolve.parser.IvyXmlModuleDescriptorParser] post 1.3 ivy file: using exact as default matcher
12:14:37.199 [DEBUG] [org.gradle.api.internal.artifacts.ivyservice.ivyresolve.CachingModuleComponentRepository] Using cached module metadata for module 'org.bouncycastle:bcpkix-jdk15on:1.48' in 'BintrayJCenter'
12:14:37.199 [DEBUG] [org.gradle.api.internal.artifacts.ivyservice.ivyresolve.RepositoryChainDependencyResolver] Using org.bouncycastle:bcpkix-jdk15on:1.48 from Maven repository 'BintrayJCenter'
12:14:37.200 [DEBUG] [org.gradle.api.internal.artifacts.ivyservice.resolveengine.graph.DependencyGraphBuilder] Visiting dependency com.android.tools.build:builder:1.2.3(runtime) -> org.bouncycastle:bcprov-jdk15on:1.48(dependency: org.bouncycastle#bcprov-jdk15on;1.48 {runtime=[compile(*), runtime(*), master(*)]})
12:14:37.200 [DEBUG] [org.gradle.api.internal.artifacts.ivyservice.resolveengine.graph.DependencyGraphBuilder] Selecting new module version org.bouncycastle:bcprov-jdk15on:1.48
12:14:37.200 [DEBUG] [org.gradle.api.internal.artifacts.ivyservice.ivyresolve.RepositoryChainDependencyResolver] Attempting to resolve org.bouncycastle:bcprov-jdk15on:1.48 using repositories [BintrayJCenter]
12:14:37.203 [DEBUG] [org.gradle.api.internal.artifacts.ivyservice.ivyresolve.parser.IvyXmlModuleDescriptorParser] post 1.3 ivy file: using exact as default matcher
12:14:37.204 [DEBUG] [org.gradle.api.internal.artifacts.ivyservice.ivyresolve.CachingModuleComponentRepository] Using cached module metadata for module 'org.bouncycastle:bcprov-jdk15on:1.48' in 'BintrayJCenter'
12:14:37.204 [DEBUG] [org.gradle.api.internal.artifacts.ivyservice.ivyresolve.RepositoryChainDependencyResolver] Using org.bouncycastle:bcprov-jdk15on:1.48 from Maven repository 'BintrayJCenter'
12:14:37.205 [DEBUG] [org.gradle.api.internal.artifacts.ivyservice.resolveengine.graph.DependencyGraphBuilder] Visiting dependency com.android.tools.build:builder:1.2.3(runtime) -> org.ow2.asm:asm:5.0.3(dependency: org.ow2.asm#asm;5.0.3 {runtime=[compile(*), runtime(*), master(*)]})
12:14:37.205 [DEBUG] [org.gradle.api.internal.artifacts.ivyservice.resolveengine.graph.DependencyGraphBuilder] Selecting new module version org.ow2.asm:asm:5.0.3
12:14:37.205 [DEBUG] [org.gradle.api.internal.artifacts.ivyservice.ivyresolve.RepositoryChainDependencyResolver] Attempting to resolve org.ow2.asm:asm:5.0.3 using repositories [BintrayJCenter]
12:14:37.208 [DEBUG] [org.gradle.api.internal.artifacts.ivyservice.ivyresolve.parser.IvyXmlModuleDescriptorParser] post 1.3 ivy file: using exact as default matcher
12:14:37.209 [DEBUG] [org.gradle.api.internal.artifacts.ivyservice.ivyresolve.CachingModuleComponentRepository] Using cached module metadata for module 'org.ow2.asm:asm:5.0.3' in 'BintrayJCenter'
12:14:37.210 [DEBUG] [org.gradle.api.internal.artifacts.ivyservice.ivyresolve.RepositoryChainDependencyResolver] Using org.ow2.asm:asm:5.0.3 from Maven repository 'BintrayJCenter'
12:14:37.210 [DEBUG] [org.gradle.api.internal.artifacts.ivyservice.resolveengine.graph.DependencyGraphBuilder] Visiting dependency com.android.tools.build:builder:1.2.3(runtime) -> org.ow2.asm:asm-tree:5.0.3(dependency: org.ow2.asm#asm-tree;5.0.3 {runtime=[compile(*), runtime(*), master(*)]})
12:14:37.210 [DEBUG] [org.gradle.api.internal.artifacts.ivyservice.resolveengine.graph.DependencyGraphBuilder] Selecting new module version org.ow2.asm:asm-tree:5.0.3
12:14:37.210 [DEBUG] [org.gradle.api.internal.artifacts.ivyservice.ivyresolve.RepositoryChainDependencyResolver] Attempting to resolve org.ow2.asm:asm-tree:5.0.3 using repositories [BintrayJCenter]
12:14:37.213 [DEBUG] [org.gradle.api.internal.artifacts.ivyservice.ivyresolve.parser.IvyXmlModuleDescriptorParser] post 1.3 ivy file: using exact as default matcher
12:14:37.214 [DEBUG] [org.gradle.api.internal.artifacts.ivyservice.ivyresolve.CachingModuleComponentRepository] Using cached module metadata for module 'org.ow2.asm:asm-tree:5.0.3' in 'BintrayJCenter'
12:14:37.214 [DEBUG] [org.gradle.api.internal.artifacts.ivyservice.ivyresolve.RepositoryChainDependencyResolver] Using org.ow2.asm:asm-tree:5.0.3 from Maven repository 'BintrayJCenter'
12:14:37.215 [DEBUG] [org.gradle.api.internal.artifacts.ivyservice.resolveengine.graph.DependencyGraphBuilder] Visiting dependency com.android.tools.build:builder:1.2.3(runtime) -> com.google.code.gson:gson:2.2.4(dependency: com.google.code.gson#gson;2.2.4 {runtime=[compile(*), runtime(*), master(*)]})
12:14:37.216 [DEBUG] [org.gradle.api.internal.artifacts.ivyservice.resolveengine.graph.DependencyGraphBuilder] Selecting new module version com.google.code.gson:gson:2.2.4
12:14:37.217 [DEBUG] [org.gradle.api.internal.artifacts.ivyservice.ivyresolve.RepositoryChainDependencyResolver] Attempting to resolve com.google.code.gson:gson:2.2.4 using repositories [BintrayJCenter]
12:14:37.219 [DEBUG] [org.gradle.api.internal.artifacts.ivyservice.ivyresolve.parser.IvyXmlModuleDescriptorParser] post 1.3 ivy file: using exact as default matcher
12:14:37.220 [DEBUG] [org.gradle.api.internal.artifacts.ivyservice.ivyresolve.CachingModuleComponentRepository] Using cached module metadata for module 'com.google.code.gson:gson:2.2.4' in 'BintrayJCenter'
12:14:37.221 [DEBUG] [org.gradle.api.internal.artifacts.ivyservice.ivyresolve.RepositoryChainDependencyResolver] Using com.google.code.gson:gson:2.2.4 from Maven repository 'BintrayJCenter'
12:14:37.221 [DEBUG] [org.gradle.api.internal.artifacts.ivyservice.resolveengine.graph.DependencyGraphBuilder] Visiting configuration com.android.tools.build:builder:1.2.3(master).
12:14:37.221 [DEBUG] [org.gradle.api.internal.artifacts.ivyservice.resolveengine.graph.DependencyGraphBuilder] Visiting configuration com.android.tools.lint:lint:24.2.3(compile).
12:14:37.222 [DEBUG] [org.gradle.api.internal.artifacts.ivyservice.resolveengine.graph.DependencyGraphBuilder] Visiting configuration com.android.tools.lint:lint:24.2.3(runtime).
12:14:37.222 [DEBUG] [org.gradle.api.internal.artifacts.ivyservice.resolveengine.graph.DependencyGraphBuilder] Visiting dependency com.android.tools.lint:lint:24.2.3(runtime) -> com.android.tools.lint:lint-checks:24.2.3(dependency: com.android.tools.lint#lint-checks;24.2.3 {runtime=[compile(*), runtime(*), master(*)]})
12:14:37.222 [DEBUG] [org.gradle.api.internal.artifacts.ivyservice.resolveengine.graph.DependencyGraphBuilder] Selecting new module version com.android.tools.lint:lint-checks:24.2.3
12:14:37.223 [DEBUG] [org.gradle.api.internal.artifacts.ivyservice.ivyresolve.RepositoryChainDependencyResolver] Attempting to resolve com.android.tools.lint:lint-checks:24.2.3 using repositories [BintrayJCenter]
12:14:37.225 [DEBUG] [org.gradle.api.internal.artifacts.ivyservice.ivyresolve.parser.IvyXmlModuleDescriptorParser] post 1.3 ivy file: using exact as default matcher
12:14:37.226 [DEBUG] [org.gradle.api.internal.artifacts.ivyservice.ivyresolve.CachingModuleComponentRepository] Using cached module metadata for module 'com.android.tools.lint:lint-checks:24.2.3' in 'BintrayJCenter'
12:14:37.226 [DEBUG] [org.gradle.api.internal.artifacts.ivyservice.ivyresolve.RepositoryChainDependencyResolver] Using com.android.tools.lint:lint-checks:24.2.3 from Maven repository 'BintrayJCenter'
12:14:37.226 [DEBUG] [org.gradle.api.internal.artifacts.ivyservice.resolveengine.graph.DependencyGraphBuilder] Visiting dependency com.android.tools.lint:lint:24.2.3(runtime) -> org.eclipse.jdt.core.compiler:ecj:4.4(dependency: org.eclipse.jdt.core.compiler#ecj;4.4 {runtime=[compile(*), runtime(*), master(*)]})
12:14:37.227 [DEBUG] [org.gradle.api.internal.artifacts.ivyservice.resolveengine.graph.DependencyGraphBuilder] Selecting new module version org.eclipse.jdt.core.compiler:ecj:4.4
12:14:37.227 [DEBUG] [org.gradle.api.internal.artifacts.ivyservice.ivyresolve.RepositoryChainDependencyResolver] Attempting to resolve org.eclipse.jdt.core.compiler:ecj:4.4 using repositories [BintrayJCenter]
12:14:37.229 [DEBUG] [org.gradle.api.internal.artifacts.ivyservice.ivyresolve.parser.IvyXmlModuleDescriptorParser] post 1.3 ivy file: using exact as default matcher
12:14:37.230 [DEBUG] [org.gradle.api.internal.artifacts.ivyservice.ivyresolve.CachingModuleComponentRepository] Using cached module metadata for module 'org.eclipse.jdt.core.compiler:ecj:4.4' in 'BintrayJCenter'
12:14:37.230 [DEBUG] [org.gradle.api.internal.artifacts.ivyservice.ivyresolve.RepositoryChainDependencyResolver] Using org.eclipse.jdt.core.compiler:ecj:4.4 from Maven repository 'BintrayJCenter'
12:14:37.231 [DEBUG] [org.gradle.api.internal.artifacts.ivyservice.resolveengine.graph.DependencyGraphBuilder] Visiting configuration com.android.tools.lint:lint:24.2.3(master).
12:14:37.231 [DEBUG] [org.gradle.api.internal.artifacts.ivyservice.resolveengine.graph.DependencyGraphBuilder] Visiting configuration net.sf.proguard:proguard-gradle:5.1(compile).
12:14:37.231 [DEBUG] [org.gradle.api.internal.artifacts.ivyservice.resolveengine.graph.DependencyGraphBuilder] Visiting dependency net.sf.proguard:proguard-gradle:5.1(compile) -> net.sf.proguard:proguard-base:5.1(dependency: net.sf.proguard#proguard-base;5.1 {compile=[compile(*), master(*)], runtime=[runtime(*)]})
12:14:37.232 [DEBUG] [org.gradle.api.internal.artifacts.ivyservice.resolveengine.graph.DependencyGraphBuilder] Selecting new module version net.sf.proguard:proguard-base:5.1
12:14:37.232 [DEBUG] [org.gradle.api.internal.artifacts.ivyservice.ivyresolve.RepositoryChainDependencyResolver] Attempting to resolve net.sf.proguard:proguard-base:5.1 using repositories [BintrayJCenter]
12:14:37.234 [DEBUG] [org.gradle.api.internal.artifacts.ivyservice.ivyresolve.parser.IvyXmlModuleDescriptorParser] post 1.3 ivy file: using exact as default matcher
12:14:37.235 [DEBUG] [org.gradle.api.internal.artifacts.ivyservice.ivyresolve.CachingModuleComponentRepository] Using cached module metadata for module 'net.sf.proguard:proguard-base:5.1' in 'BintrayJCenter'
12:14:37.235 [DEBUG] [org.gradle.api.internal.artifacts.ivyservice.ivyresolve.RepositoryChainDependencyResolver] Using net.sf.proguard:proguard-base:5.1 from Maven repository 'BintrayJCenter'
12:14:37.235 [DEBUG] [org.gradle.api.internal.artifacts.ivyservice.resolveengine.graph.DependencyGraphBuilder] Visiting configuration net.sf.proguard:proguard-gradle:5.1(runtime).
12:14:37.236 [DEBUG] [org.gradle.api.internal.artifacts.ivyservice.resolveengine.graph.DependencyGraphBuilder] Visiting dependency net.sf.proguard:proguard-gradle:5.1(runtime) -> net.sf.proguard:proguard-base:5.1(dependency: net.sf.proguard#proguard-base;5.1 {compile=[compile(*), master(*)], runtime=[runtime(*)]})
12:14:37.236 [DEBUG] [org.gradle.api.internal.artifacts.ivyservice.resolveengine.graph.DependencyGraphBuilder] Visiting configuration net.sf.proguard:proguard-gradle:5.1(master).
12:14:37.236 [DEBUG] [org.gradle.api.internal.artifacts.ivyservice.resolveengine.graph.DependencyGraphBuilder] Visiting configuration com.android.tools.build:builder-model:1.2.3(compile).
12:14:37.236 [DEBUG] [org.gradle.api.internal.artifacts.ivyservice.resolveengine.graph.DependencyGraphBuilder] Visiting configuration com.android.tools.build:builder-model:1.2.3(runtime).
12:14:37.237 [DEBUG] [org.gradle.api.internal.artifacts.ivyservice.resolveengine.graph.DependencyGraphBuilder] Visiting dependency com.android.tools.build:builder-model:1.2.3(runtime) -> com.android.tools:annotations:24.2.3(dependency: com.android.tools#annotations;24.2.3 {runtime=[compile(*), runtime(*), master(*)]})
12:14:37.237 [DEBUG] [org.gradle.api.internal.artifacts.ivyservice.resolveengine.graph.DependencyGraphBuilder] Selecting new module version com.android.tools:annotations:24.2.3
12:14:37.237 [DEBUG] [org.gradle.api.internal.artifacts.ivyservice.ivyresolve.RepositoryChainDependencyResolver] Attempting to resolve com.android.tools:annotations:24.2.3 using repositories [BintrayJCenter]
12:14:37.239 [DEBUG] [org.gradle.api.internal.artifacts.ivyservice.ivyresolve.parser.IvyXmlModuleDescriptorParser] post 1.3 ivy file: using exact as default matcher
12:14:37.240 [DEBUG] [org.gradle.api.internal.artifacts.ivyservice.ivyresolve.CachingModuleComponentRepository] Using cached module metadata for module 'com.android.tools:annotations:24.2.3' in 'BintrayJCenter'
12:14:37.240 [DEBUG] [org.gradle.api.internal.artifacts.ivyservice.ivyresolve.RepositoryChainDependencyResolver] Using com.android.tools:annotations:24.2.3 from Maven repository 'BintrayJCenter'
12:14:37.241 [DEBUG] [org.gradle.api.internal.artifacts.ivyservice.resolveengine.graph.DependencyGraphBuilder] Visiting configuration com.android.tools.build:builder-model:1.2.3(master).
12:14:37.241 [DEBUG] [org.gradle.api.internal.artifacts.ivyservice.resolveengine.graph.DependencyGraphBuilder] Visiting configuration com.android.tools.build:builder-test-api:1.2.3(compile).
12:14:37.241 [DEBUG] [org.gradle.api.internal.artifacts.ivyservice.resolveengine.graph.DependencyGraphBuilder] Visiting configuration com.android.tools.build:builder-test-api:1.2.3(runtime).
12:14:37.242 [DEBUG] [org.gradle.api.internal.artifacts.ivyservice.resolveengine.graph.DependencyGraphBuilder] Visiting dependency com.android.tools.build:builder-test-api:1.2.3(runtime) -> com.android.tools.ddms:ddmlib:24.2.3(dependency: com.android.tools.ddms#ddmlib;24.2.3 {runtime=[compile(*), runtime(*), master(*)]})
12:14:37.242 [DEBUG] [org.gradle.api.internal.artifacts.ivyservice.resolveengine.graph.DependencyGraphBuilder] Visiting configuration com.android.tools.build:builder-test-api:1.2.3(master).
12:14:37.242 [DEBUG] [org.gradle.api.internal.artifacts.ivyservice.resolveengine.graph.DependencyGraphBuilder] Visiting configuration com.android.tools:sdklib:24.2.3(compile).
12:14:37.243 [DEBUG] [org.gradle.api.internal.artifacts.ivyservice.resolveengine.graph.DependencyGraphBuilder] Visiting configuration com.android.tools:sdklib:24.2.3(runtime).
12:14:37.243 [DEBUG] [org.gradle.api.internal.artifacts.ivyservice.resolveengine.graph.DependencyGraphBuilder] Visiting dependency com.android.tools:sdklib:24.2.3(runtime) -> com.android.tools.layoutlib:layoutlib-api:24.2.3(dependency: com.android.tools.layoutlib#layoutlib-api;24.2.3 {runtime=[compile(*), runtime(*), master(*)]})
12:14:37.244 [DEBUG] [org.gradle.api.internal.artifacts.ivyservice.resolveengine.graph.DependencyGraphBuilder] Selecting new module version com.android.tools.layoutlib:layoutlib-api:24.2.3
12:14:37.244 [DEBUG] [org.gradle.api.internal.artifacts.ivyservice.ivyresolve.RepositoryChainDependencyResolver] Attempting to resolve com.android.tools.layoutlib:layoutlib-api:24.2.3 using repositories [BintrayJCenter]
12:14:37.246 [DEBUG] [org.gradle.api.internal.artifacts.ivyservice.ivyresolve.parser.IvyXmlModuleDescriptorParser] post 1.3 ivy file: using exact as default matcher
12:14:37.247 [DEBUG] [org.gradle.api.internal.artifacts.ivyservice.ivyresolve.CachingModuleComponentRepository] Using cached module metadata for module 'com.android.tools.layoutlib:layoutlib-api:24.2.3' in 'BintrayJCenter'
12:14:37.248 [DEBUG] [org.gradle.api.internal.artifacts.ivyservice.ivyresolve.RepositoryChainDependencyResolver] Using com.android.tools.layoutlib:layoutlib-api:24.2.3 from Maven repository 'BintrayJCenter'
12:14:37.248 [DEBUG] [org.gradle.api.internal.artifacts.ivyservice.resolveengine.graph.DependencyGraphBuilder] Visiting dependency com.android.tools:sdklib:24.2.3(runtime) -> com.android.tools:dvlib:24.2.3(dependency: com.android.tools#dvlib;24.2.3 {runtime=[compile(*), runtime(*), master(*)]})
12:14:37.249 [DEBUG] [org.gradle.api.internal.artifacts.ivyservice.resolveengine.graph.DependencyGraphBuilder] Selecting new module version com.android.tools:dvlib:24.2.3
12:14:37.249 [DEBUG] [org.gradle.api.internal.artifacts.ivyservice.ivyresolve.RepositoryChainDependencyResolver] Attempting to resolve com.android.tools:dvlib:24.2.3 using repositories [BintrayJCenter]
12:14:37.251 [DEBUG] [org.gradle.api.internal.artifacts.ivyservice.ivyresolve.parser.IvyXmlModuleDescriptorParser] post 1.3 ivy file: using exact as default matcher
12:14:37.252 [DEBUG] [org.gradle.api.internal.artifacts.ivyservice.ivyresolve.CachingModuleComponentRepository] Using cached module metadata for module 'com.android.tools:dvlib:24.2.3' in 'BintrayJCenter'
12:14:37.252 [DEBUG] [org.gradle.api.internal.artifacts.ivyservice.ivyresolve.RepositoryChainDependencyResolver] Using com.android.tools:dvlib:24.2.3 from Maven repository 'BintrayJCenter'
12:14:37.253 [DEBUG] [org.gradle.api.internal.artifacts.ivyservice.resolveengine.graph.DependencyGraphBuilder] Visiting dependency com.android.tools:sdklib:24.2.3(runtime) -> org.apache.commons:commons-compress:1.8.1(dependency: org.apache.commons#commons-compress;1.8.1 {runtime=[compile(*), runtime(*), master(*)]})
12:14:37.253 [DEBUG] [org.gradle.api.internal.artifacts.ivyservice.resolveengine.graph.DependencyGraphBuilder] Selecting new module version org.apache.commons:commons-compress:1.8.1
12:14:37.253 [DEBUG] [org.gradle.api.internal.artifacts.ivyservice.ivyresolve.RepositoryChainDependencyResolver] Attempting to resolve org.apache.commons:commons-compress:1.8.1 using repositories [BintrayJCenter]
12:14:37.255 [DEBUG] [org.gradle.api.internal.artifacts.ivyservice.ivyresolve.parser.IvyXmlModuleDescriptorParser] post 1.3 ivy file: using exact as default matcher
12:14:37.257 [DEBUG] [org.gradle.api.internal.artifacts.ivyservice.ivyresolve.CachingModuleComponentRepository] Using cached module metadata for module 'org.apache.commons:commons-compress:1.8.1' in 'BintrayJCenter'
12:14:37.257 [DEBUG] [org.gradle.api.internal.artifacts.ivyservice.ivyresolve.RepositoryChainDependencyResolver] Using org.apache.commons:commons-compress:1.8.1 from Maven repository 'BintrayJCenter'
12:14:37.258 [DEBUG] [org.gradle.api.internal.artifacts.ivyservice.resolveengine.graph.DependencyGraphBuilder] Visiting dependency com.android.tools:sdklib:24.2.3(runtime) -> org.apache.httpcomponents:httpclient:4.1.1(dependency: org.apache.httpcomponents#httpclient;4.1.1 {runtime=[compile(*), runtime(*), master(*)]})
12:14:37.258 [DEBUG] [org.gradle.api.internal.artifacts.ivyservice.resolveengine.graph.DependencyGraphBuilder] Selecting new module version org.apache.httpcomponents:httpclient:4.1.1
12:14:37.258 [DEBUG] [org.gradle.api.internal.artifacts.ivyservice.ivyresolve.RepositoryChainDependencyResolver] Attempting to resolve org.apache.httpcomponents:httpclient:4.1.1 using repositories [BintrayJCenter]
12:14:37.260 [DEBUG] [org.gradle.api.internal.artifacts.ivyservice.ivyresolve.parser.IvyXmlModuleDescriptorParser] post 1.3 ivy file: using exact as default matcher
12:14:37.261 [DEBUG] [org.gradle.api.internal.artifacts.ivyservice.ivyresolve.CachingModuleComponentRepository] Using cached module metadata for module 'org.apache.httpcomponents:httpclient:4.1.1' in 'BintrayJCenter'
12:14:37.262 [DEBUG] [org.gradle.api.internal.artifacts.ivyservice.ivyresolve.RepositoryChainDependencyResolver] Using org.apache.httpcomponents:httpclient:4.1.1 from Maven repository 'BintrayJCenter'
12:14:37.262 [DEBUG] [org.gradle.api.internal.artifacts.ivyservice.resolveengine.graph.DependencyGraphBuilder] Visiting dependency com.android.tools:sdklib:24.2.3(runtime) -> org.apache.httpcomponents:httpmime:4.1(dependency: org.apache.httpcomponents#httpmime;4.1 {runtime=[compile(*), runtime(*), master(*)]})
12:14:37.262 [DEBUG] [org.gradle.api.internal.artifacts.ivyservice.resolveengine.graph.DependencyGraphBuilder] Selecting new module version org.apache.httpcomponents:httpmime:4.1
12:14:37.263 [DEBUG] [org.gradle.api.internal.artifacts.ivyservice.ivyresolve.RepositoryChainDependencyResolver] Attempting to resolve org.apache.httpcomponents:httpmime:4.1 using repositories [BintrayJCenter]
12:14:37.264 [DEBUG] [org.gradle.api.internal.artifacts.ivyservice.ivyresolve.parser.IvyXmlModuleDescriptorParser] post 1.3 ivy file: using exact as default matcher
12:14:37.266 [DEBUG] [org.gradle.api.internal.artifacts.ivyservice.ivyresolve.CachingModuleComponentRepository] Using cached module metadata for module 'org.apache.httpcomponents:httpmime:4.1' in 'BintrayJCenter'
12:14:37.266 [DEBUG] [org.gradle.api.internal.artifacts.ivyservice.ivyresolve.RepositoryChainDependencyResolver] Using org.apache.httpcomponents:httpmime:4.1 from Maven repository 'BintrayJCenter'
12:14:37.266 [DEBUG] [org.gradle.api.internal.artifacts.ivyservice.resolveengine.graph.DependencyGraphBuilder] Visiting configuration com.android.tools:sdklib:24.2.3(master).
12:14:37.267 [DEBUG] [org.gradle.api.internal.artifacts.ivyservice.resolveengine.graph.DependencyGraphBuilder] Visiting configuration com.android.tools:sdk-common:24.2.3(compile).
12:14:37.267 [DEBUG] [org.gradle.api.internal.artifacts.ivyservice.resolveengine.graph.DependencyGraphBuilder] Visiting configuration com.android.tools:sdk-common:24.2.3(runtime).
12:14:37.267 [DEBUG] [org.gradle.api.internal.artifacts.ivyservice.resolveengine.graph.DependencyGraphBuilder] Visiting dependency com.android.tools:sdk-common:24.2.3(runtime) -> com.android.tools:sdklib:24.2.3(dependency: com.android.tools#sdklib;24.2.3 {runtime=[compile(*), runtime(*), master(*)]})
12:14:37.268 [DEBUG] [org.gradle.api.internal.artifacts.ivyservice.resolveengine.graph.DependencyGraphBuilder] Visiting dependency com.android.tools:sdk-common:24.2.3(runtime) -> com.android.tools.build:builder-test-api:1.2.3(dependency: com.android.tools.build#builder-test-api;1.2.3 {runtime=[compile(*), runtime(*), master(*)]})
12:14:37.268 [DEBUG] [org.gradle.api.internal.artifacts.ivyservice.resolveengine.graph.DependencyGraphBuilder] Visiting dependency com.android.tools:sdk-common:24.2.3(runtime) -> com.android.tools.build:builder-model:1.2.3(dependency: com.android.tools.build#builder-model;1.2.3 {runtime=[compile(*), runtime(*), master(*)]})
12:14:37.268 [DEBUG] [org.gradle.api.internal.artifacts.ivyservice.resolveengine.graph.DependencyGraphBuilder] Visiting dependency com.android.tools:sdk-common:24.2.3(runtime) -> com.google.code.gson:gson:2.2.4(dependency: com.google.code.gson#gson;2.2.4 {runtime=[compile(*), runtime(*), master(*)]})
12:14:37.269 [DEBUG] [org.gradle.api.internal.artifacts.ivyservice.resolveengine.graph.DependencyGraphBuilder] Visiting configuration com.android.tools:sdk-common:24.2.3(master).
12:14:37.269 [DEBUG] [org.gradle.api.internal.artifacts.ivyservice.resolveengine.graph.DependencyGraphBuilder] Visiting configuration com.android.tools:common:24.2.3(compile).
12:14:37.269 [DEBUG] [org.gradle.api.internal.artifacts.ivyservice.resolveengine.graph.DependencyGraphBuilder] Visiting configuration com.android.tools:common:24.2.3(runtime).
12:14:37.269 [DEBUG] [org.gradle.api.internal.artifacts.ivyservice.resolveengine.graph.DependencyGraphBuilder] Visiting dependency com.android.tools:common:24.2.3(runtime) -> com.android.tools:annotations:24.2.3(dependency: com.android.tools#annotations;24.2.3 {runtime=[compile(*), runtime(*), master(*)]})
12:14:37.270 [DEBUG] [org.gradle.api.internal.artifacts.ivyservice.resolveengine.graph.DependencyGraphBuilder] Visiting dependency com.android.tools:common:24.2.3(runtime) -> com.google.guava:guava:17.0(dependency: com.google.guava#guava;17.0 {runtime=[compile(*), runtime(*), master(*)]})
12:14:37.270 [DEBUG] [org.gradle.api.internal.artifacts.ivyservice.resolveengine.graph.DependencyGraphBuilder] Selecting new module version com.google.guava:guava:17.0
12:14:37.270 [DEBUG] [org.gradle.api.internal.artifacts.ivyservice.ivyresolve.RepositoryChainDependencyResolver] Attempting to resolve com.google.guava:guava:17.0 using repositories [BintrayJCenter]
12:14:37.272 [DEBUG] [org.gradle.api.internal.artifacts.ivyservice.ivyresolve.parser.IvyXmlModuleDescriptorParser] post 1.3 ivy file: using exact as default matcher
12:14:37.273 [DEBUG] [org.gradle.api.internal.artifacts.ivyservice.ivyresolve.CachingModuleComponentRepository] Using cached module metadata for module 'com.google.guava:guava:17.0' in 'BintrayJCenter'
12:14:37.273 [DEBUG] [org.gradle.api.internal.artifacts.ivyservice.ivyresolve.RepositoryChainDependencyResolver] Using com.google.guava:guava:17.0 from Maven repository 'BintrayJCenter'
12:14:37.274 [DEBUG] [org.gradle.api.internal.artifacts.ivyservice.resolveengine.graph.DependencyGraphBuilder] Visiting configuration com.android.tools:common:24.2.3(master).
12:14:37.274 [DEBUG] [org.gradle.api.internal.artifacts.ivyservice.resolveengine.graph.DependencyGraphBuilder] Visiting configuration com.android.tools.build:manifest-merger:24.2.3(compile).
12:14:37.274 [DEBUG] [org.gradle.api.internal.artifacts.ivyservice.resolveengine.graph.DependencyGraphBuilder] Visiting configuration com.android.tools.build:manifest-merger:24.2.3(runtime).
12:14:37.275 [DEBUG] [org.gradle.api.internal.artifacts.ivyservice.resolveengine.graph.DependencyGraphBuilder] Visiting dependency com.android.tools.build:manifest-merger:24.2.3(runtime) -> com.android.tools:common:24.2.3(dependency: com.android.tools#common;24.2.3 {runtime=[compile(*), runtime(*), master(*)]})
12:14:37.275 [DEBUG] [org.gradle.api.internal.artifacts.ivyservice.resolveengine.graph.DependencyGraphBuilder] Visiting dependency com.android.tools.build:manifest-merger:24.2.3(runtime) -> com.android.tools:sdklib:24.2.3(dependency: com.android.tools#sdklib;24.2.3 {runtime=[compile(*), runtime(*), master(*)]})
12:14:37.275 [DEBUG] [org.gradle.api.internal.artifacts.ivyservice.resolveengine.graph.DependencyGraphBuilder] Visiting dependency com.android.tools.build:manifest-merger:24.2.3(runtime) -> com.android.tools:sdk-common:24.2.3(dependency: com.android.tools#sdk-common;24.2.3 {runtime=[compile(*), runtime(*), master(*)]})
12:14:37.275 [DEBUG] [org.gradle.api.internal.artifacts.ivyservice.resolveengine.graph.DependencyGraphBuilder] Visiting dependency com.android.tools.build:manifest-merger:24.2.3(runtime) -> net.sf.kxml:kxml2:2.3.0(dependency: net.sf.kxml#kxml2;2.3.0 {runtime=[compile(*), runtime(*), master(*)]})
12:14:37.276 [DEBUG] [org.gradle.api.internal.artifacts.ivyservice.resolveengine.graph.DependencyGraphBuilder] Selecting new module version net.sf.kxml:kxml2:2.3.0
12:14:37.276 [DEBUG] [org.gradle.api.internal.artifacts.ivyservice.ivyresolve.RepositoryChainDependencyResolver] Attempting to resolve net.sf.kxml:kxml2:2.3.0 using repositories [BintrayJCenter]
12:14:37.278 [DEBUG] [org.gradle.api.internal.artifacts.ivyservice.ivyresolve.parser.IvyXmlModuleDescriptorParser] post 1.3 ivy file: using exact as default matcher
12:14:37.279 [DEBUG] [org.gradle.api.internal.artifacts.ivyservice.ivyresolve.CachingModuleComponentRepository] Using cached module metadata for module 'net.sf.kxml:kxml2:2.3.0' in 'BintrayJCenter'
12:14:37.280 [DEBUG] [org.gradle.api.internal.artifacts.ivyservice.ivyresolve.RepositoryChainDependencyResolver] Using net.sf.kxml:kxml2:2.3.0 from Maven repository 'BintrayJCenter'
12:14:37.280 [DEBUG] [org.gradle.api.internal.artifacts.ivyservice.resolveengine.graph.DependencyGraphBuilder] Visiting dependency com.android.tools.build:manifest-merger:24.2.3(runtime) -> com.google.code.gson:gson:2.2.4(dependency: com.google.code.gson#gson;2.2.4 {runtime=[compile(*), runtime(*), master(*)]})
12:14:37.280 [DEBUG] [org.gradle.api.internal.artifacts.ivyservice.resolveengine.graph.DependencyGraphBuilder] Visiting configuration com.android.tools.build:manifest-merger:24.2.3(master).
12:14:37.281 [DEBUG] [org.gradle.api.internal.artifacts.ivyservice.resolveengine.graph.DependencyGraphBuilder] Visiting configuration com.android.tools.ddms:ddmlib:24.2.3(compile).
12:14:37.281 [DEBUG] [org.gradle.api.internal.artifacts.ivyservice.resolveengine.graph.DependencyGraphBuilder] Visiting configuration com.android.tools.ddms:ddmlib:24.2.3(runtime).
12:14:37.281 [DEBUG] [org.gradle.api.internal.artifacts.ivyservice.resolveengine.graph.DependencyGraphBuilder] Visiting dependency com.android.tools.ddms:ddmlib:24.2.3(runtime) -> com.android.tools:common:24.2.3(dependency: com.android.tools#common;24.2.3 {runtime=[compile(*), runtime(*), master(*)]})
12:14:37.282 [DEBUG] [org.gradle.api.internal.artifacts.ivyservice.resolveengine.graph.DependencyGraphBuilder] Visiting dependency com.android.tools.ddms:ddmlib:24.2.3(runtime) -> net.sf.kxml:kxml2:2.3.0(dependency: net.sf.kxml#kxml2;2.3.0 {runtime=[compile(*), runtime(*), master(*)]})
12:14:37.282 [DEBUG] [org.gradle.api.internal.artifacts.ivyservice.resolveengine.graph.DependencyGraphBuilder] Visiting configuration com.android.tools.ddms:ddmlib:24.2.3(master).
12:14:37.282 [DEBUG] [org.gradle.api.internal.artifacts.ivyservice.resolveengine.graph.DependencyGraphBuilder] Visiting configuration com.squareup:javawriter:2.5.0(compile).
12:14:37.282 [DEBUG] [org.gradle.api.internal.artifacts.ivyservice.resolveengine.graph.DependencyGraphBuilder] Visiting configuration com.squareup:javawriter:2.5.0(runtime).
12:14:37.282 [DEBUG] [org.gradle.api.internal.artifacts.ivyservice.resolveengine.graph.DependencyGraphBuilder] Visiting configuration com.squareup:javawriter:2.5.0(master).
12:14:37.283 [DEBUG] [org.gradle.api.internal.artifacts.ivyservice.resolveengine.graph.DependencyGraphBuilder] Visiting configuration org.bouncycastle:bcpkix-jdk15on:1.48(compile).
12:14:37.283 [DEBUG] [org.gradle.api.internal.artifacts.ivyservice.resolveengine.graph.DependencyGraphBuilder] Visiting dependency org.bouncycastle:bcpkix-jdk15on:1.48(compile) -> org.bouncycastle:bcprov-jdk15on:1.48(dependency: org.bouncycastle#bcprov-jdk15on;1.48 {compile=[compile(*), master(*)], runtime=[runtime(*)]})
12:14:37.283 [DEBUG] [org.gradle.api.internal.artifacts.ivyservice.resolveengine.graph.DependencyGraphBuilder] Visiting configuration org.bouncycastle:bcpkix-jdk15on:1.48(runtime).
12:14:37.284 [DEBUG] [org.gradle.api.internal.artifacts.ivyservice.resolveengine.graph.DependencyGraphBuilder] Visiting dependency org.bouncycastle:bcpkix-jdk15on:1.48(runtime) -> org.bouncycastle:bcprov-jdk15on:1.48(dependency: org.bouncycastle#bcprov-jdk15on;1.48 {compile=[compile(*), master(*)], runtime=[runtime(*)]})
12:14:37.284 [DEBUG] [org.gradle.api.internal.artifacts.ivyservice.resolveengine.graph.DependencyGraphBuilder] Visiting configuration org.bouncycastle:bcpkix-jdk15on:1.48(master).
12:14:37.284 [DEBUG] [org.gradle.api.internal.artifacts.ivyservice.resolveengine.graph.DependencyGraphBuilder] Visiting configuration org.bouncycastle:bcprov-jdk15on:1.48(compile).
12:14:37.284 [DEBUG] [org.gradle.api.internal.artifacts.ivyservice.resolveengine.graph.DependencyGraphBuilder] Visiting configuration org.bouncycastle:bcprov-jdk15on:1.48(runtime).
12:14:37.285 [DEBUG] [org.gradle.api.internal.artifacts.ivyservice.resolveengine.graph.DependencyGraphBuilder] Visiting configuration org.bouncycastle:bcprov-jdk15on:1.48(master).
12:14:37.285 [DEBUG] [org.gradle.api.internal.artifacts.ivyservice.resolveengine.graph.DependencyGraphBuilder] Visiting configuration org.ow2.asm:asm:5.0.3(compile).
12:14:37.285 [DEBUG] [org.gradle.api.internal.artifacts.ivyservice.resolveengine.graph.DependencyGraphBuilder] Visiting configuration org.ow2.asm:asm:5.0.3(runtime).
12:14:37.285 [DEBUG] [org.gradle.api.internal.artifacts.ivyservice.resolveengine.graph.DependencyGraphBuilder] Visiting configuration org.ow2.asm:asm:5.0.3(master).
12:14:37.286 [DEBUG] [org.gradle.api.internal.artifacts.ivyservice.resolveengine.graph.DependencyGraphBuilder] Visiting configuration org.ow2.asm:asm-tree:5.0.3(compile).
12:14:37.286 [DEBUG] [org.gradle.api.internal.artifacts.ivyservice.resolveengine.graph.DependencyGraphBuilder] Visiting dependency org.ow2.asm:asm-tree:5.0.3(compile) -> org.ow2.asm:asm:5.0.3(dependency: org.ow2.asm#asm;5.0.3 {compile=[compile(*), master(*)], runtime=[runtime(*)]})
12:14:37.286 [DEBUG] [org.gradle.api.internal.artifacts.ivyservice.resolveengine.graph.DependencyGraphBuilder] Visiting configuration org.ow2.asm:asm-tree:5.0.3(runtime).
12:14:37.286 [DEBUG] [org.gradle.api.internal.artifacts.ivyservice.resolveengine.graph.DependencyGraphBuilder] Visiting dependency org.ow2.asm:asm-tree:5.0.3(runtime) -> org.ow2.asm:asm:5.0.3(dependency: org.ow2.asm#asm;5.0.3 {compile=[compile(*), master(*)], runtime=[runtime(*)]})
12:14:37.287 [DEBUG] [org.gradle.api.internal.artifacts.ivyservice.resolveengine.graph.DependencyGraphBuilder] Visiting configuration org.ow2.asm:asm-tree:5.0.3(master).
12:14:37.287 [DEBUG] [org.gradle.api.internal.artifacts.ivyservice.resolveengine.graph.DependencyGraphBuilder] Visiting configuration com.google.code.gson:gson:2.2.4(compile).
12:14:37.287 [DEBUG] [org.gradle.api.internal.artifacts.ivyservice.resolveengine.graph.DependencyGraphBuilder] Visiting configuration com.google.code.gson:gson:2.2.4(runtime).
12:14:37.287 [DEBUG] [org.gradle.api.internal.artifacts.ivyservice.resolveengine.graph.DependencyGraphBuilder] Visiting configuration com.google.code.gson:gson:2.2.4(master).
12:14:37.288 [DEBUG] [org.gradle.api.internal.artifacts.ivyservice.resolveengine.graph.DependencyGraphBuilder] Visiting configuration com.android.tools.lint:lint-checks:24.2.3(compile).
12:14:37.288 [DEBUG] [org.gradle.api.internal.artifacts.ivyservice.resolveengine.graph.DependencyGraphBuilder] Visiting configuration com.android.tools.lint:lint-checks:24.2.3(runtime).
12:14:37.288 [DEBUG] [org.gradle.api.internal.artifacts.ivyservice.resolveengine.graph.DependencyGraphBuilder] Visiting dependency com.android.tools.lint:lint-checks:24.2.3(runtime) -> com.android.tools.lint:lint-api:24.2.3(dependency: com.android.tools.lint#lint-api;24.2.3 {runtime=[compile(*), runtime(*), master(*)]})
12:14:37.288 [DEBUG] [org.gradle.api.internal.artifacts.ivyservice.resolveengine.graph.DependencyGraphBuilder] Selecting new module version com.android.tools.lint:lint-api:24.2.3
12:14:37.288 [DEBUG] [org.gradle.api.internal.artifacts.ivyservice.ivyresolve.RepositoryChainDependencyResolver] Attempting to resolve com.android.tools.lint:lint-api:24.2.3 using repositories [BintrayJCenter]
12:14:37.290 [DEBUG] [org.gradle.api.internal.artifacts.ivyservice.ivyresolve.parser.IvyXmlModuleDescriptorParser] post 1.3 ivy file: using exact as default matcher
12:14:37.292 [DEBUG] [org.gradle.api.internal.artifacts.ivyservice.ivyresolve.CachingModuleComponentRepository] Using cached module metadata for module 'com.android.tools.lint:lint-api:24.2.3' in 'BintrayJCenter'
12:14:37.292 [DEBUG] [org.gradle.api.internal.artifacts.ivyservice.ivyresolve.RepositoryChainDependencyResolver] Using com.android.tools.lint:lint-api:24.2.3 from Maven repository 'BintrayJCenter'
12:14:37.293 [DEBUG] [org.gradle.api.internal.artifacts.ivyservice.resolveengine.graph.DependencyGraphBuilder] Visiting dependency com.android.tools.lint:lint-checks:24.2.3(runtime) -> org.ow2.asm:asm-analysis:5.0.3(dependency: org.ow2.asm#asm-analysis;5.0.3 {runtime=[compile(*), runtime(*), master(*)]})
12:14:37.293 [DEBUG] [org.gradle.api.internal.artifacts.ivyservice.resolveengine.graph.DependencyGraphBuilder] Selecting new module version org.ow2.asm:asm-analysis:5.0.3
12:14:37.293 [DEBUG] [org.gradle.api.internal.artifacts.ivyservice.ivyresolve.RepositoryChainDependencyResolver] Attempting to resolve org.ow2.asm:asm-analysis:5.0.3 using repositories [BintrayJCenter]
12:14:37.295 [DEBUG] [org.gradle.api.internal.artifacts.ivyservice.ivyresolve.parser.IvyXmlModuleDescriptorParser] post 1.3 ivy file: using exact as default matcher
12:14:37.296 [DEBUG] [org.gradle.api.internal.artifacts.ivyservice.ivyresolve.CachingModuleComponentRepository] Using cached module metadata for module 'org.ow2.asm:asm-analysis:5.0.3' in 'BintrayJCenter'
12:14:37.296 [DEBUG] [org.gradle.api.internal.artifacts.ivyservice.ivyresolve.RepositoryChainDependencyResolver] Using org.ow2.asm:asm-analysis:5.0.3 from Maven repository 'BintrayJCenter'
12:14:37.296 [DEBUG] [org.gradle.api.internal.artifacts.ivyservice.resolveengine.graph.DependencyGraphBuilder] Visiting configuration com.android.tools.lint:lint-checks:24.2.3(master).
12:14:37.296 [DEBUG] [org.gradle.api.internal.artifacts.ivyservice.resolveengine.graph.DependencyGraphBuilder] Visiting configuration org.eclipse.jdt.core.compiler:ecj:4.4(compile).
12:14:37.297 [DEBUG] [org.gradle.api.internal.artifacts.ivyservice.resolveengine.graph.DependencyGraphBuilder] Visiting configuration org.eclipse.jdt.core.compiler:ecj:4.4(runtime).
12:14:37.297 [DEBUG] [org.gradle.api.internal.artifacts.ivyservice.resolveengine.graph.DependencyGraphBuilder] Visiting configuration org.eclipse.jdt.core.compiler:ecj:4.4(master).
12:14:37.297 [DEBUG] [org.gradle.api.internal.artifacts.ivyservice.resolveengine.graph.DependencyGraphBuilder] Visiting configuration net.sf.proguard:proguard-base:5.1(compile).
12:14:37.297 [DEBUG] [org.gradle.api.internal.artifacts.ivyservice.resolveengine.graph.DependencyGraphBuilder] Visiting configuration net.sf.proguard:proguard-base:5.1(master).
12:14:37.297 [DEBUG] [org.gradle.api.internal.artifacts.ivyservice.resolveengine.graph.DependencyGraphBuilder] Visiting configuration net.sf.proguard:proguard-base:5.1(runtime).
12:14:37.298 [DEBUG] [org.gradle.api.internal.artifacts.ivyservice.resolveengine.graph.DependencyGraphBuilder] Visiting configuration com.android.tools:annotations:24.2.3(compile).
12:14:37.298 [DEBUG] [org.gradle.api.internal.artifacts.ivyservice.resolveengine.graph.DependencyGraphBuilder] Visiting configuration com.android.tools:annotations:24.2.3(runtime).
12:14:37.298 [DEBUG] [org.gradle.api.internal.artifacts.ivyservice.resolveengine.graph.DependencyGraphBuilder] Visiting configuration com.android.tools:annotations:24.2.3(master).
12:14:37.298 [DEBUG] [org.gradle.api.internal.artifacts.ivyservice.resolveengine.graph.DependencyGraphBuilder] Visiting configuration com.android.tools.layoutlib:layoutlib-api:24.2.3(compile).
12:14:37.299 [DEBUG] [org.gradle.api.internal.artifacts.ivyservice.resolveengine.graph.DependencyGraphBuilder] Visiting configuration com.android.tools.layoutlib:layoutlib-api:24.2.3(runtime).
12:14:37.299 [DEBUG] [org.gradle.api.internal.artifacts.ivyservice.resolveengine.graph.DependencyGraphBuilder] Visiting dependency com.android.tools.layoutlib:layoutlib-api:24.2.3(runtime) -> com.android.tools:common:24.2.3(dependency: com.android.tools#common;24.2.3 {runtime=[compile(*), runtime(*), master(*)]})
12:14:37.299 [DEBUG] [org.gradle.api.internal.artifacts.ivyservice.resolveengine.graph.DependencyGraphBuilder] Visiting dependency com.android.tools.layoutlib:layoutlib-api:24.2.3(runtime) -> net.sf.kxml:kxml2:2.3.0(dependency: net.sf.kxml#kxml2;2.3.0 {runtime=[compile(*), runtime(*), master(*)]})
12:14:37.299 [DEBUG] [org.gradle.api.internal.artifacts.ivyservice.resolveengine.graph.DependencyGraphBuilder] Visiting configuration com.android.tools.layoutlib:layoutlib-api:24.2.3(master).
12:14:37.300 [DEBUG] [org.gradle.api.internal.artifacts.ivyservice.resolveengine.graph.DependencyGraphBuilder] Visiting configuration com.android.tools:dvlib:24.2.3(compile).
12:14:37.300 [DEBUG] [org.gradle.api.internal.artifacts.ivyservice.resolveengine.graph.DependencyGraphBuilder] Visiting configuration com.android.tools:dvlib:24.2.3(runtime).
12:14:37.300 [DEBUG] [org.gradle.api.internal.artifacts.ivyservice.resolveengine.graph.DependencyGraphBuilder] Visiting dependency com.android.tools:dvlib:24.2.3(runtime) -> com.android.tools:common:24.2.3(dependency: com.android.tools#common;24.2.3 {runtime=[compile(*), runtime(*), master(*)]})
12:14:37.300 [DEBUG] [org.gradle.api.internal.artifacts.ivyservice.resolveengine.graph.DependencyGraphBuilder] Visiting configuration com.android.tools:dvlib:24.2.3(master).
12:14:37.301 [DEBUG] [org.gradle.api.internal.artifacts.ivyservice.resolveengine.graph.DependencyGraphBuilder] Visiting configuration org.apache.commons:commons-compress:1.8.1(compile).
12:14:37.301 [DEBUG] [org.gradle.api.internal.artifacts.ivyservice.resolveengine.graph.DependencyGraphBuilder] Visiting configuration org.apache.commons:commons-compress:1.8.1(runtime).
12:14:37.301 [DEBUG] [org.gradle.api.internal.artifacts.ivyservice.resolveengine.graph.DependencyGraphBuilder] Visiting configuration org.apache.commons:commons-compress:1.8.1(master).
12:14:37.301 [DEBUG] [org.gradle.api.internal.artifacts.ivyservice.resolveengine.graph.DependencyGraphBuilder] Visiting configuration org.apache.httpcomponents:httpclient:4.1.1(compile).
12:14:37.302 [DEBUG] [org.gradle.api.internal.artifacts.ivyservice.resolveengine.graph.DependencyGraphBuilder] Visiting dependency org.apache.httpcomponents:httpclient:4.1.1(compile) -> org.apache.httpcomponents:httpcore:4.1(dependency: org.apache.httpcomponents#httpcore;4.1 {compile=[compile(*), master(*)], runtime=[runtime(*)]})
12:14:37.302 [DEBUG] [org.gradle.api.internal.artifacts.ivyservice.resolveengine.graph.DependencyGraphBuilder] Selecting new module version org.apache.httpcomponents:httpcore:4.1
12:14:37.302 [DEBUG] [org.gradle.api.internal.artifacts.ivyservice.ivyresolve.RepositoryChainDependencyResolver] Attempting to resolve org.apache.httpcomponents:httpcore:4.1 using repositories [BintrayJCenter]
12:14:37.304 [DEBUG] [org.gradle.api.internal.artifacts.ivyservice.ivyresolve.parser.IvyXmlModuleDescriptorParser] post 1.3 ivy file: using exact as default matcher
12:14:37.305 [DEBUG] [org.gradle.api.internal.artifacts.ivyservice.ivyresolve.CachingModuleComponentRepository] Using cached module metadata for module 'org.apache.httpcomponents:httpcore:4.1' in 'BintrayJCenter'
12:14:37.306 [DEBUG] [org.gradle.api.internal.artifacts.ivyservice.ivyresolve.RepositoryChainDependencyResolver] Using org.apache.httpcomponents:httpcore:4.1 from Maven repository 'BintrayJCenter'
12:14:37.306 [DEBUG] [org.gradle.api.internal.artifacts.ivyservice.resolveengine.graph.DependencyGraphBuilder] Visiting dependency org.apache.httpcomponents:httpclient:4.1.1(compile) -> commons-logging:commons-logging:1.1.1(dependency: commons-logging#commons-logging;1.1.1 {compile=[compile(*), master(*)], runtime=[runtime(*)]})
12:14:37.306 [DEBUG] [org.gradle.api.internal.artifacts.ivyservice.resolveengine.graph.DependencyGraphBuilder] Selecting new module version commons-logging:commons-logging:1.1.1
12:14:37.306 [DEBUG] [org.gradle.api.internal.artifacts.ivyservice.ivyresolve.RepositoryChainDependencyResolver] Attempting to resolve commons-logging:commons-logging:1.1.1 using repositories [BintrayJCenter]
12:14:37.308 [DEBUG] [org.gradle.api.internal.artifacts.ivyservice.ivyresolve.parser.IvyXmlModuleDescriptorParser] post 1.3 ivy file: using exact as default matcher
12:14:37.310 [DEBUG] [org.gradle.api.internal.artifacts.ivyservice.ivyresolve.CachingModuleComponentRepository] Using cached module metadata for module 'commons-logging:commons-logging:1.1.1' in 'BintrayJCenter'
12:14:37.310 [DEBUG] [org.gradle.api.internal.artifacts.ivyservice.ivyresolve.RepositoryChainDependencyResolver] Using commons-logging:commons-logging:1.1.1 from Maven repository 'BintrayJCenter'
12:14:37.310 [DEBUG] [org.gradle.api.internal.artifacts.ivyservice.resolveengine.graph.DependencyGraphBuilder] Visiting dependency org.apache.httpcomponents:httpclient:4.1.1(compile) -> commons-codec:commons-codec:1.4(dependency: commons-codec#commons-codec;1.4 {compile=[compile(*), master(*)], runtime=[runtime(*)]})
12:14:37.310 [DEBUG] [org.gradle.api.internal.artifacts.ivyservice.resolveengine.graph.DependencyGraphBuilder] Selecting new module version commons-codec:commons-codec:1.4
12:14:37.311 [DEBUG] [org.gradle.api.internal.artifacts.ivyservice.ivyresolve.RepositoryChainDependencyResolver] Attempting to resolve commons-codec:commons-codec:1.4 using repositories [BintrayJCenter]
12:14:37.312 [DEBUG] [org.gradle.api.internal.artifacts.ivyservice.ivyresolve.parser.IvyXmlModuleDescriptorParser] post 1.3 ivy file: using exact as default matcher
12:14:37.313 [DEBUG] [org.gradle.api.internal.artifacts.ivyservice.ivyresolve.CachingModuleComponentRepository] Using cached module metadata for module 'commons-codec:commons-codec:1.4' in 'BintrayJCenter'
12:14:37.313 [DEBUG] [org.gradle.api.internal.artifacts.ivyservice.ivyresolve.RepositoryChainDependencyResolver] Using commons-codec:commons-codec:1.4 from Maven repository 'BintrayJCenter'
12:14:37.314 [DEBUG] [org.gradle.api.internal.artifacts.ivyservice.resolveengine.graph.DependencyGraphBuilder] Visiting configuration org.apache.httpcomponents:httpclient:4.1.1(runtime).
12:14:37.314 [DEBUG] [org.gradle.api.internal.artifacts.ivyservice.resolveengine.graph.DependencyGraphBuilder] Visiting dependency org.apache.httpcomponents:httpclient:4.1.1(runtime) -> org.apache.httpcomponents:httpcore:4.1(dependency: org.apache.httpcomponents#httpcore;4.1 {compile=[compile(*), master(*)], runtime=[runtime(*)]})
12:14:37.314 [DEBUG] [org.gradle.api.internal.artifacts.ivyservice.resolveengine.graph.DependencyGraphBuilder] Visiting dependency org.apache.httpcomponents:httpclient:4.1.1(runtime) -> commons-logging:commons-logging:1.1.1(dependency: commons-logging#commons-logging;1.1.1 {compile=[compile(*), master(*)], runtime=[runtime(*)]})
12:14:37.315 [DEBUG] [org.gradle.api.internal.artifacts.ivyservice.resolveengine.graph.DependencyGraphBuilder] Visiting dependency org.apache.httpcomponents:httpclient:4.1.1(runtime) -> commons-codec:commons-codec:1.4(dependency: commons-codec#commons-codec;1.4 {compile=[compile(*), master(*)], runtime=[runtime(*)]})
12:14:37.315 [DEBUG] [org.gradle.api.internal.artifacts.ivyservice.resolveengine.graph.DependencyGraphBuilder] Visiting configuration org.apache.httpcomponents:httpclient:4.1.1(master).
12:14:37.315 [DEBUG] [org.gradle.api.internal.artifacts.ivyservice.resolveengine.graph.DependencyGraphBuilder] Visiting configuration org.apache.httpcomponents:httpmime:4.1(compile).
12:14:37.315 [DEBUG] [org.gradle.api.internal.artifacts.ivyservice.resolveengine.graph.DependencyGraphBuilder] Visiting dependency org.apache.httpcomponents:httpmime:4.1(compile) -> org.apache.httpcomponents:httpcore:4.1(dependency: org.apache.httpcomponents#httpcore;4.1 {compile=[compile(*), master(*)], runtime=[runtime(*)]})
12:14:37.316 [DEBUG] [org.gradle.api.internal.artifacts.ivyservice.resolveengine.graph.DependencyGraphBuilder] Visiting dependency org.apache.httpcomponents:httpmime:4.1(compile) -> commons-logging:commons-logging:1.1.1(dependency: commons-logging#commons-logging;1.1.1 {compile=[compile(*), master(*)], runtime=[runtime(*)]})
12:14:37.316 [DEBUG] [org.gradle.api.internal.artifacts.ivyservice.resolveengine.graph.DependencyGraphBuilder] Visiting configuration org.apache.httpcomponents:httpmime:4.1(runtime).
12:14:37.316 [DEBUG] [org.gradle.api.internal.artifacts.ivyservice.resolveengine.graph.DependencyGraphBuilder] Visiting dependency org.apache.httpcomponents:httpmime:4.1(runtime) -> org.apache.httpcomponents:httpcore:4.1(dependency: org.apache.httpcomponents#httpcore;4.1 {compile=[compile(*), master(*)], runtime=[runtime(*)]})
12:14:37.317 [DEBUG] [org.gradle.api.internal.artifacts.ivyservice.resolveengine.graph.DependencyGraphBuilder] Visiting dependency org.apache.httpcomponents:httpmime:4.1(runtime) -> commons-logging:commons-logging:1.1.1(dependency: commons-logging#commons-logging;1.1.1 {compile=[compile(*), master(*)], runtime=[runtime(*)]})
12:14:37.317 [DEBUG] [org.gradle.api.internal.artifacts.ivyservice.resolveengine.graph.DependencyGraphBuilder] Visiting configuration org.apache.httpcomponents:httpmime:4.1(master).
12:14:37.317 [DEBUG] [org.gradle.api.internal.artifacts.ivyservice.resolveengine.graph.DependencyGraphBuilder] Visiting configuration com.android.tools:sdklib:24.2.3(compile).
12:14:37.317 [DEBUG] [org.gradle.api.internal.artifacts.ivyservice.resolveengine.graph.DependencyGraphBuilder] Changed edges for com.android.tools:sdklib:24.2.3(compile) selects same versions as previous traversal. ignoring
12:14:37.317 [DEBUG] [org.gradle.api.internal.artifacts.ivyservice.resolveengine.graph.DependencyGraphBuilder] Visiting configuration com.android.tools:sdklib:24.2.3(runtime).
12:14:37.318 [DEBUG] [org.gradle.api.internal.artifacts.ivyservice.resolveengine.graph.DependencyGraphBuilder] Changed edges for com.android.tools:sdklib:24.2.3(runtime) selects same versions as previous traversal. ignoring
12:14:37.318 [DEBUG] [org.gradle.api.internal.artifacts.ivyservice.resolveengine.graph.DependencyGraphBuilder] Visiting configuration com.android.tools:sdklib:24.2.3(master).
12:14:37.318 [DEBUG] [org.gradle.api.internal.artifacts.ivyservice.resolveengine.graph.DependencyGraphBuilder] Changed edges for com.android.tools:sdklib:24.2.3(master) selects same versions as previous traversal. ignoring
12:14:37.318 [DEBUG] [org.gradle.api.internal.artifacts.ivyservice.resolveengine.graph.DependencyGraphBuilder] Visiting configuration com.android.tools.build:builder-test-api:1.2.3(compile).
12:14:37.318 [DEBUG] [org.gradle.api.internal.artifacts.ivyservice.resolveengine.graph.DependencyGraphBuilder] Changed edges for com.android.tools.build:builder-test-api:1.2.3(compile) selects same versions as previous traversal. ignoring
12:14:37.318 [DEBUG] [org.gradle.api.internal.artifacts.ivyservice.resolveengine.graph.DependencyGraphBuilder] Visiting configuration com.android.tools.build:builder-test-api:1.2.3(runtime).
12:14:37.319 [DEBUG] [org.gradle.api.internal.artifacts.ivyservice.resolveengine.graph.DependencyGraphBuilder] Changed edges for com.android.tools.build:builder-test-api:1.2.3(runtime) selects same versions as previous traversal. ignoring
12:14:37.319 [DEBUG] [org.gradle.api.internal.artifacts.ivyservice.resolveengine.graph.DependencyGraphBuilder] Visiting configuration com.android.tools.build:builder-test-api:1.2.3(master).
12:14:37.319 [DEBUG] [org.gradle.api.internal.artifacts.ivyservice.resolveengine.graph.DependencyGraphBuilder] Changed edges for com.android.tools.build:builder-test-api:1.2.3(master) selects same versions as previous traversal. ignoring
12:14:37.319 [DEBUG] [org.gradle.api.internal.artifacts.ivyservice.resolveengine.graph.DependencyGraphBuilder] Visiting configuration com.android.tools.build:builder-model:1.2.3(compile).
12:14:37.319 [DEBUG] [org.gradle.api.internal.artifacts.ivyservice.resolveengine.graph.DependencyGraphBuilder] Changed edges for com.android.tools.build:builder-model:1.2.3(compile) selects same versions as previous traversal. ignoring
12:14:37.320 [DEBUG] [org.gradle.api.internal.artifacts.ivyservice.resolveengine.graph.DependencyGraphBuilder] Visiting configuration com.android.tools.build:builder-model:1.2.3(runtime).
12:14:37.320 [DEBUG] [org.gradle.api.internal.artifacts.ivyservice.resolveengine.graph.DependencyGraphBuilder] Changed edges for com.android.tools.build:builder-model:1.2.3(runtime) selects same versions as previous traversal. ignoring
12:14:37.320 [DEBUG] [org.gradle.api.internal.artifacts.ivyservice.resolveengine.graph.DependencyGraphBuilder] Visiting configuration com.android.tools.build:builder-model:1.2.3(master).
12:14:37.320 [DEBUG] [org.gradle.api.internal.artifacts.ivyservice.resolveengine.graph.DependencyGraphBuilder] Changed edges for com.android.tools.build:builder-model:1.2.3(master) selects same versions as previous traversal. ignoring
12:14:37.320 [DEBUG] [org.gradle.api.internal.artifacts.ivyservice.resolveengine.graph.DependencyGraphBuilder] Visiting configuration com.google.guava:guava:17.0(compile).
12:14:37.321 [DEBUG] [org.gradle.api.internal.artifacts.ivyservice.resolveengine.graph.DependencyGraphBuilder] Visiting configuration com.google.guava:guava:17.0(runtime).
12:14:37.321 [DEBUG] [org.gradle.api.internal.artifacts.ivyservice.resolveengine.graph.DependencyGraphBuilder] Visiting configuration com.google.guava:guava:17.0(master).
12:14:37.321 [DEBUG] [org.gradle.api.internal.artifacts.ivyservice.resolveengine.graph.DependencyGraphBuilder] Visiting configuration com.android.tools:common:24.2.3(compile).
12:14:37.321 [DEBUG] [org.gradle.api.internal.artifacts.ivyservice.resolveengine.graph.DependencyGraphBuilder] Changed edges for com.android.tools:common:24.2.3(compile) selects same versions as previous traversal. ignoring
12:14:37.322 [DEBUG] [org.gradle.api.internal.artifacts.ivyservice.resolveengine.graph.DependencyGraphBuilder] Visiting configuration com.android.tools:common:24.2.3(runtime).
12:14:37.322 [DEBUG] [org.gradle.api.internal.artifacts.ivyservice.resolveengine.graph.DependencyGraphBuilder] Changed edges for com.android.tools:common:24.2.3(runtime) selects same versions as previous traversal. ignoring
12:14:37.322 [DEBUG] [org.gradle.api.internal.artifacts.ivyservice.resolveengine.graph.DependencyGraphBuilder] Visiting configuration com.android.tools:common:24.2.3(master).
12:14:37.322 [DEBUG] [org.gradle.api.internal.artifacts.ivyservice.resolveengine.graph.DependencyGraphBuilder] Changed edges for com.android.tools:common:24.2.3(master) selects same versions as previous traversal. ignoring
12:14:37.323 [DEBUG] [org.gradle.api.internal.artifacts.ivyservice.resolveengine.graph.DependencyGraphBuilder] Visiting configuration com.android.tools:sdk-common:24.2.3(compile).
12:14:37.323 [DEBUG] [org.gradle.api.internal.artifacts.ivyservice.resolveengine.graph.DependencyGraphBuilder] Changed edges for com.android.tools:sdk-common:24.2.3(compile) selects same versions as previous traversal. ignoring
12:14:37.323 [DEBUG] [org.gradle.api.internal.artifacts.ivyservice.resolveengine.graph.DependencyGraphBuilder] Visiting configuration com.android.tools:sdk-common:24.2.3(runtime).
12:14:37.323 [DEBUG] [org.gradle.api.internal.artifacts.ivyservice.resolveengine.graph.DependencyGraphBuilder] Changed edges for com.android.tools:sdk-common:24.2.3(runtime) selects same versions as previous traversal. ignoring
12:14:37.323 [DEBUG] [org.gradle.api.internal.artifacts.ivyservice.resolveengine.graph.DependencyGraphBuilder] Visiting configuration com.android.tools:sdk-common:24.2.3(master).
12:14:37.324 [DEBUG] [org.gradle.api.internal.artifacts.ivyservice.resolveengine.graph.DependencyGraphBuilder] Changed edges for com.android.tools:sdk-common:24.2.3(master) selects same versions as previous traversal. ignoring
12:14:37.324 [DEBUG] [org.gradle.api.internal.artifacts.ivyservice.resolveengine.graph.DependencyGraphBuilder] Visiting configuration net.sf.kxml:kxml2:2.3.0(compile).
12:14:37.324 [DEBUG] [org.gradle.api.internal.artifacts.ivyservice.resolveengine.graph.DependencyGraphBuilder] Visiting configuration net.sf.kxml:kxml2:2.3.0(runtime).
12:14:37.324 [DEBUG] [org.gradle.api.internal.artifacts.ivyservice.resolveengine.graph.DependencyGraphBuilder] Visiting configuration net.sf.kxml:kxml2:2.3.0(master).
12:14:37.324 [DEBUG] [org.gradle.api.internal.artifacts.ivyservice.resolveengine.graph.DependencyGraphBuilder] Visiting configuration org.ow2.asm:asm:5.0.3(compile).
12:14:37.325 [DEBUG] [org.gradle.api.internal.artifacts.ivyservice.resolveengine.graph.DependencyGraphBuilder] Changed edges for org.ow2.asm:asm:5.0.3(compile) selects same versions as previous traversal. ignoring
12:14:37.325 [DEBUG] [org.gradle.api.internal.artifacts.ivyservice.resolveengine.graph.DependencyGraphBuilder] Visiting configuration org.ow2.asm:asm:5.0.3(master).
12:14:37.325 [DEBUG] [org.gradle.api.internal.artifacts.ivyservice.resolveengine.graph.DependencyGraphBuilder] Changed edges for org.ow2.asm:asm:5.0.3(master) selects same versions as previous traversal. ignoring
12:14:37.326 [DEBUG] [org.gradle.api.internal.artifacts.ivyservice.resolveengine.graph.DependencyGraphBuilder] Visiting configuration org.ow2.asm:asm:5.0.3(runtime).
12:14:37.326 [DEBUG] [org.gradle.api.internal.artifacts.ivyservice.resolveengine.graph.DependencyGraphBuilder] Changed edges for org.ow2.asm:asm:5.0.3(runtime) selects same versions as previous traversal. ignoring
12:14:37.327 [DEBUG] [org.gradle.api.internal.artifacts.ivyservice.resolveengine.graph.DependencyGraphBuilder] Visiting configuration com.android.tools.lint:lint-api:24.2.3(compile).
12:14:37.327 [DEBUG] [org.gradle.api.internal.artifacts.ivyservice.resolveengine.graph.DependencyGraphBuilder] Visiting configuration com.android.tools.lint:lint-api:24.2.3(runtime).
12:14:37.327 [DEBUG] [org.gradle.api.internal.artifacts.ivyservice.resolveengine.graph.DependencyGraphBuilder] Visiting dependency com.android.tools.lint:lint-api:24.2.3(runtime) -> com.android.tools:sdk-common:24.2.3(dependency: com.android.tools#sdk-common;24.2.3 {runtime=[compile(*), runtime(*), master(*)]})
12:14:37.327 [DEBUG] [org.gradle.api.internal.artifacts.ivyservice.resolveengine.graph.DependencyGraphBuilder] Visiting dependency com.android.tools.lint:lint-api:24.2.3(runtime) -> com.android.tools.build:builder-model:1.2.3(dependency: com.android.tools.build#builder-model;1.2.3 {runtime=[compile(*), runtime(*), master(*)]})
12:14:37.328 [DEBUG] [org.gradle.api.internal.artifacts.ivyservice.resolveengine.graph.DependencyGraphBuilder] Visiting dependency com.android.tools.lint:lint-api:24.2.3(runtime) -> com.android.tools.external.lombok:lombok-ast:0.2.3(dependency: com.android.tools.external.lombok#lombok-ast;0.2.3 {runtime=[compile(*), runtime(*), master(*)]})
12:14:37.329 [DEBUG] [org.gradle.api.internal.artifacts.ivyservice.resolveengine.graph.DependencyGraphBuilder] Selecting new module version com.android.tools.external.lombok:lombok-ast:0.2.3
12:14:37.329 [DEBUG] [org.gradle.api.internal.artifacts.ivyservice.ivyresolve.RepositoryChainDependencyResolver] Attempting to resolve com.android.tools.external.lombok:lombok-ast:0.2.3 using repositories [BintrayJCenter]
12:14:37.333 [DEBUG] [org.gradle.api.internal.artifacts.ivyservice.ivyresolve.parser.IvyXmlModuleDescriptorParser] post 1.3 ivy file: using exact as default matcher
12:14:37.340 [DEBUG] [org.gradle.api.internal.artifacts.ivyservice.ivyresolve.CachingModuleComponentRepository] Using cached module metadata for module 'com.android.tools.external.lombok:lombok-ast:0.2.3' in 'BintrayJCenter'
12:14:37.340 [DEBUG] [org.gradle.api.internal.artifacts.ivyservice.ivyresolve.RepositoryChainDependencyResolver] Using com.android.tools.external.lombok:lombok-ast:0.2.3 from Maven repository 'BintrayJCenter'
12:14:37.341 [DEBUG] [org.gradle.api.internal.artifacts.ivyservice.resolveengine.graph.DependencyGraphBuilder] Visiting dependency com.android.tools.lint:lint-api:24.2.3(runtime) -> org.ow2.asm:asm:5.0.3(dependency: org.ow2.asm#asm;5.0.3 {runtime=[compile(*), runtime(*), master(*)]})
12:14:37.342 [DEBUG] [org.gradle.api.internal.artifacts.ivyservice.resolveengine.graph.DependencyGraphBuilder] Visiting dependency com.android.tools.lint:lint-api:24.2.3(runtime) -> org.ow2.asm:asm-tree:5.0.3(dependency: org.ow2.asm#asm-tree;5.0.3 {runtime=[compile(*), runtime(*), master(*)]})
12:14:37.344 [DEBUG] [org.gradle.api.internal.artifacts.ivyservice.resolveengine.graph.DependencyGraphBuilder] Visiting configuration com.android.tools.lint:lint-api:24.2.3(master).
12:14:37.344 [DEBUG] [org.gradle.api.internal.artifacts.ivyservice.resolveengine.graph.DependencyGraphBuilder] Visiting configuration org.ow2.asm:asm-analysis:5.0.3(compile).
12:14:37.344 [DEBUG] [org.gradle.api.internal.artifacts.ivyservice.resolveengine.graph.DependencyGraphBuilder] Visiting dependency org.ow2.asm:asm-analysis:5.0.3(compile) -> org.ow2.asm:asm-tree:5.0.3(dependency: org.ow2.asm#asm-tree;5.0.3 {compile=[compile(*), master(*)], runtime=[runtime(*)]})
12:14:37.345 [DEBUG] [org.gradle.api.internal.artifacts.ivyservice.resolveengine.graph.DependencyGraphBuilder] Visiting configuration org.ow2.asm:asm-analysis:5.0.3(runtime).
12:14:37.345 [DEBUG] [org.gradle.api.internal.artifacts.ivyservice.resolveengine.graph.DependencyGraphBuilder] Visiting dependency org.ow2.asm:asm-analysis:5.0.3(runtime) -> org.ow2.asm:asm-tree:5.0.3(dependency: org.ow2.asm#asm-tree;5.0.3 {compile=[compile(*), master(*)], runtime=[runtime(*)]})
12:14:37.347 [DEBUG] [org.gradle.api.internal.artifacts.ivyservice.resolveengine.graph.DependencyGraphBuilder] Visiting configuration org.ow2.asm:asm-analysis:5.0.3(master).
12:14:37.347 [DEBUG] [org.gradle.api.internal.artifacts.ivyservice.resolveengine.graph.DependencyGraphBuilder] Visiting configuration org.apache.httpcomponents:httpcore:4.1(compile).
12:14:37.347 [DEBUG] [org.gradle.api.internal.artifacts.ivyservice.resolveengine.graph.DependencyGraphBuilder] Visiting configuration org.apache.httpcomponents:httpcore:4.1(master).
12:14:37.347 [DEBUG] [org.gradle.api.internal.artifacts.ivyservice.resolveengine.graph.DependencyGraphBuilder] Visiting configuration commons-logging:commons-logging:1.1.1(compile).
12:14:37.348 [DEBUG] [org.gradle.api.internal.artifacts.ivyservice.resolveengine.graph.DependencyGraphBuilder] Visiting configuration commons-logging:commons-logging:1.1.1(master).
12:14:37.348 [DEBUG] [org.gradle.api.internal.artifacts.ivyservice.resolveengine.graph.DependencyGraphBuilder] Visiting configuration commons-codec:commons-codec:1.4(compile).
12:14:37.348 [DEBUG] [org.gradle.api.internal.artifacts.ivyservice.resolveengine.graph.DependencyGraphBuilder] Visiting configuration commons-codec:commons-codec:1.4(master).
12:14:37.348 [DEBUG] [org.gradle.api.internal.artifacts.ivyservice.resolveengine.graph.DependencyGraphBuilder] Visiting configuration org.apache.httpcomponents:httpcore:4.1(runtime).
12:14:37.349 [DEBUG] [org.gradle.api.internal.artifacts.ivyservice.resolveengine.graph.DependencyGraphBuilder] Visiting configuration commons-logging:commons-logging:1.1.1(runtime).
12:14:37.349 [DEBUG] [org.gradle.api.internal.artifacts.ivyservice.resolveengine.graph.DependencyGraphBuilder] Visiting configuration commons-codec:commons-codec:1.4(runtime).
12:14:37.349 [DEBUG] [org.gradle.api.internal.artifacts.ivyservice.resolveengine.graph.DependencyGraphBuilder] Visiting configuration com.android.tools:sdk-common:24.2.3(compile).
12:14:37.349 [DEBUG] [org.gradle.api.internal.artifacts.ivyservice.resolveengine.graph.DependencyGraphBuilder] Changed edges for com.android.tools:sdk-common:24.2.3(compile) selects same versions as previous traversal. ignoring
12:14:37.349 [DEBUG] [org.gradle.api.internal.artifacts.ivyservice.resolveengine.graph.DependencyGraphBuilder] Visiting configuration com.android.tools:sdk-common:24.2.3(runtime).
12:14:37.350 [DEBUG] [org.gradle.api.internal.artifacts.ivyservice.resolveengine.graph.DependencyGraphBuilder] Changed edges for com.android.tools:sdk-common:24.2.3(runtime) selects same versions as previous traversal. ignoring
12:14:37.350 [DEBUG] [org.gradle.api.internal.artifacts.ivyservice.resolveengine.graph.DependencyGraphBuilder] Visiting configuration com.android.tools:sdk-common:24.2.3(master).
12:14:37.350 [DEBUG] [org.gradle.api.internal.artifacts.ivyservice.resolveengine.graph.DependencyGraphBuilder] Changed edges for com.android.tools:sdk-common:24.2.3(master) selects same versions as previous traversal. ignoring
12:14:37.350 [DEBUG] [org.gradle.api.internal.artifacts.ivyservice.resolveengine.graph.DependencyGraphBuilder] Visiting configuration com.android.tools.build:builder-model:1.2.3(compile).
12:14:37.350 [DEBUG] [org.gradle.api.internal.artifacts.ivyservice.resolveengine.graph.DependencyGraphBuilder] Changed edges for com.android.tools.build:builder-model:1.2.3(compile) selects same versions as previous traversal. ignoring
12:14:37.351 [DEBUG] [org.gradle.api.internal.artifacts.ivyservice.resolveengine.graph.DependencyGraphBuilder] Visiting configuration com.android.tools.build:builder-model:1.2.3(runtime).
12:14:37.351 [DEBUG] [org.gradle.api.internal.artifacts.ivyservice.resolveengine.graph.DependencyGraphBuilder] Changed edges for com.android.tools.build:builder-model:1.2.3(runtime) selects same versions as previous traversal. ignoring
12:14:37.351 [DEBUG] [org.gradle.api.internal.artifacts.ivyservice.resolveengine.graph.DependencyGraphBuilder] Visiting configuration com.android.tools.build:builder-model:1.2.3(master).
12:14:37.351 [DEBUG] [org.gradle.api.internal.artifacts.ivyservice.resolveengine.graph.DependencyGraphBuilder] Changed edges for com.android.tools.build:builder-model:1.2.3(master) selects same versions as previous traversal. ignoring
12:14:37.351 [DEBUG] [org.gradle.api.internal.artifacts.ivyservice.resolveengine.graph.DependencyGraphBuilder] Visiting configuration com.android.tools.external.lombok:lombok-ast:0.2.3(compile).
12:14:37.352 [DEBUG] [org.gradle.api.internal.artifacts.ivyservice.resolveengine.graph.DependencyGraphBuilder] Visiting dependency com.android.tools.external.lombok:lombok-ast:0.2.3(compile) -> com.google.guava:guava:17.0(dependency: com.google.guava#guava;17.0 {compile=[compile(*), master(*)], runtime=[runtime(*)]})
12:14:37.354 [DEBUG] [org.gradle.api.internal.artifacts.ivyservice.resolveengine.graph.DependencyGraphBuilder] Visiting configuration com.android.tools.external.lombok:lombok-ast:0.2.3(runtime).
12:14:37.354 [DEBUG] [org.gradle.api.internal.artifacts.ivyservice.resolveengine.graph.DependencyGraphBuilder] Visiting dependency com.android.tools.external.lombok:lombok-ast:0.2.3(runtime) -> com.google.guava:guava:17.0(dependency: com.google.guava#guava;17.0 {compile=[compile(*), master(*)], runtime=[runtime(*)]})
12:14:37.356 [DEBUG] [org.gradle.api.internal.artifacts.ivyservice.resolveengine.graph.DependencyGraphBuilder] Visiting configuration com.android.tools.external.lombok:lombok-ast:0.2.3(master).
12:14:37.356 [DEBUG] [org.gradle.api.internal.artifacts.ivyservice.resolveengine.graph.DependencyGraphBuilder] Visiting configuration org.ow2.asm:asm:5.0.3(compile).
12:14:37.356 [DEBUG] [org.gradle.api.internal.artifacts.ivyservice.resolveengine.graph.DependencyGraphBuilder] Changed edges for org.ow2.asm:asm:5.0.3(compile) selects same versions as previous traversal. ignoring
12:14:37.356 [DEBUG] [org.gradle.api.internal.artifacts.ivyservice.resolveengine.graph.DependencyGraphBuilder] Visiting configuration org.ow2.asm:asm:5.0.3(runtime).
12:14:37.356 [DEBUG] [org.gradle.api.internal.artifacts.ivyservice.resolveengine.graph.DependencyGraphBuilder] Changed edges for org.ow2.asm:asm:5.0.3(runtime) selects same versions as previous traversal. ignoring
12:14:37.356 [DEBUG] [org.gradle.api.internal.artifacts.ivyservice.resolveengine.graph.DependencyGraphBuilder] Visiting configuration org.ow2.asm:asm:5.0.3(master).
12:14:37.357 [DEBUG] [org.gradle.api.internal.artifacts.ivyservice.resolveengine.graph.DependencyGraphBuilder] Changed edges for org.ow2.asm:asm:5.0.3(master) selects same versions as previous traversal. ignoring
12:14:37.357 [DEBUG] [org.gradle.api.internal.artifacts.ivyservice.resolveengine.graph.DependencyGraphBuilder] Visiting configuration org.ow2.asm:asm-tree:5.0.3(compile).
12:14:37.357 [DEBUG] [org.gradle.api.internal.artifacts.ivyservice.resolveengine.graph.DependencyGraphBuilder] Changed edges for org.ow2.asm:asm-tree:5.0.3(compile) selects same versions as previous traversal. ignoring
12:14:37.357 [DEBUG] [org.gradle.api.internal.artifacts.ivyservice.resolveengine.graph.DependencyGraphBuilder] Visiting configuration org.ow2.asm:asm-tree:5.0.3(runtime).
12:14:37.358 [DEBUG] [org.gradle.api.internal.artifacts.ivyservice.resolveengine.graph.DependencyGraphBuilder] Changed edges for org.ow2.asm:asm-tree:5.0.3(runtime) selects same versions as previous traversal. ignoring
12:14:37.362 [DEBUG] [org.gradle.api.internal.artifacts.ivyservice.resolveengine.graph.DependencyGraphBuilder] Visiting configuration org.ow2.asm:asm-tree:5.0.3(master).
12:14:37.364 [DEBUG] [org.gradle.api.internal.artifacts.ivyservice.resolveengine.graph.DependencyGraphBuilder] Changed edges for org.ow2.asm:asm-tree:5.0.3(master) selects same versions as previous traversal. ignoring
12:14:37.364 [DEBUG] [org.gradle.api.internal.artifacts.ivyservice.resolveengine.graph.DependencyGraphBuilder] Visiting configuration com.google.guava:guava:17.0(compile).
12:14:37.375 [DEBUG] [org.gradle.api.internal.artifacts.ivyservice.resolveengine.graph.DependencyGraphBuilder] Changed edges for com.google.guava:guava:17.0(compile) selects same versions as previous traversal. ignoring
12:14:37.375 [DEBUG] [org.gradle.api.internal.artifacts.ivyservice.resolveengine.graph.DependencyGraphBuilder] Visiting configuration com.google.guava:guava:17.0(master).
12:14:37.375 [DEBUG] [org.gradle.api.internal.artifacts.ivyservice.resolveengine.graph.DependencyGraphBuilder] Changed edges for com.google.guava:guava:17.0(master) selects same versions as previous traversal. ignoring
12:14:37.375 [DEBUG] [org.gradle.api.internal.artifacts.ivyservice.resolveengine.graph.DependencyGraphBuilder] Visiting configuration com.google.guava:guava:17.0(runtime).
12:14:37.375 [DEBUG] [org.gradle.api.internal.artifacts.ivyservice.resolveengine.graph.DependencyGraphBuilder] Changed edges for com.google.guava:guava:17.0(runtime) selects same versions as previous traversal. ignoring
12:14:37.381 [DEBUG] [org.gradle.api.internal.artifacts.ivyservice.resolveengine.graph.ResolvedConfigurationDependencyGraphVisitor] Attaching :AndroidN-ify:unspecified(classpath) to its parents.
12:14:37.383 [DEBUG] [org.gradle.api.internal.artifacts.ivyservice.resolveengine.graph.ResolvedConfigurationDependencyGraphVisitor] Attaching com.android.tools.build:gradle:1.2.3(default) to its parents.
12:14:37.391 [DEBUG] [org.gradle.api.internal.artifacts.ivyservice.resolveengine.graph.ResolvedConfigurationDependencyGraphVisitor] Attaching com.android.tools.build:gradle-core:1.2.3(compile) to its parents.
12:14:37.392 [DEBUG] [org.gradle.api.internal.artifacts.ivyservice.resolveengine.graph.ResolvedConfigurationDependencyGraphVisitor] Attaching com.android.tools.build:gradle-core:1.2.3(runtime) to its parents.
12:14:37.392 [DEBUG] [org.gradle.api.internal.artifacts.ivyservice.resolveengine.graph.ResolvedConfigurationDependencyGraphVisitor] Attaching com.android.tools.build:gradle-core:1.2.3(master) to its parents.
12:14:37.393 [DEBUG] [org.gradle.api.internal.artifacts.ivyservice.resolveengine.graph.ResolvedConfigurationDependencyGraphVisitor] Attaching com.android.tools.build:builder:1.2.3(compile) to its parents.
12:14:37.393 [DEBUG] [org.gradle.api.internal.artifacts.ivyservice.resolveengine.graph.ResolvedConfigurationDependencyGraphVisitor] Attaching com.android.tools.build:builder:1.2.3(runtime) to its parents.
12:14:37.394 [DEBUG] [org.gradle.api.internal.artifacts.ivyservice.resolveengine.graph.ResolvedConfigurationDependencyGraphVisitor] Attaching com.android.tools.build:builder:1.2.3(master) to its parents.
12:14:37.394 [DEBUG] [org.gradle.api.internal.artifacts.ivyservice.resolveengine.graph.ResolvedConfigurationDependencyGraphVisitor] Attaching com.android.tools.lint:lint:24.2.3(compile) to its parents.
12:14:37.394 [DEBUG] [org.gradle.api.internal.artifacts.ivyservice.resolveengine.graph.ResolvedConfigurationDependencyGraphVisitor] Attaching com.android.tools.lint:lint:24.2.3(runtime) to its parents.
12:14:37.395 [DEBUG] [org.gradle.api.internal.artifacts.ivyservice.resolveengine.graph.ResolvedConfigurationDependencyGraphVisitor] Attaching com.android.tools.lint:lint:24.2.3(master) to its parents.
12:14:37.395 [DEBUG] [org.gradle.api.internal.artifacts.ivyservice.resolveengine.graph.ResolvedConfigurationDependencyGraphVisitor] Attaching net.sf.proguard:proguard-gradle:5.1(compile) to its parents.
12:14:37.396 [DEBUG] [org.gradle.api.internal.artifacts.ivyservice.resolveengine.graph.ResolvedConfigurationDependencyGraphVisitor] Attaching net.sf.proguard:proguard-gradle:5.1(runtime) to its parents.
12:14:37.396 [DEBUG] [org.gradle.api.internal.artifacts.ivyservice.resolveengine.graph.ResolvedConfigurationDependencyGraphVisitor] Attaching net.sf.proguard:proguard-gradle:5.1(master) to its parents.
12:14:37.397 [DEBUG] [org.gradle.api.internal.artifacts.ivyservice.resolveengine.graph.ResolvedConfigurationDependencyGraphVisitor] Attaching com.android.tools.build:builder-model:1.2.3(compile) to its parents.
12:14:37.397 [DEBUG] [org.gradle.api.internal.artifacts.ivyservice.resolveengine.graph.ResolvedConfigurationDependencyGraphVisitor] Attaching com.android.tools.build:builder-model:1.2.3(runtime) to its parents.
12:14:37.397 [DEBUG] [org.gradle.api.internal.artifacts.ivyservice.resolveengine.graph.ResolvedConfigurationDependencyGraphVisitor] Attaching com.android.tools.build:builder-model:1.2.3(master) to its parents.
12:14:37.398 [DEBUG] [org.gradle.api.internal.artifacts.ivyservice.resolveengine.graph.ResolvedConfigurationDependencyGraphVisitor] Attaching com.android.tools.build:builder-test-api:1.2.3(compile) to its parents.
12:14:37.398 [DEBUG] [org.gradle.api.internal.artifacts.ivyservice.resolveengine.graph.ResolvedConfigurationDependencyGraphVisitor] Attaching com.android.tools.build:builder-test-api:1.2.3(runtime) to its parents.
12:14:37.399 [DEBUG] [org.gradle.api.internal.artifacts.ivyservice.resolveengine.graph.ResolvedConfigurationDependencyGraphVisitor] Attaching com.android.tools.build:builder-test-api:1.2.3(master) to its parents.
12:14:37.399 [DEBUG] [org.gradle.api.internal.artifacts.ivyservice.resolveengine.graph.ResolvedConfigurationDependencyGraphVisitor] Attaching com.android.tools:sdklib:24.2.3(compile) to its parents.
12:14:37.399 [DEBUG] [org.gradle.api.internal.artifacts.ivyservice.resolveengine.graph.ResolvedConfigurationDependencyGraphVisitor] Attaching com.android.tools:sdklib:24.2.3(runtime) to its parents.
12:14:37.400 [DEBUG] [org.gradle.api.internal.artifacts.ivyservice.resolveengine.graph.ResolvedConfigurationDependencyGraphVisitor] Attaching com.android.tools:sdklib:24.2.3(master) to its parents.
12:14:37.400 [DEBUG] [org.gradle.api.internal.artifacts.ivyservice.resolveengine.graph.ResolvedConfigurationDependencyGraphVisitor] Attaching com.android.tools:sdk-common:24.2.3(compile) to its parents.
12:14:37.401 [DEBUG] [org.gradle.api.internal.artifacts.ivyservice.resolveengine.graph.ResolvedConfigurationDependencyGraphVisitor] Attaching com.android.tools:sdk-common:24.2.3(runtime) to its parents.
12:14:37.401 [DEBUG] [org.gradle.api.internal.artifacts.ivyservice.resolveengine.graph.ResolvedConfigurationDependencyGraphVisitor] Attaching com.android.tools:sdk-common:24.2.3(master) to its parents.
12:14:37.401 [DEBUG] [org.gradle.api.internal.artifacts.ivyservice.resolveengine.graph.ResolvedConfigurationDependencyGraphVisitor] Attaching com.android.tools:common:24.2.3(compile) to its parents.
12:14:37.402 [DEBUG] [org.gradle.api.internal.artifacts.ivyservice.resolveengine.graph.ResolvedConfigurationDependencyGraphVisitor] Attaching com.android.tools:common:24.2.3(runtime) to its parents.
12:14:37.402 [DEBUG] [org.gradle.api.internal.artifacts.ivyservice.resolveengine.graph.ResolvedConfigurationDependencyGraphVisitor] Attaching com.android.tools:common:24.2.3(master) to its parents.
12:14:37.403 [DEBUG] [org.gradle.api.internal.artifacts.ivyservice.resolveengine.graph.ResolvedConfigurationDependencyGraphVisitor] Attaching com.android.tools.build:manifest-merger:24.2.3(compile) to its parents.
12:14:37.403 [DEBUG] [org.gradle.api.internal.artifacts.ivyservice.resolveengine.graph.ResolvedConfigurationDependencyGraphVisitor] Attaching com.android.tools.build:manifest-merger:24.2.3(runtime) to its parents.
12:14:37.403 [DEBUG] [org.gradle.api.internal.artifacts.ivyservice.resolveengine.graph.ResolvedConfigurationDependencyGraphVisitor] Attaching com.android.tools.build:manifest-merger:24.2.3(master) to its parents.
12:14:37.404 [DEBUG] [org.gradle.api.internal.artifacts.ivyservice.resolveengine.graph.ResolvedConfigurationDependencyGraphVisitor] Attaching com.android.tools.ddms:ddmlib:24.2.3(compile) to its parents.
12:14:37.404 [DEBUG] [org.gradle.api.internal.artifacts.ivyservice.resolveengine.graph.ResolvedConfigurationDependencyGraphVisitor] Attaching com.android.tools.ddms:ddmlib:24.2.3(runtime) to its parents.
12:14:37.404 [DEBUG] [org.gradle.api.internal.artifacts.ivyservice.resolveengine.graph.ResolvedConfigurationDependencyGraphVisitor] Attaching com.android.tools.ddms:ddmlib:24.2.3(master) to its parents.
12:14:37.405 [DEBUG] [org.gradle.api.internal.artifacts.ivyservice.resolveengine.graph.ResolvedConfigurationDependencyGraphVisitor] Attaching com.squareup:javawriter:2.5.0(compile) to its parents.
12:14:37.406 [DEBUG] [org.gradle.api.internal.artifacts.ivyservice.resolveengine.graph.ResolvedConfigurationDependencyGraphVisitor] Attaching com.squareup:javawriter:2.5.0(runtime) to its parents.
12:14:37.406 [DEBUG] [org.gradle.api.internal.artifacts.ivyservice.resolveengine.graph.ResolvedConfigurationDependencyGraphVisitor] Attaching com.squareup:javawriter:2.5.0(master) to its parents.
12:14:37.407 [DEBUG] [org.gradle.api.internal.artifacts.ivyservice.resolveengine.graph.ResolvedConfigurationDependencyGraphVisitor] Attaching org.bouncycastle:bcpkix-jdk15on:1.48(compile) to its parents.
12:14:37.407 [DEBUG] [org.gradle.api.internal.artifacts.ivyservice.resolveengine.graph.ResolvedConfigurationDependencyGraphVisitor] Attaching org.bouncycastle:bcpkix-jdk15on:1.48(runtime) to its parents.
12:14:37.408 [DEBUG] [org.gradle.api.internal.artifacts.ivyservice.resolveengine.graph.ResolvedConfigurationDependencyGraphVisitor] Attaching org.bouncycastle:bcpkix-jdk15on:1.48(master) to its parents.
12:14:37.409 [DEBUG] [org.gradle.api.internal.artifacts.ivyservice.resolveengine.graph.ResolvedConfigurationDependencyGraphVisitor] Attaching org.bouncycastle:bcprov-jdk15on:1.48(compile) to its parents.
12:14:37.409 [DEBUG] [org.gradle.api.internal.artifacts.ivyservice.resolveengine.graph.ResolvedConfigurationDependencyGraphVisitor] Attaching org.bouncycastle:bcprov-jdk15on:1.48(runtime) to its parents.
12:14:37.410 [DEBUG] [org.gradle.api.internal.artifacts.ivyservice.resolveengine.graph.ResolvedConfigurationDependencyGraphVisitor] Attaching org.bouncycastle:bcprov-jdk15on:1.48(master) to its parents.
12:14:37.411 [DEBUG] [org.gradle.api.internal.artifacts.ivyservice.resolveengine.graph.ResolvedConfigurationDependencyGraphVisitor] Attaching org.ow2.asm:asm:5.0.3(compile) to its parents.
12:14:37.411 [DEBUG] [org.gradle.api.internal.artifacts.ivyservice.resolveengine.graph.ResolvedConfigurationDependencyGraphVisitor] Attaching org.ow2.asm:asm:5.0.3(runtime) to its parents.
12:14:37.411 [DEBUG] [org.gradle.api.internal.artifacts.ivyservice.resolveengine.graph.ResolvedConfigurationDependencyGraphVisitor] Attaching org.ow2.asm:asm:5.0.3(master) to its parents.
12:14:37.412 [DEBUG] [org.gradle.api.internal.artifacts.ivyservice.resolveengine.graph.ResolvedConfigurationDependencyGraphVisitor] Attaching org.ow2.asm:asm-tree:5.0.3(compile) to its parents.
12:14:37.413 [DEBUG] [org.gradle.api.internal.artifacts.ivyservice.resolveengine.graph.ResolvedConfigurationDependencyGraphVisitor] Attaching org.ow2.asm:asm-tree:5.0.3(runtime) to its parents.
12:14:37.413 [DEBUG] [org.gradle.api.internal.artifacts.ivyservice.resolveengine.graph.ResolvedConfigurationDependencyGraphVisitor] Attaching org.ow2.asm:asm-tree:5.0.3(master) to its parents.
12:14:37.413 [DEBUG] [org.gradle.api.internal.artifacts.ivyservice.resolveengine.graph.ResolvedConfigurationDependencyGraphVisitor] Attaching com.google.code.gson:gson:2.2.4(compile) to its parents.
12:14:37.414 [DEBUG] [org.gradle.api.internal.artifacts.ivyservice.resolveengine.graph.ResolvedConfigurationDependencyGraphVisitor] Attaching com.google.code.gson:gson:2.2.4(runtime) to its parents.
12:14:37.414 [DEBUG] [org.gradle.api.internal.artifacts.ivyservice.resolveengine.graph.ResolvedConfigurationDependencyGraphVisitor] Attaching com.google.code.gson:gson:2.2.4(master) to its parents.
12:14:37.414 [DEBUG] [org.gradle.api.internal.artifacts.ivyservice.resolveengine.graph.ResolvedConfigurationDependencyGraphVisitor] Attaching com.android.tools.lint:lint-checks:24.2.3(compile) to its parents.
12:14:37.415 [DEBUG] [org.gradle.api.internal.artifacts.ivyservice.resolveengine.graph.ResolvedConfigurationDependencyGraphVisitor] Attaching com.android.tools.lint:lint-checks:24.2.3(runtime) to its parents.
12:14:37.415 [DEBUG] [org.gradle.api.internal.artifacts.ivyservice.resolveengine.graph.ResolvedConfigurationDependencyGraphVisitor] Attaching com.android.tools.lint:lint-checks:24.2.3(master) to its parents.
12:14:37.415 [DEBUG] [org.gradle.api.internal.artifacts.ivyservice.resolveengine.graph.ResolvedConfigurationDependencyGraphVisitor] Attaching org.eclipse.jdt.core.compiler:ecj:4.4(compile) to its parents.
12:14:37.415 [DEBUG] [org.gradle.api.internal.artifacts.ivyservice.resolveengine.graph.ResolvedConfigurationDependencyGraphVisitor] Attaching org.eclipse.jdt.core.compiler:ecj:4.4(runtime) to its parents.
12:14:37.416 [DEBUG] [org.gradle.api.internal.artifacts.ivyservice.resolveengine.graph.ResolvedConfigurationDependencyGraphVisitor] Attaching org.eclipse.jdt.core.compiler:ecj:4.4(master) to its parents.
12:14:37.416 [DEBUG] [org.gradle.api.internal.artifacts.ivyservice.resolveengine.graph.ResolvedConfigurationDependencyGraphVisitor] Attaching net.sf.proguard:proguard-base:5.1(compile) to its parents.
12:14:37.417 [DEBUG] [org.gradle.api.internal.artifacts.ivyservice.resolveengine.graph.ResolvedConfigurationDependencyGraphVisitor] Attaching net.sf.proguard:proguard-base:5.1(master) to its parents.
12:14:37.417 [DEBUG] [org.gradle.api.internal.artifacts.ivyservice.resolveengine.graph.ResolvedConfigurationDependencyGraphVisitor] Attaching net.sf.proguard:proguard-base:5.1(runtime) to its parents.
12:14:37.417 [DEBUG] [org.gradle.api.internal.artifacts.ivyservice.resolveengine.graph.ResolvedConfigurationDependencyGraphVisitor] Attaching com.android.tools:annotations:24.2.3(compile) to its parents.
12:14:37.418 [DEBUG] [org.gradle.api.internal.artifacts.ivyservice.resolveengine.graph.ResolvedConfigurationDependencyGraphVisitor] Attaching com.android.tools:annotations:24.2.3(runtime) to its parents.
12:14:37.418 [DEBUG] [org.gradle.api.internal.artifacts.ivyservice.resolveengine.graph.ResolvedConfigurationDependencyGraphVisitor] Attaching com.android.tools:annotations:24.2.3(master) to its parents.
12:14:37.419 [DEBUG] [org.gradle.api.internal.artifacts.ivyservice.resolveengine.graph.ResolvedConfigurationDependencyGraphVisitor] Attaching com.android.tools.layoutlib:layoutlib-api:24.2.3(compile) to its parents.
12:14:37.419 [DEBUG] [org.gradle.api.internal.artifacts.ivyservice.resolveengine.graph.ResolvedConfigurationDependencyGraphVisitor] Attaching com.android.tools.layoutlib:layoutlib-api:24.2.3(runtime) to its parents.
12:14:37.421 [DEBUG] [org.gradle.api.internal.artifacts.ivyservice.resolveengine.graph.ResolvedConfigurationDependencyGraphVisitor] Attaching com.android.tools.layoutlib:layoutlib-api:24.2.3(master) to its parents.
12:14:37.421 [DEBUG] [org.gradle.api.internal.artifacts.ivyservice.resolveengine.graph.ResolvedConfigurationDependencyGraphVisitor] Attaching com.android.tools:dvlib:24.2.3(compile) to its parents.
12:14:37.421 [DEBUG] [org.gradle.api.internal.artifacts.ivyservice.resolveengine.graph.ResolvedConfigurationDependencyGraphVisitor] Attaching com.android.tools:dvlib:24.2.3(runtime) to its parents.
12:14:37.422 [DEBUG] [org.gradle.api.internal.artifacts.ivyservice.resolveengine.graph.ResolvedConfigurationDependencyGraphVisitor] Attaching com.android.tools:dvlib:24.2.3(master) to its parents.
12:14:37.422 [DEBUG] [org.gradle.api.internal.artifacts.ivyservice.resolveengine.graph.ResolvedConfigurationDependencyGraphVisitor] Attaching org.apache.commons:commons-compress:1.8.1(compile) to its parents.
12:14:37.423 [DEBUG] [org.gradle.api.internal.artifacts.ivyservice.resolveengine.graph.ResolvedConfigurationDependencyGraphVisitor] Attaching org.apache.commons:commons-compress:1.8.1(runtime) to its parents.
12:14:37.423 [DEBUG] [org.gradle.api.internal.artifacts.ivyservice.resolveengine.graph.ResolvedConfigurationDependencyGraphVisitor] Attaching org.apache.commons:commons-compress:1.8.1(master) to its parents.
12:14:37.423 [DEBUG] [org.gradle.api.internal.artifacts.ivyservice.resolveengine.graph.ResolvedConfigurationDependencyGraphVisitor] Attaching org.apache.httpcomponents:httpclient:4.1.1(compile) to its parents.
12:14:37.424 [DEBUG] [org.gradle.api.internal.artifacts.ivyservice.resolveengine.graph.ResolvedConfigurationDependencyGraphVisitor] Attaching org.apache.httpcomponents:httpclient:4.1.1(runtime) to its parents.
12:14:37.425 [DEBUG] [org.gradle.api.internal.artifacts.ivyservice.resolveengine.graph.ResolvedConfigurationDependencyGraphVisitor] Attaching org.apache.httpcomponents:httpclient:4.1.1(master) to its parents.
12:14:37.429 [DEBUG] [org.gradle.api.internal.artifacts.ivyservice.resolveengine.graph.ResolvedConfigurationDependencyGraphVisitor] Attaching org.apache.httpcomponents:httpmime:4.1(compile) to its parents.
12:14:37.433 [DEBUG] [org.gradle.api.internal.artifacts.ivyservice.resolveengine.graph.ResolvedConfigurationDependencyGraphVisitor] Attaching org.apache.httpcomponents:httpmime:4.1(runtime) to its parents.
12:14:37.434 [DEBUG] [org.gradle.api.internal.artifacts.ivyservice.resolveengine.graph.ResolvedConfigurationDependencyGraphVisitor] Attaching org.apache.httpcomponents:httpmime:4.1(master) to its parents.
12:14:37.435 [DEBUG] [org.gradle.api.internal.artifacts.ivyservice.resolveengine.graph.ResolvedConfigurationDependencyGraphVisitor] Attaching com.google.guava:guava:17.0(compile) to its parents.
12:14:37.435 [DEBUG] [org.gradle.api.internal.artifacts.ivyservice.resolveengine.graph.ResolvedConfigurationDependencyGraphVisitor] Attaching com.google.guava:guava:17.0(runtime) to its parents.
12:14:37.436 [DEBUG] [org.gradle.api.internal.artifacts.ivyservice.resolveengine.graph.ResolvedConfigurationDependencyGraphVisitor] Attaching com.google.guava:guava:17.0(master) to its parents.
12:14:37.437 [DEBUG] [org.gradle.api.internal.artifacts.ivyservice.resolveengine.graph.ResolvedConfigurationDependencyGraphVisitor] Attaching net.sf.kxml:kxml2:2.3.0(compile) to its parents.
12:14:37.437 [DEBUG] [org.gradle.api.internal.artifacts.ivyservice.resolveengine.graph.ResolvedConfigurationDependencyGraphVisitor] Attaching net.sf.kxml:kxml2:2.3.0(runtime) to its parents.
12:14:37.437 [DEBUG] [org.gradle.api.internal.artifacts.ivyservice.resolveengine.graph.ResolvedConfigurationDependencyGraphVisitor] Attaching net.sf.kxml:kxml2:2.3.0(master) to its parents.
12:14:37.439 [DEBUG] [org.gradle.api.internal.artifacts.ivyservice.resolveengine.graph.ResolvedConfigurationDependencyGraphVisitor] Attaching com.android.tools.lint:lint-api:24.2.3(compile) to its parents.
12:14:37.440 [DEBUG] [org.gradle.api.internal.artifacts.ivyservice.resolveengine.graph.ResolvedConfigurationDependencyGraphVisitor] Attaching com.android.tools.lint:lint-api:24.2.3(runtime) to its parents.
12:14:37.440 [DEBUG] [org.gradle.api.internal.artifacts.ivyservice.resolveengine.graph.ResolvedConfigurationDependencyGraphVisitor] Attaching com.android.tools.lint:lint-api:24.2.3(master) to its parents.
12:14:37.440 [DEBUG] [org.gradle.api.internal.artifacts.ivyservice.resolveengine.graph.ResolvedConfigurationDependencyGraphVisitor] Attaching org.ow2.asm:asm-analysis:5.0.3(compile) to its parents.
12:14:37.441 [DEBUG] [org.gradle.api.internal.artifacts.ivyservice.resolveengine.graph.ResolvedConfigurationDependencyGraphVisitor] Attaching org.ow2.asm:asm-analysis:5.0.3(runtime) to its parents.
12:14:37.441 [DEBUG] [org.gradle.api.internal.artifacts.ivyservice.resolveengine.graph.ResolvedConfigurationDependencyGraphVisitor] Attaching org.ow2.asm:asm-analysis:5.0.3(master) to its parents.
12:14:37.441 [DEBUG] [org.gradle.api.internal.artifacts.ivyservice.resolveengine.graph.ResolvedConfigurationDependencyGraphVisitor] Attaching org.apache.httpcomponents:httpcore:4.1(compile) to its parents.
12:14:37.442 [DEBUG] [org.gradle.api.internal.artifacts.ivyservice.resolveengine.graph.ResolvedConfigurationDependencyGraphVisitor] Attaching org.apache.httpcomponents:httpcore:4.1(master) to its parents.
12:14:37.442 [DEBUG] [org.gradle.api.internal.artifacts.ivyservice.resolveengine.graph.ResolvedConfigurationDependencyGraphVisitor] Attaching commons-logging:commons-logging:1.1.1(compile) to its parents.
12:14:37.443 [DEBUG] [org.gradle.api.internal.artifacts.ivyservice.resolveengine.graph.ResolvedConfigurationDependencyGraphVisitor] Attaching commons-logging:commons-logging:1.1.1(master) to its parents.
12:14:37.443 [DEBUG] [org.gradle.api.internal.artifacts.ivyservice.resolveengine.graph.ResolvedConfigurationDependencyGraphVisitor] Attaching commons-codec:commons-codec:1.4(compile) to its parents.
12:14:37.443 [DEBUG] [org.gradle.api.internal.artifacts.ivyservice.resolveengine.graph.ResolvedConfigurationDependencyGraphVisitor] Attaching commons-codec:commons-codec:1.4(master) to its parents.
12:14:37.443 [DEBUG] [org.gradle.api.internal.artifacts.ivyservice.resolveengine.graph.ResolvedConfigurationDependencyGraphVisitor] Attaching org.apache.httpcomponents:httpcore:4.1(runtime) to its parents.
12:14:37.444 [DEBUG] [org.gradle.api.internal.artifacts.ivyservice.resolveengine.graph.ResolvedConfigurationDependencyGraphVisitor] Attaching commons-logging:commons-logging:1.1.1(runtime) to its parents.
12:14:37.444 [DEBUG] [org.gradle.api.internal.artifacts.ivyservice.resolveengine.graph.ResolvedConfigurationDependencyGraphVisitor] Attaching commons-codec:commons-codec:1.4(runtime) to its parents.
12:14:37.444 [DEBUG] [org.gradle.api.internal.artifacts.ivyservice.resolveengine.graph.ResolvedConfigurationDependencyGraphVisitor] Attaching com.android.tools.external.lombok:lombok-ast:0.2.3(compile) to its parents.
12:14:37.445 [DEBUG] [org.gradle.api.internal.artifacts.ivyservice.resolveengine.graph.ResolvedConfigurationDependencyGraphVisitor] Attaching com.android.tools.external.lombok:lombok-ast:0.2.3(runtime) to its parents.
12:14:37.445 [DEBUG] [org.gradle.api.internal.artifacts.ivyservice.resolveengine.graph.ResolvedConfigurationDependencyGraphVisitor] Attaching com.android.tools.external.lombok:lombok-ast:0.2.3(master) to its parents.
12:14:37.446 [DEBUG] [org.gradle.api.internal.artifacts.ivyservice.resolveengine.oldresult.TransientConfigurationResultsBuilder] Flushing resolved configuration data in Binary store in /tmp/gradle5638561761381274998.bin. Wrote root :AndroidN-ify:unspecified:classpath.
12:14:37.457 [DEBUG] [org.gradle.cache.internal.btree.BTreePersistentIndexedCache] Opening cache artifact-at-repository.bin (/home/josh/.gradle/caches/modules-2/metadata-2.14/artifact-at-repository.bin)
12:14:37.461 [DEBUG] [org.gradle.api.internal.artifacts.ivyservice.ivyresolve.CachingModuleComponentRepository] Found artifact 'gradle.jar (com.android.tools.build:gradle:1.2.3)' in resolver cache: /home/josh/.gradle/caches/modules-2/files-2.1/com.android.tools.build/gradle/1.2.3/2fc5a2f1ac2e86c5c4bb57241330198b2355e621/gradle-1.2.3.jar
12:14:37.461 [DEBUG] [org.gradle.api.internal.artifacts.ivyservice.ivyresolve.CachingModuleComponentRepository] Found artifact 'gradle-core.jar (com.android.tools.build:gradle-core:1.2.3)' in resolver cache: /home/josh/.gradle/caches/modules-2/files-2.1/com.android.tools.build/gradle-core/1.2.3/4a448f6ea508a2b547a3fea4033d2b68d287a188/gradle-core-1.2.3.jar
12:14:37.462 [DEBUG] [org.gradle.api.internal.artifacts.ivyservice.ivyresolve.CachingModuleComponentRepository] Found artifact 'builder.jar (com.android.tools.build:builder:1.2.3)' in resolver cache: /home/josh/.gradle/caches/modules-2/files-2.1/com.android.tools.build/builder/1.2.3/4530e2d560877a7a514b63500e7263c973ee2413/builder-1.2.3.jar
12:14:37.463 [DEBUG] [org.gradle.api.internal.artifacts.ivyservice.ivyresolve.CachingModuleComponentRepository] Found artifact 'lint.jar (com.android.tools.lint:lint:24.2.3)' in resolver cache: /home/josh/.gradle/caches/modules-2/files-2.1/com.android.tools.lint/lint/24.2.3/3b2976b2b1b2e8cb13cb2224da81f624081db38a/lint-24.2.3.jar
12:14:37.464 [DEBUG] [org.gradle.api.internal.artifacts.ivyservice.ivyresolve.CachingModuleComponentRepository] Found artifact 'proguard-gradle.jar (net.sf.proguard:proguard-gradle:5.1)' in resolver cache: /home/josh/.gradle/caches/modules-2/files-2.1/net.sf.proguard/proguard-gradle/5.1/672d43cbfde4765080e5bea19c51a2cc45dfc00/proguard-gradle-5.1.jar
12:14:37.464 [DEBUG] [org.gradle.api.internal.artifacts.ivyservice.ivyresolve.CachingModuleComponentRepository] Found artifact 'builder-model.jar (com.android.tools.build:builder-model:1.2.3)' in resolver cache: /home/josh/.gradle/caches/modules-2/files-2.1/com.android.tools.build/builder-model/1.2.3/31a6a8af1d5a4f528a5d0fa567fcd8234d100bd1/builder-model-1.2.3.jar
12:14:37.465 [DEBUG] [org.gradle.api.internal.artifacts.ivyservice.ivyresolve.CachingModuleComponentRepository] Found artifact 'builder-test-api.jar (com.android.tools.build:builder-test-api:1.2.3)' in resolver cache: /home/josh/.gradle/caches/modules-2/files-2.1/com.android.tools.build/builder-test-api/1.2.3/821301502b154d3a66d93b72bcb9ffeba4487acd/builder-test-api-1.2.3.jar
12:14:37.465 [DEBUG] [org.gradle.api.internal.artifacts.ivyservice.ivyresolve.CachingModuleComponentRepository] Found artifact 'sdklib.jar (com.android.tools:sdklib:24.2.3)' in resolver cache: /home/josh/.gradle/caches/modules-2/files-2.1/com.android.tools/sdklib/24.2.3/2e1b33d6544db11d30fa0037ee6751675ae42329/sdklib-24.2.3.jar
12:14:37.466 [DEBUG] [org.gradle.api.internal.artifacts.ivyservice.ivyresolve.CachingModuleComponentRepository] Found artifact 'sdk-common.jar (com.android.tools:sdk-common:24.2.3)' in resolver cache: /home/josh/.gradle/caches/modules-2/files-2.1/com.android.tools/sdk-common/24.2.3/c59b15bdc3aaf46b13491827d8a6abaa6d5213b3/sdk-common-24.2.3.jar
12:14:37.467 [DEBUG] [org.gradle.api.internal.artifacts.ivyservice.ivyresolve.CachingModuleComponentRepository] Found artifact 'common.jar (com.android.tools:common:24.2.3)' in resolver cache: /home/josh/.gradle/caches/modules-2/files-2.1/com.android.tools/common/24.2.3/1bcbdeecd08852eba2954b8376ef8cbf7704b39b/common-24.2.3.jar
12:14:37.467 [DEBUG] [org.gradle.api.internal.artifacts.ivyservice.ivyresolve.CachingModuleComponentRepository] Found artifact 'manifest-merger.jar (com.android.tools.build:manifest-merger:24.2.3)' in resolver cache: /home/josh/.gradle/caches/modules-2/files-2.1/com.android.tools.build/manifest-merger/24.2.3/ac192088836974da767392eadc3beb16d37b65b3/manifest-merger-24.2.3.jar
12:14:37.468 [DEBUG] [org.gradle.api.internal.artifacts.ivyservice.ivyresolve.CachingModuleComponentRepository] Found artifact 'ddmlib.jar (com.android.tools.ddms:ddmlib:24.2.3)' in resolver cache: /home/josh/.gradle/caches/modules-2/files-2.1/com.android.tools.ddms/ddmlib/24.2.3/72e612ad93e7b12d8f71c584f1f65a81e864e4de/ddmlib-24.2.3.jar
12:14:37.469 [DEBUG] [org.gradle.api.internal.artifacts.ivyservice.ivyresolve.CachingModuleComponentRepository] Found artifact 'javawriter.jar (com.squareup:javawriter:2.5.0)' in resolver cache: /home/josh/.gradle/caches/modules-2/files-2.1/com.squareup/javawriter/2.5.0/81241ff7078ef14f42ea2a8995fa09c096256e6b/javawriter-2.5.0.jar
12:14:37.469 [DEBUG] [org.gradle.api.internal.artifacts.ivyservice.ivyresolve.CachingModuleComponentRepository] Found artifact 'bcpkix-jdk15on.jar (org.bouncycastle:bcpkix-jdk15on:1.48)' in resolver cache: /home/josh/.gradle/caches/modules-2/files-2.1/org.bouncycastle/bcpkix-jdk15on/1.48/28b7614b908a47844bb27e3c94b45b6893656265/bcpkix-jdk15on-1.48.jar
12:14:37.470 [DEBUG] [org.gradle.api.internal.artifacts.ivyservice.ivyresolve.CachingModuleComponentRepository] Found artifact 'bcprov-jdk15on.jar (org.bouncycastle:bcprov-jdk15on:1.48)' in resolver cache: /home/josh/.gradle/caches/modules-2/files-2.1/org.bouncycastle/bcprov-jdk15on/1.48/960dea7c9181ba0b17e8bab0c06a43f0a5f04e65/bcprov-jdk15on-1.48.jar
12:14:37.471 [DEBUG] [org.gradle.api.internal.artifacts.ivyservice.ivyresolve.CachingModuleComponentRepository] Found artifact 'asm.jar (org.ow2.asm:asm:5.0.3)' in resolver cache: /home/josh/.gradle/caches/modules-2/files-2.1/org.ow2.asm/asm/5.0.3/dcc2193db20e19e1feca8b1240dbbc4e190824fa/asm-5.0.3.jar
12:14:37.471 [DEBUG] [org.gradle.api.internal.artifacts.ivyservice.ivyresolve.CachingModuleComponentRepository] Found artifact 'asm-tree.jar (org.ow2.asm:asm-tree:5.0.3)' in resolver cache: /home/josh/.gradle/caches/modules-2/files-2.1/org.ow2.asm/asm-tree/5.0.3/287749b48ba7162fb67c93a026d690b29f410bed/asm-tree-5.0.3.jar
12:14:37.472 [DEBUG] [org.gradle.api.internal.artifacts.ivyservice.ivyresolve.CachingModuleComponentRepository] Found artifact 'gson.jar (com.google.code.gson:gson:2.2.4)' in resolver cache: /home/josh/.gradle/caches/modules-2/files-2.1/com.google.code.gson/gson/2.2.4/a60a5e993c98c864010053cb901b7eab25306568/gson-2.2.4.jar
12:14:37.472 [DEBUG] [org.gradle.api.internal.artifacts.ivyservice.ivyresolve.CachingModuleComponentRepository] Found artifact 'lint-checks.jar (com.android.tools.lint:lint-checks:24.2.3)' in resolver cache: /home/josh/.gradle/caches/modules-2/files-2.1/com.android.tools.lint/lint-checks/24.2.3/59fb927f5817e16796297140add6c879ee752f37/lint-checks-24.2.3.jar
12:14:37.473 [DEBUG] [org.gradle.api.internal.artifacts.ivyservice.ivyresolve.CachingModuleComponentRepository] Found artifact 'ecj.jar (org.eclipse.jdt.core.compiler:ecj:4.4)' in resolver cache: /home/josh/.gradle/caches/modules-2/files-2.1/org.eclipse.jdt.core.compiler/ecj/4.4/fe0a961ce7cca03dd3c9b3775c0133229e8231a6/ecj-4.4.jar
12:14:37.473 [DEBUG] [org.gradle.api.internal.artifacts.ivyservice.ivyresolve.CachingModuleComponentRepository] Found artifact 'proguard-base.jar (net.sf.proguard:proguard-base:5.1)' in resolver cache: /home/josh/.gradle/caches/modules-2/files-2.1/net.sf.proguard/proguard-base/5.1/dc606dd778fe4685be16d5a171782ccfe0ef5637/proguard-base-5.1.jar
12:14:37.474 [DEBUG] [org.gradle.api.internal.artifacts.ivyservice.ivyresolve.CachingModuleComponentRepository] Found artifact 'annotations.jar (com.android.tools:annotations:24.2.3)' in resolver cache: /home/josh/.gradle/caches/modules-2/files-2.1/com.android.tools/annotations/24.2.3/5cfce42220293835e7988ceefd9b0f4e9f284791/annotations-24.2.3.jar
12:14:37.474 [DEBUG] [org.gradle.api.internal.artifacts.ivyservice.ivyresolve.CachingModuleComponentRepository] Found artifact 'layoutlib-api.jar (com.android.tools.layoutlib:layoutlib-api:24.2.3)' in resolver cache: /home/josh/.gradle/caches/modules-2/files-2.1/com.android.tools.layoutlib/layoutlib-api/24.2.3/267861b0cc93c5c9cf85d901e9e1e975ae109fd/layoutlib-api-24.2.3.jar
12:14:37.475 [DEBUG] [org.gradle.api.internal.artifacts.ivyservice.ivyresolve.CachingModuleComponentRepository] Found artifact 'dvlib.jar (com.android.tools:dvlib:24.2.3)' in resolver cache: /home/josh/.gradle/caches/modules-2/files-2.1/com.android.tools/dvlib/24.2.3/14e95bd58c53762138210f48eeb5d670e11ccdba/dvlib-24.2.3.jar
12:14:37.475 [DEBUG] [org.gradle.api.internal.artifacts.ivyservice.ivyresolve.CachingModuleComponentRepository] Found artifact 'commons-compress.jar (org.apache.commons:commons-compress:1.8.1)' in resolver cache: /home/josh/.gradle/caches/modules-2/files-2.1/org.apache.commons/commons-compress/1.8.1/a698750c16740fd5b3871425f4cb3bbaa87f529d/commons-compress-1.8.1.jar
12:14:37.476 [DEBUG] [org.gradle.api.internal.artifacts.ivyservice.ivyresolve.CachingModuleComponentRepository] Found artifact 'httpclient.jar (org.apache.httpcomponents:httpclient:4.1.1)' in resolver cache: /home/josh/.gradle/caches/modules-2/files-2.1/org.apache.httpcomponents/httpclient/4.1.1/3d1d918f32709e33ba7ddb2c4e8d1c543ebe713e/httpclient-4.1.1.jar
12:14:37.476 [DEBUG] [org.gradle.api.internal.artifacts.ivyservice.ivyresolve.CachingModuleComponentRepository] Found artifact 'httpmime.jar (org.apache.httpcomponents:httpmime:4.1)' in resolver cache: /home/josh/.gradle/caches/modules-2/files-2.1/org.apache.httpcomponents/httpmime/4.1/9ba2dcdf94ce35c8a8e9bff242db0618ca932e92/httpmime-4.1.jar
12:14:37.477 [DEBUG] [org.gradle.api.internal.artifacts.ivyservice.ivyresolve.CachingModuleComponentRepository] Found artifact 'guava.jar (com.google.guava:guava:17.0)' in resolver cache: /home/josh/.gradle/caches/modules-2/files-2.1/com.google.guava/guava/17.0/9c6ef172e8de35fd8d4d8783e4821e57cdef7445/guava-17.0.jar
12:14:37.477 [DEBUG] [org.gradle.api.internal.artifacts.ivyservice.ivyresolve.CachingModuleComponentRepository] Found artifact 'kxml2.jar (net.sf.kxml:kxml2:2.3.0)' in resolver cache: /home/josh/.gradle/caches/modules-2/files-2.1/net.sf.kxml/kxml2/2.3.0/ccbc77a5fd907ef863c29f3596c6f54ffa4e9442/kxml2-2.3.0.jar
12:14:37.478 [DEBUG] [org.gradle.api.internal.artifacts.ivyservice.ivyresolve.CachingModuleComponentRepository] Found artifact 'lint-api.jar (com.android.tools.lint:lint-api:24.2.3)' in resolver cache: /home/josh/.gradle/caches/modules-2/files-2.1/com.android.tools.lint/lint-api/24.2.3/c3648cf4ae2ff004360e31ed177271d88ecd093a/lint-api-24.2.3.jar
12:14:37.478 [DEBUG] [org.gradle.api.internal.artifacts.ivyservice.ivyresolve.CachingModuleComponentRepository] Found artifact 'asm-analysis.jar (org.ow2.asm:asm-analysis:5.0.3)' in resolver cache: /home/josh/.gradle/caches/modules-2/files-2.1/org.ow2.asm/asm-analysis/5.0.3/c7126aded0e8e13fed5f913559a0dd7b770a10f3/asm-analysis-5.0.3.jar
12:14:37.479 [DEBUG] [org.gradle.api.internal.artifacts.ivyservice.ivyresolve.CachingModuleComponentRepository] Found artifact 'httpcore.jar (org.apache.httpcomponents:httpcore:4.1)' in resolver cache: /home/josh/.gradle/caches/modules-2/files-2.1/org.apache.httpcomponents/httpcore/4.1/33fc26c02f8043ab0ede19eadc8c9885386b255c/httpcore-4.1.jar
12:14:37.479 [DEBUG] [org.gradle.api.internal.artifacts.ivyservice.ivyresolve.CachingModuleComponentRepository] Found artifact 'commons-logging.jar (commons-logging:commons-logging:1.1.1)' in resolver cache: /home/josh/.gradle/caches/modules-2/files-2.1/commons-logging/commons-logging/1.1.1/5043bfebc3db072ed80fbd362e7caf00e885d8ae/commons-logging-1.1.1.jar
12:14:37.480 [DEBUG] [org.gradle.api.internal.artifacts.ivyservice.ivyresolve.CachingModuleComponentRepository] Found artifact 'commons-codec.jar (commons-codec:commons-codec:1.4)' in resolver cache: /home/josh/.gradle/caches/modules-2/files-2.1/commons-codec/commons-codec/1.4/4216af16d38465bbab0f3dff8efa14204f7a399a/commons-codec-1.4.jar
12:14:37.480 [DEBUG] [org.gradle.api.internal.artifacts.ivyservice.ivyresolve.CachingModuleComponentRepository] Found artifact 'lombok-ast.jar (com.android.tools.external.lombok:lombok-ast:0.2.3)' in resolver cache: /home/josh/.gradle/caches/modules-2/files-2.1/com.android.tools.external.lombok/lombok-ast/0.2.3/528b6f8bde3157f17530aa366631f2aad2a6cf9/lombok-ast-0.2.3.jar
12:14:37.488 [DEBUG] [org.gradle.cache.internal.DefaultFileLockManager] Waiting to acquire shared lock on no_buildscript class cache for build file '/home/josh/AndroidN-ify/build.gradle' (/home/josh/.gradle/caches/2.2/scripts/build_42yf2uvlfewnck4p2tlhrwowm/ProjectScript/no_buildscript).
12:14:37.488 [DEBUG] [org.gradle.cache.internal.DefaultFileLockManager] Lock acquired.
12:14:37.509 [DEBUG] [org.gradle.configuration.project.BuildScriptProcessor] Timing: Running the build script took 0.868 secs
12:14:37.515 [INFO] [org.gradle.configuration.project.BuildScriptProcessor] Evaluating project ':app' using build file '/home/josh/AndroidN-ify/app/build.gradle'.
12:14:37.518 [DEBUG] [org.gradle.cache.internal.DefaultFileLockManager] Waiting to acquire shared lock on buildscript class cache for build file '/home/josh/AndroidN-ify/app/build.gradle' (/home/josh/.gradle/caches/2.2/scripts/build_2a0iklsupdsxhp83t5yayx4xn/ProjectScript/buildscript).
12:14:37.518 [DEBUG] [org.gradle.cache.internal.DefaultFileLockManager] Lock acquired.
12:14:37.525 [DEBUG] [org.gradle.cache.internal.DefaultFileLockManager] Waiting to acquire shared lock on no_buildscript class cache for build file '/home/josh/AndroidN-ify/app/build.gradle' (/home/josh/.gradle/caches/2.2/scripts/build_2a0iklsupdsxhp83t5yayx4xn/ProjectScript/no_buildscript).
12:14:37.525 [DEBUG] [org.gradle.cache.internal.DefaultFileLockManager] Lock acquired.
12:14:38.200 [INFO] [com.android.build.gradle.AppExtension_Decorated] Creating configuration compile.
12:14:38.204 [INFO] [com.android.build.gradle.AppExtension_Decorated] Creating configuration apk.
12:14:38.205 [INFO] [com.android.build.gradle.AppExtension_Decorated] Creating configuration provided.
12:14:38.207 [INFO] [com.android.build.gradle.AppExtension_Decorated] Creating configuration wearApp.
12:14:38.209 [INFO] [com.android.build.gradle.AppExtension_Decorated] Creating configuration androidTestCompile.
12:14:38.210 [INFO] [com.android.build.gradle.AppExtension_Decorated] Creating configuration androidTestApk.
12:14:38.210 [INFO] [com.android.build.gradle.AppExtension_Decorated] Creating configuration androidTestProvided.
12:14:38.211 [INFO] [com.android.build.gradle.AppExtension_Decorated] Creating configuration androidTestWearApp.
12:14:38.213 [INFO] [com.android.build.gradle.AppExtension_Decorated] Creating configuration testCompile.
12:14:38.214 [INFO] [com.android.build.gradle.AppExtension_Decorated] Creating configuration testApk.
12:14:38.215 [INFO] [com.android.build.gradle.AppExtension_Decorated] Creating configuration testProvided.
12:14:38.215 [INFO] [com.android.build.gradle.AppExtension_Decorated] Creating configuration testWearApp.
12:14:38.432 [INFO] [com.android.build.gradle.AppExtension_Decorated] Creating configuration debugCompile.
12:14:38.433 [INFO] [com.android.build.gradle.AppExtension_Decorated] Creating configuration debugApk.
12:14:38.433 [INFO] [com.android.build.gradle.AppExtension_Decorated] Creating configuration debugProvided.
12:14:38.434 [INFO] [com.android.build.gradle.AppExtension_Decorated] Creating configuration debugWearApp.
12:14:38.438 [INFO] [com.android.build.gradle.AppExtension_Decorated] Creating configuration testDebugCompile.
12:14:38.439 [INFO] [com.android.build.gradle.AppExtension_Decorated] Creating configuration testDebugApk.
12:14:38.441 [INFO] [com.android.build.gradle.AppExtension_Decorated] Creating configuration testDebugProvided.
12:14:38.441 [INFO] [com.android.build.gradle.AppExtension_Decorated] Creating configuration testDebugWearApp.
12:14:38.458 [INFO] [com.android.build.gradle.AppExtension_Decorated] Creating configuration releaseCompile.
12:14:38.459 [INFO] [com.android.build.gradle.AppExtension_Decorated] Creating configuration releaseApk.
12:14:38.459 [INFO] [com.android.build.gradle.AppExtension_Decorated] Creating configuration releaseProvided.
12:14:38.460 [INFO] [com.android.build.gradle.AppExtension_Decorated] Creating configuration releaseWearApp.
12:14:38.461 [INFO] [com.android.build.gradle.AppExtension_Decorated] Creating configuration testReleaseCompile.
12:14:38.461 [INFO] [com.android.build.gradle.AppExtension_Decorated] Creating configuration testReleaseApk.
12:14:38.462 [INFO] [com.android.build.gradle.AppExtension_Decorated] Creating configuration testReleaseProvided.
12:14:38.462 [INFO] [com.android.build.gradle.AppExtension_Decorated] Creating configuration testReleaseWearApp.
12:14:38.546 [DEBUG] [org.gradle.configuration.project.BuildScriptProcessor] Timing: Running the build script took 1.03 secs
12:14:38.694 [DEBUG] [org.gradle.api.internal.artifacts.ivyservice.resolveengine.DefaultDependencyResolver] Resolving configuration ':app:_debugCompile'
12:14:38.695 [DEBUG] [org.gradle.api.internal.artifacts.ivyservice.ivyresolve.memcache.InMemoryCachedRepositoryFactory] Reusing in-memory cache for repo 'BintrayJCenter' [22da77b0d76ea8df17298218f3ec1f87].
12:14:38.698 [DEBUG] [org.gradle.api.internal.artifacts.ivyservice.ivyresolve.memcache.InMemoryCachedRepositoryFactory] Creating new in-memory cache for repo 'maven' [790607f184c4bc6911166b22374c899d].
12:14:38.698 [DEBUG] [org.gradle.api.internal.artifacts.ivyservice.ivyresolve.memcache.InMemoryCachedRepositoryFactory] Creating new in-memory cache for repo 'maven2' [7bc5452c5bef7ddf116b55056127f470].
12:14:38.700 [DEBUG] [org.gradle.api.internal.artifacts.ivyservice.resolveengine.graph.DependencyGraphBuilder] Visiting configuration AndroidN-ify:app:unspecified(_debugCompile).
12:14:38.700 [DEBUG] [org.gradle.api.internal.artifacts.ivyservice.resolveengine.graph.ResolvedConfigurationDependencyGraphVisitor] Attaching AndroidN-ify:app:unspecified(_debugCompile) to its parents.
12:14:38.700 [DEBUG] [org.gradle.api.internal.artifacts.ivyservice.resolveengine.oldresult.TransientConfigurationResultsBuilder] Flushing resolved configuration data in Binary store in /tmp/gradle5638561761381274998.bin. Wrote root AndroidN-ify:app:unspecified:_debugCompile.
12:14:38.703 [DEBUG] [org.gradle.api.internal.artifacts.ivyservice.resolveengine.result.StreamingResolutionResultBuilder$RootFactory] Loaded resolution results (0.001 secs) from Binary store in /tmp/gradle3008186518394385086.bin (exist: true)
12:14:38.716 [DEBUG] [org.gradle.api.internal.artifacts.ivyservice.resolveengine.DefaultDependencyResolver] Resolving configuration ':app:_releaseCompile'
12:14:38.717 [DEBUG] [org.gradle.api.internal.artifacts.ivyservice.ivyresolve.memcache.InMemoryCachedRepositoryFactory] Reusing in-memory cache for repo 'BintrayJCenter' [22da77b0d76ea8df17298218f3ec1f87].
12:14:38.718 [DEBUG] [org.gradle.api.internal.artifacts.ivyservice.ivyresolve.memcache.InMemoryCachedRepositoryFactory] Reusing in-memory cache for repo 'maven' [790607f184c4bc6911166b22374c899d].
12:14:38.718 [DEBUG] [org.gradle.api.internal.artifacts.ivyservice.ivyresolve.memcache.InMemoryCachedRepositoryFactory] Reusing in-memory cache for repo 'maven2' [7bc5452c5bef7ddf116b55056127f470].
12:14:38.719 [DEBUG] [org.gradle.api.internal.artifacts.ivyservice.resolveengine.graph.DependencyGraphBuilder] Visiting configuration AndroidN-ify:app:unspecified(_releaseCompile).
12:14:38.720 [DEBUG] [org.gradle.api.internal.artifacts.ivyservice.resolveengine.graph.ResolvedConfigurationDependencyGraphVisitor] Attaching AndroidN-ify:app:unspecified(_releaseCompile) to its parents.
12:14:38.720 [DEBUG] [org.gradle.api.internal.artifacts.ivyservice.resolveengine.oldresult.TransientConfigurationResultsBuilder] Flushing resolved configuration data in Binary store in /tmp/gradle5638561761381274998.bin. Wrote root AndroidN-ify:app:unspecified:_releaseCompile.
12:14:38.721 [DEBUG] [org.gradle.api.internal.artifacts.ivyservice.resolveengine.result.StreamingResolutionResultBuilder$RootFactory] Loaded resolution results (0.0 secs) from Binary store in /tmp/gradle3008186518394385086.bin (exist: true)
12:14:39.628 [INFO] [org.gradle.BuildLogger] All projects evaluated.
12:14:39.630 [INFO] [org.gradle.execution.TaskNameResolvingBuildConfigurationAction] Selected primary task 'assemble' from project :
12:14:39.854 [DEBUG] [org.gradle.execution.taskgraph.DefaultTaskGraphExecuter] Timing: Creating the DAG took 0.224 secs
12:14:39.859 [INFO] [org.gradle.BuildLogger] Tasks to be executed: [task ':app:preBuild', task ':app:preDebugBuild', task ':app:checkDebugManifest', task ':app:prepareDebugDependencies', task ':app:compileDebugAidl', task ':app:compileDebugRenderscript', task ':app:generateDebugBuildConfig', task ':app:generateDebugAssets', task ':app:mergeDebugAssets', task ':app:generateDebugResValues', task ':app:generateDebugResources', task ':app:mergeDebugResources', task ':app:processDebugManifest', task ':app:processDebugResources', task ':app:generateDebugSources', task ':app:processDebugJavaRes', task ':app:compileDebugJava', task ':app:compileDebugNdk', task ':app:compileDebugSources', task ':app:preDexDebug', task ':app:dexDebug', task ':app:validateDebugSigning', task ':app:packageDebug', task ':app:zipalignDebug', task ':app:assembleDebug', task ':app:preReleaseBuild', task ':app:checkReleaseManifest', task ':app:prepareReleaseDependencies', task ':app:compileReleaseAidl', task ':app:compileReleaseRenderscript', task ':app:generateReleaseBuildConfig', task ':app:generateReleaseAssets', task ':app:mergeReleaseAssets', task ':app:generateReleaseResValues', task ':app:generateReleaseResources', task ':app:mergeReleaseResources', task ':app:processReleaseManifest', task ':app:processReleaseResources', task ':app:generateReleaseSources', task ':app:processReleaseJavaRes', task ':app:compileReleaseJava', task ':app:compileReleaseNdk', task ':app:compileReleaseSources', task ':app:lintVitalRelease', task ':app:preDexRelease', task ':app:dexRelease', task ':app:packageRelease', task ':app:assembleRelease', task ':app:assemble']
12:14:39.862 [INFO] [org.gradle.execution.taskgraph.AbstractTaskPlanExecutor] :app:preBuild (Thread[main,5,main]) started.
12:14:39.862 [LIFECYCLE] [class org.gradle.TaskExecutionLogger] :app:preBuild
12:14:39.883 [DEBUG] [org.gradle.api.internal.tasks.execution.ExecuteAtMostOnceTaskExecuter] Starting to execute task ':app:preBuild'
12:14:39.883 [INFO] [org.gradle.api.internal.tasks.execution.SkipTaskWithNoActionsExecuter] Skipping task ':app:preBuild' as it has no actions.
12:14:39.884 [DEBUG] [org.gradle.api.internal.tasks.execution.ExecuteAtMostOnceTaskExecuter] Finished executing task ':app:preBuild'
12:14:39.884 [LIFECYCLE] [class org.gradle.TaskExecutionLogger] :app:preBuild UP-TO-DATE
12:14:39.903 [INFO] [org.gradle.execution.taskgraph.AbstractTaskPlanExecutor] :app:preBuild (Thread[main,5,main]) completed. Took 0.041 secs.
12:14:39.904 [INFO] [org.gradle.execution.taskgraph.AbstractTaskPlanExecutor] :app:preDebugBuild (Thread[main,5,main]) started.
12:14:39.904 [LIFECYCLE] [class org.gradle.TaskExecutionLogger] :app:preDebugBuild
12:14:39.904 [DEBUG] [org.gradle.api.internal.tasks.execution.ExecuteAtMostOnceTaskExecuter] Starting to execute task ':app:preDebugBuild'
12:14:39.904 [INFO] [org.gradle.api.internal.tasks.execution.SkipTaskWithNoActionsExecuter] Skipping task ':app:preDebugBuild' as it has no actions.
12:14:39.904 [DEBUG] [org.gradle.api.internal.tasks.execution.ExecuteAtMostOnceTaskExecuter] Finished executing task ':app:preDebugBuild'
12:14:39.904 [LIFECYCLE] [class org.gradle.TaskExecutionLogger] :app:preDebugBuild UP-TO-DATE
12:14:39.905 [INFO] [org.gradle.execution.taskgraph.AbstractTaskPlanExecutor] :app:preDebugBuild (Thread[main,5,main]) completed. Took 0.001 secs.
12:14:39.905 [INFO] [org.gradle.execution.taskgraph.AbstractTaskPlanExecutor] :app:checkDebugManifest (Thread[main,5,main]) started.
12:14:39.905 [LIFECYCLE] [class org.gradle.TaskExecutionLogger] :app:checkDebugManifest
12:14:39.905 [DEBUG] [org.gradle.api.internal.tasks.execution.ExecuteAtMostOnceTaskExecuter] Starting to execute task ':app:checkDebugManifest'
12:14:39.906 [DEBUG] [org.gradle.api.internal.tasks.execution.SkipUpToDateTaskExecuter] Determining if task ':app:checkDebugManifest' is up-to-date
12:14:39.906 [INFO] [org.gradle.api.internal.tasks.execution.SkipUpToDateTaskExecuter] Executing task ':app:checkDebugManifest' (up-to-date check took 0.0 secs) due to:
Task has not declared any outputs.
12:14:39.906 [DEBUG] [org.gradle.api.internal.tasks.execution.ExecuteActionsTaskExecuter] Executing actions for task ':app:checkDebugManifest'.
12:14:39.908 [DEBUG] [org.gradle.api.internal.tasks.execution.ExecuteAtMostOnceTaskExecuter] Finished executing task ':app:checkDebugManifest'
12:14:39.909 [INFO] [org.gradle.execution.taskgraph.AbstractTaskPlanExecutor] :app:checkDebugManifest (Thread[main,5,main]) completed. Took 0.003 secs.
12:14:39.909 [INFO] [org.gradle.execution.taskgraph.AbstractTaskPlanExecutor] :app:prepareDebugDependencies (Thread[main,5,main]) started.
12:14:39.909 [LIFECYCLE] [class org.gradle.TaskExecutionLogger] :app:prepareDebugDependencies
12:14:39.909 [DEBUG] [org.gradle.api.internal.tasks.execution.ExecuteAtMostOnceTaskExecuter] Starting to execute task ':app:prepareDebugDependencies'
12:14:39.909 [DEBUG] [org.gradle.api.internal.tasks.execution.SkipUpToDateTaskExecuter] Determining if task ':app:prepareDebugDependencies' is up-to-date
12:14:39.909 [INFO] [org.gradle.api.internal.tasks.execution.SkipUpToDateTaskExecuter] Executing task ':app:prepareDebugDependencies' (up-to-date check took 0.0 secs) due to:
Task has not declared any outputs.
12:14:39.910 [DEBUG] [org.gradle.api.internal.tasks.execution.ExecuteActionsTaskExecuter] Executing actions for task ':app:prepareDebugDependencies'.
12:14:39.910 [DEBUG] [org.gradle.api.internal.tasks.execution.ExecuteAtMostOnceTaskExecuter] Finished executing task ':app:prepareDebugDependencies'
12:14:39.911 [INFO] [org.gradle.execution.taskgraph.AbstractTaskPlanExecutor] :app:prepareDebugDependencies (Thread[main,5,main]) completed. Took 0.001 secs.
12:14:39.911 [INFO] [org.gradle.execution.taskgraph.AbstractTaskPlanExecutor] :app:compileDebugAidl (Thread[main,5,main]) started.
12:14:39.911 [LIFECYCLE] [class org.gradle.TaskExecutionLogger] :app:compileDebugAidl
12:14:39.911 [DEBUG] [org.gradle.api.internal.tasks.execution.ExecuteAtMostOnceTaskExecuter] Starting to execute task ':app:compileDebugAidl'
12:14:39.930 [DEBUG] [org.gradle.api.internal.tasks.execution.SkipUpToDateTaskExecuter] Determining if task ':app:compileDebugAidl' is up-to-date
12:14:39.932 [DEBUG] [org.gradle.cache.internal.DefaultFileLockManager] Waiting to acquire exclusive lock on task history cache (/home/josh/AndroidN-ify/.gradle/2.2/taskArtifacts).
12:14:39.932 [DEBUG] [org.gradle.cache.internal.DefaultFileLockManager] Lock acquired.
12:14:39.932 [DEBUG] [org.gradle.cache.internal.btree.BTreePersistentIndexedCache] Opening cache taskArtifacts.bin (/home/josh/AndroidN-ify/.gradle/2.2/taskArtifacts/taskArtifacts.bin)
12:14:39.939 [DEBUG] [org.gradle.cache.internal.btree.BTreePersistentIndexedCache] Opening cache outputFileStates.bin (/home/josh/AndroidN-ify/.gradle/2.2/taskArtifacts/outputFileStates.bin)
12:14:39.945 [DEBUG] [org.gradle.cache.internal.btree.BTreePersistentIndexedCache] Opening cache fileHashes.bin (/home/josh/AndroidN-ify/.gradle/2.2/taskArtifacts/fileHashes.bin)
12:14:39.952 [DEBUG] [org.gradle.cache.internal.btree.BTreePersistentIndexedCache] Opening cache fileSnapshots.bin (/home/josh/AndroidN-ify/.gradle/2.2/taskArtifacts/fileSnapshots.bin)
12:14:39.956 [INFO] [org.gradle.api.internal.tasks.execution.SkipUpToDateTaskExecuter] Skipping task ':app:compileDebugAidl' as it is up-to-date (took 0.025 secs).
12:14:39.956 [DEBUG] [org.gradle.api.internal.tasks.execution.ExecuteAtMostOnceTaskExecuter] Finished executing task ':app:compileDebugAidl'
12:14:39.956 [LIFECYCLE] [class org.gradle.TaskExecutionLogger] :app:compileDebugAidl UP-TO-DATE
12:14:39.957 [INFO] [org.gradle.execution.taskgraph.AbstractTaskPlanExecutor] :app:compileDebugAidl (Thread[main,5,main]) completed. Took 0.046 secs.
12:14:39.957 [INFO] [org.gradle.execution.taskgraph.AbstractTaskPlanExecutor] :app:compileDebugRenderscript (Thread[main,5,main]) started.
12:14:39.957 [LIFECYCLE] [class org.gradle.TaskExecutionLogger] :app:compileDebugRenderscript
12:14:39.957 [DEBUG] [org.gradle.api.internal.tasks.execution.ExecuteAtMostOnceTaskExecuter] Starting to execute task ':app:compileDebugRenderscript'
12:14:39.961 [DEBUG] [org.gradle.api.internal.tasks.execution.SkipUpToDateTaskExecuter] Determining if task ':app:compileDebugRenderscript' is up-to-date
12:14:39.970 [INFO] [org.gradle.api.internal.tasks.execution.SkipUpToDateTaskExecuter] Skipping task ':app:compileDebugRenderscript' as it is up-to-date (took 0.009 secs).
12:14:39.970 [DEBUG] [org.gradle.api.internal.tasks.execution.ExecuteAtMostOnceTaskExecuter] Finished executing task ':app:compileDebugRenderscript'
12:14:39.970 [LIFECYCLE] [class org.gradle.TaskExecutionLogger] :app:compileDebugRenderscript UP-TO-DATE
12:14:39.971 [INFO] [org.gradle.execution.taskgraph.AbstractTaskPlanExecutor] :app:compileDebugRenderscript (Thread[main,5,main]) completed. Took 0.014 secs.
12:14:39.971 [INFO] [org.gradle.execution.taskgraph.AbstractTaskPlanExecutor] :app:generateDebugBuildConfig (Thread[main,5,main]) started.
12:14:39.971 [LIFECYCLE] [class org.gradle.TaskExecutionLogger] :app:generateDebugBuildConfig
12:14:39.972 [DEBUG] [org.gradle.api.internal.tasks.execution.ExecuteAtMostOnceTaskExecuter] Starting to execute task ':app:generateDebugBuildConfig'
12:14:40.016 [DEBUG] [org.gradle.api.internal.tasks.execution.SkipUpToDateTaskExecuter] Determining if task ':app:generateDebugBuildConfig' is up-to-date
12:14:40.022 [INFO] [org.gradle.api.internal.tasks.execution.SkipUpToDateTaskExecuter] Skipping task ':app:generateDebugBuildConfig' as it is up-to-date (took 0.006 secs).
12:14:40.022 [DEBUG] [org.gradle.api.internal.tasks.execution.ExecuteAtMostOnceTaskExecuter] Finished executing task ':app:generateDebugBuildConfig'
12:14:40.022 [LIFECYCLE] [class org.gradle.TaskExecutionLogger] :app:generateDebugBuildConfig UP-TO-DATE
12:14:40.022 [INFO] [org.gradle.execution.taskgraph.AbstractTaskPlanExecutor] :app:generateDebugBuildConfig (Thread[main,5,main]) completed. Took 0.051 secs.
12:14:40.022 [INFO] [org.gradle.execution.taskgraph.AbstractTaskPlanExecutor] :app:generateDebugAssets (Thread[main,5,main]) started.
12:14:40.022 [LIFECYCLE] [class org.gradle.TaskExecutionLogger] :app:generateDebugAssets
12:14:40.023 [DEBUG] [org.gradle.api.internal.tasks.execution.ExecuteAtMostOnceTaskExecuter] Starting to execute task ':app:generateDebugAssets'
12:14:40.023 [INFO] [org.gradle.api.internal.tasks.execution.SkipTaskWithNoActionsExecuter] Skipping task ':app:generateDebugAssets' as it has no actions.
12:14:40.023 [DEBUG] [org.gradle.api.internal.tasks.execution.ExecuteAtMostOnceTaskExecuter] Finished executing task ':app:generateDebugAssets'
12:14:40.023 [LIFECYCLE] [class org.gradle.TaskExecutionLogger] :app:generateDebugAssets UP-TO-DATE
12:14:40.023 [INFO] [org.gradle.execution.taskgraph.AbstractTaskPlanExecutor] :app:generateDebugAssets (Thread[main,5,main]) completed. Took 0.001 secs.
12:14:40.023 [INFO] [org.gradle.execution.taskgraph.AbstractTaskPlanExecutor] :app:mergeDebugAssets (Thread[main,5,main]) started.
12:14:40.023 [LIFECYCLE] [class org.gradle.TaskExecutionLogger] :app:mergeDebugAssets
12:14:40.024 [DEBUG] [org.gradle.api.internal.tasks.execution.ExecuteAtMostOnceTaskExecuter] Starting to execute task ':app:mergeDebugAssets'
12:14:40.024 [DEBUG] [org.gradle.api.internal.tasks.execution.SkipUpToDateTaskExecuter] Determining if task ':app:mergeDebugAssets' is up-to-date
12:14:40.027 [INFO] [org.gradle.api.internal.tasks.execution.SkipUpToDateTaskExecuter] Skipping task ':app:mergeDebugAssets' as it is up-to-date (took 0.003 secs).
12:14:40.027 [DEBUG] [org.gradle.api.internal.tasks.execution.ExecuteAtMostOnceTaskExecuter] Finished executing task ':app:mergeDebugAssets'
12:14:40.027 [LIFECYCLE] [class org.gradle.TaskExecutionLogger] :app:mergeDebugAssets UP-TO-DATE
12:14:40.028 [INFO] [org.gradle.execution.taskgraph.AbstractTaskPlanExecutor] :app:mergeDebugAssets (Thread[main,5,main]) completed. Took 0.005 secs.
12:14:40.028 [INFO] [org.gradle.execution.taskgraph.AbstractTaskPlanExecutor] :app:generateDebugResValues (Thread[main,5,main]) started.
12:14:40.028 [LIFECYCLE] [class org.gradle.TaskExecutionLogger] :app:generateDebugResValues
12:14:40.028 [DEBUG] [org.gradle.api.internal.tasks.execution.ExecuteAtMostOnceTaskExecuter] Starting to execute task ':app:generateDebugResValues'
12:14:40.029 [DEBUG] [org.gradle.api.internal.tasks.execution.SkipUpToDateTaskExecuter] Determining if task ':app:generateDebugResValues' is up-to-date
12:14:40.031 [INFO] [org.gradle.api.internal.tasks.execution.SkipUpToDateTaskExecuter] Skipping task ':app:generateDebugResValues' as it is up-to-date (took 0.001 secs).
12:14:40.031 [DEBUG] [org.gradle.api.internal.tasks.execution.ExecuteAtMostOnceTaskExecuter] Finished executing task ':app:generateDebugResValues'
12:14:40.031 [LIFECYCLE] [class org.gradle.TaskExecutionLogger] :app:generateDebugResValues UP-TO-DATE
12:14:40.031 [INFO] [org.gradle.execution.taskgraph.AbstractTaskPlanExecutor] :app:generateDebugResValues (Thread[main,5,main]) completed. Took 0.003 secs.
12:14:40.031 [INFO] [org.gradle.execution.taskgraph.AbstractTaskPlanExecutor] :app:generateDebugResources (Thread[main,5,main]) started.
12:14:40.031 [LIFECYCLE] [class org.gradle.TaskExecutionLogger] :app:generateDebugResources
12:14:40.031 [DEBUG] [org.gradle.api.internal.tasks.execution.ExecuteAtMostOnceTaskExecuter] Starting to execute task ':app:generateDebugResources'
12:14:40.032 [INFO] [org.gradle.api.internal.tasks.execution.SkipTaskWithNoActionsExecuter] Skipping task ':app:generateDebugResources' as it has no actions.
12:14:40.032 [DEBUG] [org.gradle.api.internal.tasks.execution.ExecuteAtMostOnceTaskExecuter] Finished executing task ':app:generateDebugResources'
12:14:40.032 [LIFECYCLE] [class org.gradle.TaskExecutionLogger] :app:generateDebugResources UP-TO-DATE
12:14:40.032 [INFO] [org.gradle.execution.taskgraph.AbstractTaskPlanExecutor] :app:generateDebugResources (Thread[main,5,main]) completed. Took 0.001 secs.
12:14:40.032 [INFO] [org.gradle.execution.taskgraph.AbstractTaskPlanExecutor] :app:mergeDebugResources (Thread[main,5,main]) started.
12:14:40.032 [LIFECYCLE] [class org.gradle.TaskExecutionLogger] :app:mergeDebugResources
12:14:40.032 [DEBUG] [org.gradle.api.internal.tasks.execution.ExecuteAtMostOnceTaskExecuter] Starting to execute task ':app:mergeDebugResources'
12:14:40.038 [DEBUG] [org.gradle.api.internal.tasks.execution.SkipUpToDateTaskExecuter] Determining if task ':app:mergeDebugResources' is up-to-date
12:14:40.068 [INFO] [org.gradle.api.internal.tasks.execution.SkipUpToDateTaskExecuter] Skipping task ':app:mergeDebugResources' as it is up-to-date (took 0.029 secs).
12:14:40.068 [DEBUG] [org.gradle.api.internal.tasks.execution.ExecuteAtMostOnceTaskExecuter] Finished executing task ':app:mergeDebugResources'
12:14:40.068 [LIFECYCLE] [class org.gradle.TaskExecutionLogger] :app:mergeDebugResources UP-TO-DATE
12:14:40.068 [INFO] [org.gradle.execution.taskgraph.AbstractTaskPlanExecutor] :app:mergeDebugResources (Thread[main,5,main]) completed. Took 0.036 secs.
12:14:40.068 [INFO] [org.gradle.execution.taskgraph.AbstractTaskPlanExecutor] :app:processDebugManifest (Thread[main,5,main]) started.
12:14:40.068 [LIFECYCLE] [class org.gradle.TaskExecutionLogger] :app:processDebugManifest
12:14:40.069 [DEBUG] [org.gradle.api.internal.tasks.execution.ExecuteAtMostOnceTaskExecuter] Starting to execute task ':app:processDebugManifest'
12:14:40.086 [DEBUG] [org.gradle.api.internal.tasks.execution.SkipUpToDateTaskExecuter] Determining if task ':app:processDebugManifest' is up-to-date
12:14:40.094 [INFO] [org.gradle.api.internal.tasks.execution.SkipUpToDateTaskExecuter] Skipping task ':app:processDebugManifest' as it is up-to-date (took 0.008 secs).
12:14:40.095 [DEBUG] [org.gradle.api.internal.tasks.execution.ExecuteAtMostOnceTaskExecuter] Finished executing task ':app:processDebugManifest'
12:14:40.095 [LIFECYCLE] [class org.gradle.TaskExecutionLogger] :app:processDebugManifest UP-TO-DATE
12:14:40.095 [INFO] [org.gradle.execution.taskgraph.AbstractTaskPlanExecutor] :app:processDebugManifest (Thread[main,5,main]) completed. Took 0.027 secs.
12:14:40.095 [INFO] [org.gradle.execution.taskgraph.AbstractTaskPlanExecutor] :app:processDebugResources (Thread[main,5,main]) started.
12:14:40.095 [LIFECYCLE] [class org.gradle.TaskExecutionLogger] :app:processDebugResources
12:14:40.095 [DEBUG] [org.gradle.api.internal.tasks.execution.ExecuteAtMostOnceTaskExecuter] Starting to execute task ':app:processDebugResources'
12:14:40.097 [DEBUG] [org.gradle.api.internal.tasks.execution.SkipUpToDateTaskExecuter] Determining if task ':app:processDebugResources' is up-to-date
12:14:40.114 [INFO] [org.gradle.api.internal.tasks.execution.SkipUpToDateTaskExecuter] Skipping task ':app:processDebugResources' as it is up-to-date (took 0.016 secs).
12:14:40.114 [DEBUG] [org.gradle.api.internal.tasks.execution.ExecuteAtMostOnceTaskExecuter] Finished executing task ':app:processDebugResources'
12:14:40.114 [LIFECYCLE] [class org.gradle.TaskExecutionLogger] :app:processDebugResources UP-TO-DATE
12:14:40.115 [INFO] [org.gradle.execution.taskgraph.AbstractTaskPlanExecutor] :app:processDebugResources (Thread[main,5,main]) completed. Took 0.02 secs.
12:14:40.115 [INFO] [org.gradle.execution.taskgraph.AbstractTaskPlanExecutor] :app:generateDebugSources (Thread[main,5,main]) started.
12:14:40.115 [LIFECYCLE] [class org.gradle.TaskExecutionLogger] :app:generateDebugSources
12:14:40.115 [DEBUG] [org.gradle.api.internal.tasks.execution.ExecuteAtMostOnceTaskExecuter] Starting to execute task ':app:generateDebugSources'
12:14:40.115 [INFO] [org.gradle.api.internal.tasks.execution.SkipTaskWithNoActionsExecuter] Skipping task ':app:generateDebugSources' as it has no actions.
12:14:40.116 [DEBUG] [org.gradle.api.internal.tasks.execution.ExecuteAtMostOnceTaskExecuter] Finished executing task ':app:generateDebugSources'
12:14:40.116 [LIFECYCLE] [class org.gradle.TaskExecutionLogger] :app:generateDebugSources UP-TO-DATE
12:14:40.116 [INFO] [org.gradle.execution.taskgraph.AbstractTaskPlanExecutor] :app:generateDebugSources (Thread[main,5,main]) completed. Took 0.001 secs.
12:14:40.116 [INFO] [org.gradle.execution.taskgraph.AbstractTaskPlanExecutor] :app:processDebugJavaRes (Thread[main,5,main]) started.
12:14:40.116 [LIFECYCLE] [class org.gradle.TaskExecutionLogger] :app:processDebugJavaRes
12:14:40.117 [DEBUG] [org.gradle.api.internal.tasks.execution.ExecuteAtMostOnceTaskExecuter] Starting to execute task ':app:processDebugJavaRes'
12:14:40.117 [INFO] [org.gradle.api.internal.tasks.execution.SkipEmptySourceFilesTaskExecuter] Skipping task ':app:processDebugJavaRes' as it has no source files.
12:14:40.117 [DEBUG] [org.gradle.api.internal.tasks.execution.ExecuteAtMostOnceTaskExecuter] Finished executing task ':app:processDebugJavaRes'
12:14:40.117 [LIFECYCLE] [class org.gradle.TaskExecutionLogger] :app:processDebugJavaRes UP-TO-DATE
12:14:40.118 [INFO] [org.gradle.execution.taskgraph.AbstractTaskPlanExecutor] :app:processDebugJavaRes (Thread[main,5,main]) completed. Took 0.002 secs.
12:14:40.118 [INFO] [org.gradle.execution.taskgraph.AbstractTaskPlanExecutor] :app:compileDebugJava (Thread[main,5,main]) started.
12:14:40.119 [LIFECYCLE] [class org.gradle.TaskExecutionLogger] :app:compileDebugJava
12:14:40.119 [DEBUG] [org.gradle.api.internal.tasks.execution.ExecuteAtMostOnceTaskExecuter] Starting to execute task ':app:compileDebugJava'
12:14:40.121 [DEBUG] [org.gradle.api.internal.tasks.execution.SkipUpToDateTaskExecuter] Determining if task ':app:compileDebugJava' is up-to-date
12:14:40.135 [INFO] [org.gradle.api.internal.tasks.execution.SkipUpToDateTaskExecuter] Executing task ':app:compileDebugJava' (up-to-date check took 0.014 secs) due to:
Output file /home/josh/AndroidN-ify/app/build/intermediates/classes/debug/tk/wasdennnoch/androidn_ify/R$mipmap.class has been removed.
Output file /home/josh/AndroidN-ify/app/build/intermediates/classes/debug/tk/wasdennnoch/androidn_ify/statusbar/header/StatusBarHeaderHooks$1.class has been removed.
Output file /home/josh/AndroidN-ify/app/build/intermediates/classes/debug/tk/wasdennnoch/androidn_ify/R$color.class has been removed.
12:14:40.135 [DEBUG] [org.gradle.api.internal.tasks.execution.ExecuteActionsTaskExecuter] Executing actions for task ':app:compileDebugJava'.
12:14:40.147 [INFO] [org.gradle.api.internal.changedetection.changes.RebuildIncrementalTaskInputs] All input files are considered out-of-date for incremental task ':app:compileDebugJava'.
12:14:40.159 [DEBUG] [org.gradle.api.internal.tasks.compile.NormalizingJavaCompiler] Compiler arguments: -source 1.7 -target 1.7 -d /home/josh/AndroidN-ify/app/build/intermediates/classes/debug -g -encoding UTF-8 -bootclasspath /home/josh/android/platforms/android-23/android.jar -classpath /home/josh/AndroidN-ify/app/libs-provide/android_hidden_api_23.jar:/home/josh/AndroidN-ify/app/libs-provide/Settings.jar:/home/josh/AndroidN-ify/app/libs-provide/SystemUI.jar:/home/josh/AndroidN-ify/app/libs-provide/XposedBridgeApi-20150213.jar /home/josh/AndroidN-ify/app/src/main/java/tk/wasdennnoch/androidn_ify/XposedHook.java /home/josh/AndroidN-ify/app/src/main/java/tk/wasdennnoch/androidn_ify/statusbar/header/StatusBarHeaderHooks.java /home/josh/AndroidN-ify/app/src/main/java/tk/wasdennnoch/androidn_ify/notifications/NotificationsHooks.java /home/josh/AndroidN-ify/app/src/main/java/tk/wasdennnoch/androidn_ify/ui/SettingsActivity.java /home/josh/AndroidN-ify/app/src/main/java/tk/wasdennnoch/androidn_ify/ui/preference/SeekBarPreference.java /home/josh/AndroidN-ify/app/src/main/java/tk/wasdennnoch/androidn_ify/settings/SettingsHooks.java /home/josh/AndroidN-ify/app/src/main/java/tk/wasdennnoch/androidn_ify/settings/summaries/SummaryTweaks.java /home/josh/AndroidN-ify/app/src/main/java/tk/wasdennnoch/androidn_ify/settings/summaries/categories/WirelessAndNetworksTweaks.java /home/josh/AndroidN-ify/app/src/main/java/tk/wasdennnoch/androidn_ify/settings/summaries/categories/DeviceTweaks.java /home/josh/AndroidN-ify/app/src/main/java/tk/wasdennnoch/androidn_ify/settings/summaries/categories/RomTweaks.java /home/josh/AndroidN-ify/app/src/main/java/tk/wasdennnoch/androidn_ify/settings/summaries/categories/SystemTweaks.java /home/josh/AndroidN-ify/app/src/main/java/tk/wasdennnoch/androidn_ify/settings/summaries/categories/PersonalTweaks.java /home/josh/AndroidN-ify/app/src/main/java/tk/wasdennnoch/androidn_ify/recents/doubletap/DoubleTapSwKeys.java /home/josh/AndroidN-ify/app/src/main/java/tk/wasdennnoch/androidn_ify/recents/doubletap/DoubleTapHwKeys.java /home/josh/AndroidN-ify/app/src/main/java/tk/wasdennnoch/androidn_ify/recents/doubletap/DoubleTapBase.java /home/josh/AndroidN-ify/app/src/main/java/tk/wasdennnoch/androidn_ify/utils/StringUtils.java /home/josh/AndroidN-ify/app/src/main/java/tk/wasdennnoch/androidn_ify/utils/ResourceUtils.java /home/josh/AndroidN-ify/app/src/main/java/tk/wasdennnoch/androidn_ify/extracted/ExpandableIndicator.java /home/josh/AndroidN-ify/app/src/main/java/tk/wasdennnoch/androidn_ify/extracted/MobileDataController.java /home/josh/AndroidN-ify/app/src/main/java/tk/wasdennnoch/androidn_ify/extracted/TouchAnimator.java /home/josh/AndroidN-ify/app/src/main/java/tk/wasdennnoch/androidn_ify/extracted/TouchAnimator2.java /home/josh/AndroidN-ify/app/build/generated/source/r/debug/tk/wasdennnoch/androidn_ify/R.java /home/josh/AndroidN-ify/app/build/generated/source/buildConfig/debug/tk/wasdennnoch/androidn_ify/BuildConfig.java
12:14:40.160 [INFO] [org.gradle.api.internal.tasks.compile.JdkJavaCompiler] Compiling with JDK Java compiler API.
12:14:40.617 [ERROR] [system.err] /home/josh/AndroidN-ify/app/src/main/java/tk/wasdennnoch/androidn_ify/extracted/TouchAnimator2.java:3: error: cannot find symbol
12:14:40.617 [ERROR] [system.err] import android.util.FloatProperty;
12:14:40.617 [ERROR] [system.err] ^
12:14:40.617 [ERROR] [system.err] symbol: class FloatProperty
12:14:40.617 [ERROR] [system.err] location: package android.util
12:14:40.618 [ERROR] [system.err] /home/josh/AndroidN-ify/app/src/main/java/tk/wasdennnoch/androidn_ify/extracted/TouchAnimator2.java:4: error: cannot find symbol
12:14:40.618 [ERROR] [system.err] import android.util.MathUtils;
12:14:40.618 [ERROR] [system.err] ^
12:14:40.618 [ERROR] [system.err] symbol: class MathUtils
12:14:40.618 [ERROR] [system.err] location: package android.util
12:14:40.632 [ERROR] [system.err] /home/josh/AndroidN-ify/app/src/main/java/tk/wasdennnoch/androidn_ify/extracted/TouchAnimator2.java:25: error: cannot find symbol
12:14:40.632 [ERROR] [system.err] private static final FloatProperty POSITION = new FloatProperty("position") {
12:14:40.632 [ERROR] [system.err] ^
12:14:40.632 [ERROR] [system.err] symbol: class FloatProperty
12:14:40.633 [ERROR] [system.err] location: class TouchAnimator2
12:14:40.663 [ERROR] [system.err] /home/josh/AndroidN-ify/app/src/main/java/tk/wasdennnoch/androidn_ify/settings/summaries/categories/WirelessAndNetworksTweaks.java:8: error: cannot find symbol
12:14:40.663 [ERROR] [system.err] import android.net.wifi.WifiSsid;
12:14:40.663 [ERROR] [system.err] ^
12:14:40.663 [ERROR] [system.err] symbol: class WifiSsid
12:14:40.663 [ERROR] [system.err] location: package android.net.wifi
12:14:40.669 [ERROR] [system.err] /home/josh/AndroidN-ify/app/src/main/java/tk/wasdennnoch/androidn_ify/settings/summaries/categories/DeviceTweaks.java:11: error: cannot find symbol
12:14:40.669 [ERROR] [system.err] import android.os.BatteryStats;
12:14:40.669 [ERROR] [system.err] ^
12:14:40.669 [ERROR] [system.err] symbol: class BatteryStats
12:14:40.669 [ERROR] [system.err] location: package android.os
12:14:40.674 [ERROR] [system.err] /home/josh/AndroidN-ify/app/src/main/java/tk/wasdennnoch/androidn_ify/settings/summaries/categories/DeviceTweaks.java:20: error: package com.android.internal.os does not exist
12:14:40.674 [ERROR] [system.err] import com.android.internal.os.BatteryStatsHelper;
12:14:40.674 [ERROR] [system.err] ^
12:14:40.675 [ERROR] [system.err] /home/josh/AndroidN-ify/app/src/main/java/tk/wasdennnoch/androidn_ify/settings/summaries/categories/DeviceTweaks.java:21: error: cannot find symbol
12:14:40.675 [ERROR] [system.err] import com.android.internal.util.MemInfoReader;
12:14:40.675 [ERROR] [system.err] ^
12:14:40.675 [ERROR] [system.err] symbol: class MemInfoReader
12:14:40.675 [ERROR] [system.err] location: package com.android.internal.util
12:14:40.683 [ERROR] [system.err] /home/josh/AndroidN-ify/app/src/main/java/tk/wasdennnoch/androidn_ify/recents/doubletap/DoubleTapHwKeys.java:8: error: cannot find symbol
12:14:40.684 [ERROR] [system.err] import android.view.IWindowManager;
12:14:40.684 [ERROR] [system.err] ^
12:14:40.684 [ERROR] [system.err] symbol: class IWindowManager
12:14:40.684 [ERROR] [system.err] location: package android.view
12:14:40.684 [ERROR] [system.err] /home/josh/AndroidN-ify/app/src/main/java/tk/wasdennnoch/androidn_ify/recents/doubletap/DoubleTapHwKeys.java:10: error: cannot find symbol
12:14:40.684 [ERROR] [system.err] import android.view.WindowManagerPolicy;
12:14:40.684 [ERROR] [system.err] ^
12:14:40.684 [ERROR] [system.err] symbol: class WindowManagerPolicy
12:14:40.685 [ERROR] [system.err] location: package android.view
12:14:40.686 [ERROR] [system.err] /home/josh/AndroidN-ify/app/src/main/java/tk/wasdennnoch/androidn_ify/utils/StringUtils.java:3: error: cannot find symbol
12:14:40.686 [ERROR] [system.err] import android.annotation.NonNull;
12:14:40.686 [ERROR] [system.err] ^
12:14:40.686 [ERROR] [system.err] symbol: class NonNull
12:14:40.686 [ERROR] [system.err] location: package android.annotation
12:14:40.686 [ERROR] [system.err] /home/josh/AndroidN-ify/app/src/main/java/tk/wasdennnoch/androidn_ify/utils/StringUtils.java:4: error: cannot find symbol
12:14:40.686 [ERROR] [system.err] import android.annotation.StringRes;
12:14:40.687 [ERROR] [system.err] ^
12:14:40.687 [ERROR] [system.err] symbol: class StringRes
12:14:40.687 [ERROR] [system.err] location: package android.annotation
12:14:40.688 [ERROR] [system.err] /home/josh/AndroidN-ify/app/src/main/java/tk/wasdennnoch/androidn_ify/utils/ResourceUtils.java:3: error: cannot find symbol
12:14:40.688 [ERROR] [system.err] import android.annotation.DimenRes;
12:14:40.688 [ERROR] [system.err] ^
12:14:40.688 [ERROR] [system.err] symbol: class DimenRes
12:14:40.688 [ERROR] [system.err] location: package android.annotation
12:14:40.689 [ERROR] [system.err] /home/josh/AndroidN-ify/app/src/main/java/tk/wasdennnoch/androidn_ify/utils/ResourceUtils.java:4: error: cannot find symbol
12:14:40.689 [ERROR] [system.err] import android.annotation.DrawableRes;
12:14:40.689 [ERROR] [system.err] ^
12:14:40.689 [ERROR] [system.err] symbol: class DrawableRes
12:14:40.689 [ERROR] [system.err] location: package android.annotation
12:14:40.689 [ERROR] [system.err] /home/josh/AndroidN-ify/app/src/main/java/tk/wasdennnoch/androidn_ify/utils/ResourceUtils.java:5: error: cannot find symbol
12:14:40.689 [ERROR] [system.err] import android.annotation.NonNull;
12:14:40.690 [ERROR] [system.err] ^
12:14:40.690 [ERROR] [system.err] symbol: class NonNull
12:14:40.690 [ERROR] [system.err] location: package android.annotation
12:14:40.691 [ERROR] [system.err] /home/josh/AndroidN-ify/app/src/main/java/tk/wasdennnoch/androidn_ify/extracted/MobileDataController.java:5: error: cannot find symbol
12:14:40.691 [ERROR] [system.err] import android.net.INetworkStatsService;
12:14:40.691 [ERROR] [system.err] ^
12:14:40.691 [ERROR] [system.err] symbol: class INetworkStatsService
12:14:40.691 [ERROR] [system.err] location: package android.net
12:14:40.692 [ERROR] [system.err] /home/josh/AndroidN-ify/app/src/main/java/tk/wasdennnoch/androidn_ify/extracted/MobileDataController.java:6: error: cannot find symbol
12:14:40.692 [ERROR] [system.err] import android.net.INetworkStatsSession;
12:14:40.692 [ERROR] [system.err] ^
12:14:40.692 [ERROR] [system.err] symbol: class INetworkStatsSession
12:14:40.692 [ERROR] [system.err] location: package android.net
12:14:40.692 [ERROR] [system.err] /home/josh/AndroidN-ify/app/src/main/java/tk/wasdennnoch/androidn_ify/extracted/MobileDataController.java:7: error: cannot find symbol
12:14:40.692 [ERROR] [system.err] import android.net.NetworkPolicy;
12:14:40.693 [ERROR] [system.err] ^
12:14:40.693 [ERROR] [system.err] symbol: class NetworkPolicy
12:14:40.693 [ERROR] [system.err] location: package android.net
12:14:40.693 [ERROR] [system.err] /home/josh/AndroidN-ify/app/src/main/java/tk/wasdennnoch/androidn_ify/extracted/MobileDataController.java:8: error: cannot find symbol
12:14:40.693 [ERROR] [system.err] import android.net.NetworkPolicyManager;
12:14:40.693 [ERROR] [system.err] ^
12:14:40.693 [ERROR] [system.err] symbol: class NetworkPolicyManager
12:14:40.693 [ERROR] [system.err] location: package android.net
12:14:40.694 [ERROR] [system.err] /home/josh/AndroidN-ify/app/src/main/java/tk/wasdennnoch/androidn_ify/extracted/MobileDataController.java:9: error: cannot find symbol
12:14:40.694 [ERROR] [system.err] import android.net.NetworkStatsHistory;
12:14:40.694 [ERROR] [system.err] ^
12:14:40.694 [ERROR] [system.err] symbol: class NetworkStatsHistory
12:14:40.694 [ERROR] [system.err] location: package android.net
12:14:40.695 [ERROR] [system.err] /home/josh/AndroidN-ify/app/src/main/java/tk/wasdennnoch/androidn_ify/extracted/MobileDataController.java:10: error: cannot find symbol
12:14:40.695 [ERROR] [system.err] import android.net.NetworkTemplate;
12:14:40.695 [ERROR] [system.err] ^
12:14:40.695 [ERROR] [system.err] symbol: class NetworkTemplate
12:14:40.695 [ERROR] [system.err] location: package android.net
12:14:40.695 [ERROR] [system.err] /home/josh/AndroidN-ify/app/src/main/java/tk/wasdennnoch/androidn_ify/extracted/MobileDataController.java:12: error: cannot find symbol
12:14:40.696 [ERROR] [system.err] import android.os.ServiceManager;
12:14:40.696 [ERROR] [system.err] ^
12:14:40.696 [ERROR] [system.err] symbol: class ServiceManager
12:14:40.696 [ERROR] [system.err] location: package android.os
12:14:40.699 [ERROR] [system.err] /home/josh/AndroidN-ify/app/src/main/java/tk/wasdennnoch/androidn_ify/extracted/MobileDataController.java:23: error: cannot find symbol
12:14:40.699 [ERROR] [system.err] import static android.net.NetworkStatsHistory.FIELD_RX_BYTES;
12:14:40.699 [ERROR] [system.err] ^
12:14:40.699 [ERROR] [system.err] symbol: class NetworkStatsHistory
12:14:40.699 [ERROR] [system.err] location: package android.net
12:14:40.699 [ERROR] [system.err] /home/josh/AndroidN-ify/app/src/main/java/tk/wasdennnoch/androidn_ify/extracted/MobileDataController.java:23: error: static import only from classes and interfaces
12:14:40.699 [ERROR] [system.err] import static android.net.NetworkStatsHistory.FIELD_RX_BYTES;
12:14:40.699 [ERROR] [system.err] ^
12:14:40.700 [ERROR] [system.err] /home/josh/AndroidN-ify/app/src/main/java/tk/wasdennnoch/androidn_ify/extracted/MobileDataController.java:24: error: cannot find symbol
12:14:40.700 [ERROR] [system.err] import static android.net.NetworkStatsHistory.FIELD_TX_BYTES;
12:14:40.700 [ERROR] [system.err] ^
12:14:40.700 [ERROR] [system.err] symbol: class NetworkStatsHistory
12:14:40.700 [ERROR] [system.err] location: package android.net
12:14:40.700 [ERROR] [system.err] /home/josh/AndroidN-ify/app/src/main/java/tk/wasdennnoch/androidn_ify/extracted/MobileDataController.java:24: error: static import only from classes and interfaces
12:14:40.700 [ERROR] [system.err] import static android.net.NetworkStatsHistory.FIELD_TX_BYTES;
12:14:40.700 [ERROR] [system.err] ^
12:14:40.703 [ERROR] [system.err] /home/josh/AndroidN-ify/app/src/main/java/tk/wasdennnoch/androidn_ify/extracted/MobileDataController.java:38: error: cannot find symbol
12:14:40.703 [ERROR] [system.err] private final INetworkStatsService mStatsService;
12:14:40.703 [ERROR] [system.err] ^
12:14:40.703 [ERROR] [system.err] symbol: class INetworkStatsService
12:14:40.703 [ERROR] [system.err] location: class MobileDataController
12:14:40.703 [ERROR] [system.err] /home/josh/AndroidN-ify/app/src/main/java/tk/wasdennnoch/androidn_ify/extracted/MobileDataController.java:39: error: cannot find symbol
12:14:40.703 [ERROR] [system.err] private final NetworkPolicyManager mPolicyManager;
12:14:40.703 [ERROR] [system.err] ^
12:14:40.703 [ERROR] [system.err] symbol: class NetworkPolicyManager
12:14:40.703 [ERROR] [system.err] location: class MobileDataController
12:14:40.704 [ERROR] [system.err] /home/josh/AndroidN-ify/app/src/main/java/tk/wasdennnoch/androidn_ify/extracted/MobileDataController.java:41: error: cannot find symbol
12:14:40.704 [ERROR] [system.err] private INetworkStatsSession mSession;
12:14:40.704 [ERROR] [system.err] ^
12:14:40.704 [ERROR] [system.err] symbol: class INetworkStatsSession
12:14:40.704 [ERROR] [system.err] location: class MobileDataController
12:14:40.705 [ERROR] [system.err] /home/josh/AndroidN-ify/app/src/main/java/tk/wasdennnoch/androidn_ify/extracted/MobileDataController.java:59: error: package NetworkStatsHistory does not exist
12:14:40.705 [ERROR] [system.err] private static String historyEntryToString(NetworkStatsHistory.Entry entry) {
12:14:40.705 [ERROR] [system.err] ^
12:14:40.706 [ERROR] [system.err] /home/josh/AndroidN-ify/app/src/main/java/tk/wasdennnoch/androidn_ify/extracted/MobileDataController.java:79: error: cannot find symbol
12:14:40.706 [ERROR] [system.err] private INetworkStatsSession getSession() {
12:14:40.706 [ERROR] [system.err] ^
12:14:40.706 [ERROR] [system.err] symbol: class INetworkStatsSession
12:14:40.706 [ERROR] [system.err] location: class MobileDataController
12:14:40.707 [ERROR] [system.err] /home/josh/AndroidN-ify/app/src/main/java/tk/wasdennnoch/androidn_ify/extracted/MobileDataController.java:158: error: cannot find symbol
12:14:40.707 [ERROR] [system.err] private NetworkPolicy findNetworkPolicy(NetworkTemplate template) {
12:14:40.707 [ERROR] [system.err] ^
12:14:40.707 [ERROR] [system.err] symbol: class NetworkTemplate
12:14:40.707 [ERROR] [system.err] location: class MobileDataController
12:14:40.707 [ERROR] [system.err] /home/josh/AndroidN-ify/app/src/main/java/tk/wasdennnoch/androidn_ify/extracted/MobileDataController.java:158: error: cannot find symbol
12:14:40.707 [ERROR] [system.err] private NetworkPolicy findNetworkPolicy(NetworkTemplate template) {
12:14:40.707 [ERROR] [system.err] ^
12:14:40.707 [ERROR] [system.err] symbol: class NetworkPolicy
12:14:40.708 [ERROR] [system.err] location: class MobileDataController
12:14:40.708 [ERROR] [system.err] /home/josh/AndroidN-ify/app/src/main/java/tk/wasdennnoch/androidn_ify/extracted/TouchAnimator.java:7: error: cannot find symbol
12:14:40.708 [ERROR] [system.err] import android.util.FloatProperty;
12:14:40.708 [ERROR] [system.err] ^
12:14:40.708 [ERROR] [system.err] symbol: class FloatProperty
12:14:40.708 [ERROR] [system.err] location: package android.util
12:14:40.709 [ERROR] [system.err] /home/josh/AndroidN-ify/app/src/main/java/tk/wasdennnoch/androidn_ify/extracted/TouchAnimator.java:8: error: cannot find symbol
12:14:40.709 [ERROR] [system.err] import android.util.MathUtils;
12:14:40.709 [ERROR] [system.err] ^
12:14:40.709 [ERROR] [system.err] symbol: class MathUtils
12:14:40.709 [ERROR] [system.err] location: package android.util
12:14:40.710 [ERROR] [system.err] /home/josh/AndroidN-ify/app/src/main/java/tk/wasdennnoch/androidn_ify/extracted/TouchAnimator.java:170: error: cannot find symbol
12:14:40.710 [ERROR] [system.err] private static final FloatProperty POSITION = new FloatProperty("position") {
12:14:40.710 [ERROR] [system.err] ^
12:14:40.710 [ERROR] [system.err] symbol: class FloatProperty
12:14:40.710 [ERROR] [system.err] location: class TouchAnimator
12:14:40.726 [ERROR] [system.err] /home/josh/AndroidN-ify/app/src/main/java/tk/wasdennnoch/androidn_ify/utils/StringUtils.java:37: error: cannot find symbol
12:14:40.726 [ERROR] [system.err] public final String getString(@StringRes int resId) {
12:14:40.726 [ERROR] [system.err] ^
12:14:40.726 [ERROR] [system.err] symbol: class StringRes
12:14:40.726 [ERROR] [system.err] location: class StringUtils
12:14:40.727 [ERROR] [system.err] /home/josh/AndroidN-ify/app/src/main/java/tk/wasdennnoch/androidn_ify/utils/StringUtils.java:36: error: cannot find symbol
12:14:40.727 [ERROR] [system.err] @NonNull
12:14:40.727 [ERROR] [system.err] ^
12:14:40.727 [ERROR] [system.err] symbol: class NonNull
12:14:40.727 [ERROR] [system.err] location: class StringUtils
12:14:40.727 [ERROR] [system.err] /home/josh/AndroidN-ify/app/src/main/java/tk/wasdennnoch/androidn_ify/utils/StringUtils.java:42: error: cannot find symbol
12:14:40.728 [ERROR] [system.err] public final String getString(@StringRes int resId, Object... formatArgs) {
12:14:40.728 [ERROR] [system.err] ^
12:14:40.728 [ERROR] [system.err] symbol: class StringRes
12:14:40.728 [ERROR] [system.err] location: class StringUtils
12:14:40.728 [ERROR] [system.err] /home/josh/AndroidN-ify/app/src/main/java/tk/wasdennnoch/androidn_ify/utils/StringUtils.java:41: error: cannot find symbol
12:14:40.728 [ERROR] [system.err] @NonNull
12:14:40.728 [ERROR] [system.err] ^
12:14:40.728 [ERROR] [system.err] symbol: class NonNull
12:14:40.728 [ERROR] [system.err] location: class StringUtils
12:14:40.729 [ERROR] [system.err] /home/josh/AndroidN-ify/app/src/main/java/tk/wasdennnoch/androidn_ify/utils/ResourceUtils.java:38: error: cannot find symbol
12:14:40.729 [ERROR] [system.err] public final float getDimension(@DimenRes int resId) {
12:14:40.729 [ERROR] [system.err] ^
12:14:40.729 [ERROR] [system.err] symbol: class DimenRes
12:14:40.729 [ERROR] [system.err] location: class ResourceUtils
12:14:40.729 [ERROR] [system.err] /home/josh/AndroidN-ify/app/src/main/java/tk/wasdennnoch/androidn_ify/utils/ResourceUtils.java:42: error: cannot find symbol
12:14:40.729 [ERROR] [system.err] public final int getDimensionPixelSize(@DimenRes int resId) {
12:14:40.730 [ERROR] [system.err] ^
12:14:40.730 [ERROR] [system.err] symbol: class DimenRes
12:14:40.730 [ERROR] [system.err] location: class ResourceUtils
12:14:40.730 [ERROR] [system.err] /home/josh/AndroidN-ify/app/src/main/java/tk/wasdennnoch/androidn_ify/utils/ResourceUtils.java:46: error: cannot find symbol
12:14:40.730 [ERROR] [system.err] public final int getColor(@DimenRes int resId) {
12:14:40.730 [ERROR] [system.err] ^
12:14:40.730 [ERROR] [system.err] symbol: class DimenRes
12:14:40.730 [ERROR] [system.err] location: class ResourceUtils
12:14:40.731 [ERROR] [system.err] /home/josh/AndroidN-ify/app/src/main/java/tk/wasdennnoch/androidn_ify/utils/ResourceUtils.java:52: error: cannot find symbol
12:14:40.731 [ERROR] [system.err] public final Drawable getDrawable(@DrawableRes int resId) {
12:14:40.731 [ERROR] [system.err] ^
12:14:40.731 [ERROR] [system.err] symbol: class DrawableRes
12:14:40.731 [ERROR] [system.err] location: class ResourceUtils
12:14:40.731 [ERROR] [system.err] /home/josh/AndroidN-ify/app/src/main/java/tk/wasdennnoch/androidn_ify/utils/ResourceUtils.java:51: error: cannot find symbol
12:14:40.731 [ERROR] [system.err] @NonNull
12:14:40.731 [ERROR] [system.err] ^
12:14:40.731 [ERROR] [system.err] symbol: class NonNull
12:14:40.731 [ERROR] [system.err] location: class ResourceUtils
12:14:40.826 [ERROR] [system.err] /home/josh/AndroidN-ify/app/src/main/java/tk/wasdennnoch/androidn_ify/extracted/TouchAnimator2.java:25: error: cannot find symbol
12:14:40.826 [ERROR] [system.err] private static final FloatProperty POSITION = new FloatProperty("position") {
12:14:40.826 [ERROR] [system.err] ^
12:14:40.826 [ERROR] [system.err] symbol: class FloatProperty
12:14:40.826 [ERROR] [system.err] location: class TouchAnimator2
12:14:40.828 [ERROR] [system.err] /home/josh/AndroidN-ify/app/src/main/java/tk/wasdennnoch/androidn_ify/extracted/TouchAnimator2.java:60: error: cannot find symbol
12:14:40.828 [ERROR] [system.err] float f = MathUtils.constrain((paramFloat - mStartDelay) / mSpan, 0.0F, 1.0F);
12:14:40.828 [ERROR] [system.err] ^
12:14:40.828 [ERROR] [system.err] symbol: variable MathUtils
12:14:40.828 [ERROR] [system.err] location: class TouchAnimator2
12:14:40.937 [ERROR] [system.err] /home/josh/AndroidN-ify/app/src/main/java/tk/wasdennnoch/androidn_ify/settings/summaries/categories/WirelessAndNetworksTweaks.java:31: error: cannot find symbol
12:14:40.937 [ERROR] [system.err] if (!ssid.equals(WifiSsid.NONE)) {
12:14:40.937 [ERROR] [system.err] ^
12:14:40.937 [ERROR] [system.err] symbol: variable WifiSsid
12:14:40.937 [ERROR] [system.err] location: class WirelessAndNetworksTweaks
12:14:40.946 [ERROR] [system.err] /home/josh/AndroidN-ify/app/src/main/java/tk/wasdennnoch/androidn_ify/settings/summaries/categories/DeviceTweaks.java:82: error: cannot find symbol
12:14:40.946 [ERROR] [system.err] BatteryStatsHelper batteryStatsHelper = new BatteryStatsHelper(context, false);
12:14:40.946 [ERROR] [system.err] ^
12:14:40.946 [ERROR] [system.err] symbol: class BatteryStatsHelper
12:14:40.946 [ERROR] [system.err] location: class DeviceTweaks
12:14:40.946 [ERROR] [system.err] /home/josh/AndroidN-ify/app/src/main/java/tk/wasdennnoch/androidn_ify/settings/summaries/categories/DeviceTweaks.java:82: error: cannot find symbol
12:14:40.947 [ERROR] [system.err] BatteryStatsHelper batteryStatsHelper = new BatteryStatsHelper(context, false);
12:14:40.947 [ERROR] [system.err] ^
12:14:40.947 [ERROR] [system.err] symbol: class BatteryStatsHelper
12:14:40.947 [ERROR] [system.err] location: class DeviceTweaks
12:14:40.947 [ERROR] [system.err] /home/josh/AndroidN-ify/app/src/main/java/tk/wasdennnoch/androidn_ify/settings/summaries/categories/DeviceTweaks.java:84: error: cannot find symbol
12:14:40.947 [ERROR] [system.err] BatteryStats batteryStats = batteryStatsHelper.getStats();
12:14:40.947 [ERROR] [system.err] ^
12:14:40.947 [ERROR] [system.err] symbol: class BatteryStats
12:14:40.947 [ERROR] [system.err] location: class DeviceTweaks
12:14:40.950 [ERROR] [system.err] /home/josh/AndroidN-ify/app/src/main/java/tk/wasdennnoch/androidn_ify/settings/summaries/categories/DeviceTweaks.java:109: error: cannot find symbol
12:14:40.950 [ERROR] [system.err] MemInfoReader mMemInfoReader = new MemInfoReader();
12:14:40.950 [ERROR] [system.err] ^
12:14:40.950 [ERROR] [system.err] symbol: class MemInfoReader
12:14:40.950 [ERROR] [system.err] location: class DeviceTweaks
12:14:40.951 [ERROR] [system.err] /home/josh/AndroidN-ify/app/src/main/java/tk/wasdennnoch/androidn_ify/settings/summaries/categories/DeviceTweaks.java:109: error: cannot find symbol
12:14:40.951 [ERROR] [system.err] MemInfoReader mMemInfoReader = new MemInfoReader();
12:14:40.951 [ERROR] [system.err] ^
12:14:40.951 [ERROR] [system.err] symbol: class MemInfoReader
12:14:40.951 [ERROR] [system.err] location: class DeviceTweaks
12:14:40.988 [ERROR] [system.err] /home/josh/AndroidN-ify/app/src/main/java/tk/wasdennnoch/androidn_ify/recents/doubletap/DoubleTapHwKeys.java:89: error: cannot find symbol
12:14:40.988 [ERROR] [system.err] XposedHelpers.findAndHookMethod(classPhoneWindowManager, "init", Context.class, IWindowManager.class, WindowManagerPolicy.WindowManagerFuncs.class, initHook);
12:14:40.988 [ERROR] [system.err] ^
12:14:40.988 [ERROR] [system.err] symbol: class IWindowManager
12:14:40.988 [ERROR] [system.err] location: class DoubleTapHwKeys
12:14:40.989 [ERROR] [system.err] /home/josh/AndroidN-ify/app/src/main/java/tk/wasdennnoch/androidn_ify/recents/doubletap/DoubleTapHwKeys.java:89: error: package WindowManagerPolicy does not exist
12:14:40.989 [ERROR] [system.err] XposedHelpers.findAndHookMethod(classPhoneWindowManager, "init", Context.class, IWindowManager.class, WindowManagerPolicy.WindowManagerFuncs.class, initHook);
12:14:40.989 [ERROR] [system.err] ^
12:14:40.990 [ERROR] [system.err] /home/josh/AndroidN-ify/app/src/main/java/tk/wasdennnoch/androidn_ify/recents/doubletap/DoubleTapHwKeys.java:95: error: package WindowManagerPolicy does not exist
12:14:40.990 [ERROR] [system.err] XposedHelpers.findAndHookMethod(classPhoneWindowManager, "interceptKeyBeforeDispatching", WindowManagerPolicy.WindowState.class, KeyEvent.class, int.class, interceptKeyBeforeDispatchingHook);
12:14:40.990 [ERROR] [system.err] ^
12:14:40.995 [ERROR] [system.err] /home/josh/AndroidN-ify/app/src/main/java/tk/wasdennnoch/androidn_ify/extracted/MobileDataController.java:32: error: cannot find symbol
12:14:40.996 [ERROR] [system.err] private static final int FIELDS = FIELD_RX_BYTES | FIELD_TX_BYTES;
12:14:40.996 [ERROR] [system.err] ^
12:14:40.996 [ERROR] [system.err] symbol: variable FIELD_RX_BYTES
12:14:40.996 [ERROR] [system.err] location: class MobileDataController
12:14:40.996 [ERROR] [system.err] /home/josh/AndroidN-ify/app/src/main/java/tk/wasdennnoch/androidn_ify/extracted/MobileDataController.java:32: error: cannot find symbol
12:14:40.996 [ERROR] [system.err] private static final int FIELDS = FIELD_RX_BYTES | FIELD_TX_BYTES;
12:14:40.996 [ERROR] [system.err] ^
12:14:40.996 [ERROR] [system.err] symbol: variable FIELD_TX_BYTES
12:14:40.996 [ERROR] [system.err] location: class MobileDataController
12:14:40.998 [ERROR] [system.err] /home/josh/AndroidN-ify/app/src/main/java/tk/wasdennnoch/androidn_ify/extracted/MobileDataController.java:47: error: cannot find symbol
12:14:40.998 [ERROR] [system.err] ServiceManager.getService(Context.NETWORK_STATS_SERVICE));
12:14:40.998 [ERROR] [system.err] ^
12:14:40.998 [ERROR] [system.err] symbol: variable ServiceManager
12:14:40.998 [ERROR] [system.err] location: class MobileDataController
12:14:40.999 [ERROR] [system.err] /home/josh/AndroidN-ify/app/src/main/java/tk/wasdennnoch/androidn_ify/extracted/MobileDataController.java:46: error: package INetworkStatsService does not exist
12:14:40.999 [ERROR] [system.err] mStatsService = INetworkStatsService.Stub.asInterface(
12:14:40.999 [ERROR] [system.err] ^
12:14:40.999 [ERROR] [system.err] /home/josh/AndroidN-ify/app/src/main/java/tk/wasdennnoch/androidn_ify/extracted/MobileDataController.java:48: error: cannot find symbol
12:14:40.999 [ERROR] [system.err] mPolicyManager = NetworkPolicyManager.from(mContext);
12:14:40.999 [ERROR] [system.err] ^
12:14:40.999 [ERROR] [system.err] symbol: variable NetworkPolicyManager
12:14:40.999 [ERROR] [system.err] location: class MobileDataController
12:14:41.043 [ERROR] [system.err] /home/josh/AndroidN-ify/app/src/main/java/tk/wasdennnoch/androidn_ify/extracted/MobileDataController.java:100: error: cannot find symbol
12:14:41.043 [ERROR] [system.err] final INetworkStatsSession session = getSession();
12:14:41.043 [ERROR] [system.err] ^
12:14:41.043 [ERROR] [system.err] symbol: class INetworkStatsSession
12:14:41.043 [ERROR] [system.err] location: class MobileDataController
12:14:41.044 [ERROR] [system.err] /home/josh/AndroidN-ify/app/src/main/java/tk/wasdennnoch/androidn_ify/extracted/MobileDataController.java:104: error: cannot find symbol
12:14:41.044 [ERROR] [system.err] final NetworkTemplate template = NetworkTemplate.buildTemplateMobileAll(subscriberId);
12:14:41.044 [ERROR] [system.err] ^
12:14:41.044 [ERROR] [system.err] symbol: class NetworkTemplate
12:14:41.044 [ERROR] [system.err] location: class MobileDataController
12:14:41.044 [ERROR] [system.err] /home/josh/AndroidN-ify/app/src/main/java/tk/wasdennnoch/androidn_ify/extracted/MobileDataController.java:104: error: cannot find symbol
12:14:41.044 [ERROR] [system.err] final NetworkTemplate template = NetworkTemplate.buildTemplateMobileAll(subscriberId);
12:14:41.044 [ERROR] [system.err] ^
12:14:41.045 [ERROR] [system.err] symbol: variable NetworkTemplate
12:14:41.045 [ERROR] [system.err] location: class MobileDataController
12:14:41.045 [ERROR] [system.err] /home/josh/AndroidN-ify/app/src/main/java/tk/wasdennnoch/androidn_ify/extracted/MobileDataController.java:105: error: cannot find symbol
12:14:41.045 [ERROR] [system.err] final NetworkPolicy policy = findNetworkPolicy(template);
12:14:41.045 [ERROR] [system.err] ^
12:14:41.045 [ERROR] [system.err] symbol: class NetworkPolicy
12:14:41.045 [ERROR] [system.err] location: class MobileDataController
12:14:41.046 [ERROR] [system.err] /home/josh/AndroidN-ify/app/src/main/java/tk/wasdennnoch/androidn_ify/extracted/MobileDataController.java:107: error: cannot find symbol
12:14:41.046 [ERROR] [system.err] final NetworkStatsHistory history = mSession.getHistoryForNetwork(template, FIELDS);
12:14:41.046 [ERROR] [system.err] ^
12:14:41.046 [ERROR] [system.err] symbol: class NetworkStatsHistory
12:14:41.046 [ERROR] [system.err] location: class MobileDataController
12:14:41.054 [ERROR] [system.err] /home/josh/AndroidN-ify/app/src/main/java/tk/wasdennnoch/androidn_ify/extracted/MobileDataController.java:134: error: package NetworkStatsHistory does not exist
12:14:41.054 [ERROR] [system.err] final NetworkStatsHistory.Entry entry = history.getValues(start, end, now, null);
12:14:41.055 [ERROR] [system.err] ^
12:14:41.061 [ERROR] [system.err] /home/josh/AndroidN-ify/app/src/main/java/tk/wasdennnoch/androidn_ify/extracted/MobileDataController.java:160: error: cannot find symbol
12:14:41.062 [ERROR] [system.err] final NetworkPolicy[] policies = mPolicyManager.getNetworkPolicies();
12:14:41.062 [ERROR] [system.err] ^
12:14:41.062 [ERROR] [system.err] symbol: class NetworkPolicy
12:14:41.062 [ERROR] [system.err] location: class MobileDataController
12:14:41.062 [ERROR] [system.err] /home/josh/AndroidN-ify/app/src/main/java/tk/wasdennnoch/androidn_ify/extracted/MobileDataController.java:162: error: cannot find symbol
12:14:41.062 [ERROR] [system.err] for (final NetworkPolicy policy : policies) {
12:14:41.062 [ERROR] [system.err] ^
12:14:41.063 [ERROR] [system.err] symbol: class NetworkPolicy
12:14:41.063 [ERROR] [system.err] location: class MobileDataController
12:14:41.076 [ERROR] [system.err] /home/josh/AndroidN-ify/app/src/main/java/tk/wasdennnoch/androidn_ify/extracted/TouchAnimator.java:170: error: cannot find symbol
12:14:41.077 [ERROR] [system.err] private static final FloatProperty POSITION = new FloatProperty("position") {
12:14:41.077 [ERROR] [system.err] ^
12:14:41.077 [ERROR] [system.err] symbol: class FloatProperty
12:14:41.077 [ERROR] [system.err] location: class TouchAnimator
12:14:41.078 [ERROR] [system.err] /home/josh/AndroidN-ify/app/src/main/java/tk/wasdennnoch/androidn_ify/extracted/TouchAnimator.java:210: error: cannot find symbol
12:14:41.078 [ERROR] [system.err] float f1 = MathUtils.constrain((f - mStartDelay) / mSpan, 0.0F, 1.0F);
12:14:41.078 [ERROR] [system.err] ^
12:14:41.078 [ERROR] [system.err] symbol: variable MathUtils
12:14:41.078 [ERROR] [system.err] location: class TouchAnimator
12:14:41.081 [ERROR] [system.err] Note: Some input files use or override a deprecated API.
12:14:41.082 [ERROR] [system.err] Note: Recompile with -Xlint:deprecation for details.
12:14:41.082 [ERROR] [system.err] Note: /home/josh/AndroidN-ify/app/src/main/java/tk/wasdennnoch/androidn_ify/extracted/TouchAnimator.java uses unchecked or unsafe operations.
12:14:41.082 [ERROR] [system.err] Note: Recompile with -Xlint:unchecked for details.
12:14:41.082 [ERROR] [system.err] 70 errors
12:14:41.084 [DEBUG] [org.gradle.api.internal.tasks.execution.ExecuteAtMostOnceTaskExecuter] Finished executing task ':app:compileDebugJava'
12:14:41.084 [LIFECYCLE] [class org.gradle.TaskExecutionLogger] :app:compileDebugJava FAILED
12:14:41.086 [INFO] [org.gradle.execution.taskgraph.AbstractTaskPlanExecutor] :app:compileDebugJava (Thread[main,5,main]) completed. Took 0.967 secs.
12:14:41.086 [DEBUG] [org.gradle.execution.taskgraph.AbstractTaskPlanExecutor] Task worker [Thread[main,5,main]] finished, busy: 1.22 secs, idle: 0.005 secs
12:14:41.093 [ERROR] [org.gradle.BuildExceptionReporter]
12:14:41.094 [ERROR] [org.gradle.BuildExceptionReporter] FAILURE: Build failed with an exception.
12:14:41.094 [ERROR] [org.gradle.BuildExceptionReporter]
12:14:41.094 [ERROR] [org.gradle.BuildExceptionReporter] * What went wrong:
12:14:41.094 [ERROR] [org.gradle.BuildExceptionReporter] Execution failed for task ':app:compileDebugJava'.
12:14:41.095 [ERROR] [org.gradle.BuildExceptionReporter] > Compilation failed; see the compiler error output for details.
12:14:41.095 [ERROR] [org.gradle.BuildExceptionReporter]
12:14:41.095 [ERROR] [org.gradle.BuildExceptionReporter] * Exception is:
12:14:41.096 [ERROR] [org.gradle.BuildExceptionReporter] org.gradle.api.tasks.TaskExecutionException: Execution failed for task ':app:compileDebugJava'.
12:14:41.096 [ERROR] [org.gradle.BuildExceptionReporter] at org.gradle.api.internal.tasks.execution.ExecuteActionsTaskExecuter.executeActions(ExecuteActionsTaskExecuter.java:69)
12:14:41.096 [ERROR] [org.gradle.BuildExceptionReporter] at org.gradle.api.internal.tasks.execution.ExecuteActionsTaskExecuter.execute(ExecuteActionsTaskExecuter.java:46)
12:14:41.096 [ERROR] [org.gradle.BuildExceptionReporter] at org.gradle.api.internal.tasks.execution.PostExecutionAnalysisTaskExecuter.execute(PostExecutionAnalysisTaskExecuter.java:35)
12:14:41.097 [ERROR] [org.gradle.BuildExceptionReporter] at org.gradle.api.internal.tasks.execution.SkipUpToDateTaskExecuter.execute(SkipUpToDateTaskExecuter.java:64)
12:14:41.097 [ERROR] [org.gradle.BuildExceptionReporter] at org.gradle.api.internal.tasks.execution.ValidatingTaskExecuter.execute(ValidatingTaskExecuter.java:58)
12:14:41.097 [ERROR] [org.gradle.BuildExceptionReporter] at org.gradle.api.internal.tasks.execution.SkipEmptySourceFilesTaskExecuter.execute(SkipEmptySourceFilesTaskExecuter.java:42)
12:14:41.097 [ERROR] [org.gradle.BuildExceptionReporter] at org.gradle.api.internal.tasks.execution.SkipTaskWithNoActionsExecuter.execute(SkipTaskWithNoActionsExecuter.java:52)
12:14:41.097 [ERROR] [org.gradle.BuildExceptionReporter] at org.gradle.api.internal.tasks.execution.SkipOnlyIfTaskExecuter.execute(SkipOnlyIfTaskExecuter.java:53)
12:14:41.097 [ERROR] [org.gradle.BuildExceptionReporter] at org.gradle.api.internal.tasks.execution.ExecuteAtMostOnceTaskExecuter.execute(ExecuteAtMostOnceTaskExecuter.java:43)
12:14:41.097 [ERROR] [org.gradle.BuildExceptionReporter] at org.gradle.api.internal.AbstractTask.executeWithoutThrowingTaskFailure(AbstractTask.java:305)
12:14:41.097 [ERROR] [org.gradle.BuildExceptionReporter] at org.gradle.execution.taskgraph.AbstractTaskPlanExecutor$TaskExecutorWorker.executeTask(AbstractTaskPlanExecutor.java:79)
12:14:41.097 [ERROR] [org.gradle.BuildExceptionReporter] at org.gradle.execution.taskgraph.AbstractTaskPlanExecutor$TaskExecutorWorker.processTask(AbstractTaskPlanExecutor.java:63)
12:14:41.098 [ERROR] [org.gradle.BuildExceptionReporter] at org.gradle.execution.taskgraph.AbstractTaskPlanExecutor$TaskExecutorWorker.run(AbstractTaskPlanExecutor.java:51)
12:14:41.098 [ERROR] [org.gradle.BuildExceptionReporter] at org.gradle.execution.taskgraph.DefaultTaskPlanExecutor.process(DefaultTaskPlanExecutor.java:23)
12:14:41.098 [ERROR] [org.gradle.BuildExceptionReporter] at org.gradle.execution.taskgraph.DefaultTaskGraphExecuter.execute(DefaultTaskGraphExecuter.java:88)
12:14:41.098 [ERROR] [org.gradle.BuildExceptionReporter] at org.gradle.execution.SelectedTaskExecutionAction.execute(SelectedTaskExecutionAction.java:29)
12:14:41.098 [ERROR] [org.gradle.BuildExceptionReporter] at org.gradle.execution.DefaultBuildExecuter.execute(DefaultBuildExecuter.java:62)
12:14:41.098 [ERROR] [org.gradle.BuildExceptionReporter] at org.gradle.execution.DefaultBuildExecuter.access$200(DefaultBuildExecuter.java:23)
12:14:41.098 [ERROR] [org.gradle.BuildExceptionReporter] at org.gradle.execution.DefaultBuildExecuter$2.proceed(DefaultBuildExecuter.java:68)
12:14:41.098 [ERROR] [org.gradle.BuildExceptionReporter] at org.gradle.execution.DryRunBuildExecutionAction.execute(DryRunBuildExecutionAction.java:32)
12:14:41.098 [ERROR] [org.gradle.BuildExceptionReporter] at org.gradle.execution.DefaultBuildExecuter.execute(DefaultBuildExecuter.java:62)
12:14:41.098 [ERROR] [org.gradle.BuildExceptionReporter] at org.gradle.execution.DefaultBuildExecuter.execute(DefaultBuildExecuter.java:55)
12:14:41.099 [ERROR] [org.gradle.BuildExceptionReporter] at org.gradle.initialization.DefaultGradleLauncher.doBuildStages(DefaultGradleLauncher.java:149)
12:14:41.099 [ERROR] [org.gradle.BuildExceptionReporter] at org.gradle.initialization.DefaultGradleLauncher.doBuild(DefaultGradleLauncher.java:106)
12:14:41.099 [ERROR] [org.gradle.BuildExceptionReporter] at org.gradle.initialization.DefaultGradleLauncher.run(DefaultGradleLauncher.java:86)
12:14:41.099 [ERROR] [org.gradle.BuildExceptionReporter] at org.gradle.launcher.exec.InProcessBuildActionExecuter$DefaultBuildController.run(InProcessBuildActionExecuter.java:80)
12:14:41.099 [ERROR] [org.gradle.BuildExceptionReporter] at org.gradle.launcher.cli.ExecuteBuildAction.run(ExecuteBuildAction.java:33)
12:14:41.099 [ERROR] [org.gradle.BuildExceptionReporter] at org.gradle.launcher.cli.ExecuteBuildAction.run(ExecuteBuildAction.java:24)
12:14:41.099 [ERROR] [org.gradle.BuildExceptionReporter] at org.gradle.launcher.exec.InProcessBuildActionExecuter.execute(InProcessBuildActionExecuter.java:36)
12:14:41.099 [ERROR] [org.gradle.BuildExceptionReporter] at org.gradle.launcher.exec.InProcessBuildActionExecuter.execute(InProcessBuildActionExecuter.java:26)
12:14:41.099 [ERROR] [org.gradle.BuildExceptionReporter] at org.gradle.launcher.cli.RunBuildAction.run(RunBuildAction.java:51)
12:14:41.099 [ERROR] [org.gradle.BuildExceptionReporter] at org.gradle.internal.Actions$RunnableActionAdapter.execute(Actions.java:171)
12:14:41.099 [ERROR] [org.gradle.BuildExceptionReporter] at org.gradle.launcher.cli.CommandLineActionFactory$ParseAndBuildAction.execute(CommandLineActionFactory.java:237)
12:14:41.099 [ERROR] [org.gradle.BuildExceptionReporter] at org.gradle.launcher.cli.CommandLineActionFactory$ParseAndBuildAction.execute(CommandLineActionFactory.java:210)
12:14:41.100 [ERROR] [org.gradle.BuildExceptionReporter] at org.gradle.launcher.cli.JavaRuntimeValidationAction.execute(JavaRuntimeValidationAction.java:35)
12:14:41.100 [ERROR] [org.gradle.BuildExceptionReporter] at org.gradle.launcher.cli.JavaRuntimeValidationAction.execute(JavaRuntimeValidationAction.java:24)
12:14:41.100 [ERROR] [org.gradle.BuildExceptionReporter] at org.gradle.launcher.cli.CommandLineActionFactory$WithLogging.execute(CommandLineActionFactory.java:206)
12:14:41.100 [ERROR] [org.gradle.BuildExceptionReporter] at org.gradle.launcher.cli.CommandLineActionFactory$WithLogging.execute(CommandLineActionFactory.java:169)
12:14:41.100 [ERROR] [org.gradle.BuildExceptionReporter] at org.gradle.launcher.cli.ExceptionReportingAction.execute(ExceptionReportingAction.java:33)
12:14:41.100 [ERROR] [org.gradle.BuildExceptionReporter] at org.gradle.launcher.cli.ExceptionReportingAction.execute(ExceptionReportingAction.java:22)
12:14:41.100 [ERROR] [org.gradle.BuildExceptionReporter] at org.gradle.launcher.Main.doAction(Main.java:33)
12:14:41.100 [ERROR] [org.gradle.BuildExceptionReporter] at org.gradle.launcher.bootstrap.EntryPoint.run(EntryPoint.java:45)
12:14:41.100 [ERROR] [org.gradle.BuildExceptionReporter] at org.gradle.launcher.bootstrap.ProcessBootstrap.runNoExit(ProcessBootstrap.java:54)
12:14:41.100 [ERROR] [org.gradle.BuildExceptionReporter] at org.gradle.launcher.bootstrap.ProcessBootstrap.run(ProcessBootstrap.java:35)
12:14:41.100 [ERROR] [org.gradle.BuildExceptionReporter] at org.gradle.launcher.GradleMain.main(GradleMain.java:23)
12:14:41.100 [ERROR] [org.gradle.BuildExceptionReporter] at org.gradle.wrapper.BootstrapMainStarter.start(BootstrapMainStarter.java:33)
12:14:41.100 [ERROR] [org.gradle.BuildExceptionReporter] at org.gradle.wrapper.WrapperExecutor.execute(WrapperExecutor.java:130)
12:14:41.101 [ERROR] [org.gradle.BuildExceptionReporter] at org.gradle.wrapper.GradleWrapperMain.main(GradleWrapperMain.java:48)
12:14:41.101 [ERROR] [org.gradle.BuildExceptionReporter] Caused by: org.gradle.api.internal.tasks.compile.CompilationFailedException: Compilation failed; see the compiler error output for details.
12:14:41.101 [ERROR] [org.gradle.BuildExceptionReporter] at org.gradle.api.internal.tasks.compile.JdkJavaCompiler.execute(JdkJavaCompiler.java:44)
12:14:41.101 [ERROR] [org.gradle.BuildExceptionReporter] at org.gradle.api.internal.tasks.compile.JdkJavaCompiler.execute(JdkJavaCompiler.java:35)
12:14:41.101 [ERROR] [org.gradle.BuildExceptionReporter] at org.gradle.api.internal.tasks.compile.NormalizingJavaCompiler.delegateAndHandleErrors(NormalizingJavaCompiler.java:97)
12:14:41.101 [ERROR] [org.gradle.BuildExceptionReporter] at org.gradle.api.internal.tasks.compile.NormalizingJavaCompiler.execute(NormalizingJavaCompiler.java:50)
12:14:41.101 [ERROR] [org.gradle.BuildExceptionReporter] at org.gradle.api.internal.tasks.compile.NormalizingJavaCompiler.execute(NormalizingJavaCompiler.java:36)
12:14:41.101 [ERROR] [org.gradle.BuildExceptionReporter] at org.gradle.api.internal.tasks.compile.CleaningJavaCompilerSupport.execute(CleaningJavaCompilerSupport.java:34)
12:14:41.101 [ERROR] [org.gradle.BuildExceptionReporter] at org.gradle.api.internal.tasks.compile.CleaningJavaCompilerSupport.execute(CleaningJavaCompilerSupport.java:25)
12:14:41.101 [ERROR] [org.gradle.BuildExceptionReporter] at org.gradle.api.tasks.compile.JavaCompile.performCompilation(JavaCompile.java:158)
12:14:41.101 [ERROR] [org.gradle.BuildExceptionReporter] at org.gradle.api.tasks.compile.JavaCompile.compile(JavaCompile.java:138)
12:14:41.101 [ERROR] [org.gradle.BuildExceptionReporter] at org.gradle.api.tasks.compile.JavaCompile.compile(JavaCompile.java:92)
12:14:41.101 [ERROR] [org.gradle.BuildExceptionReporter] at org.gradle.internal.reflect.JavaMethod.invoke(JavaMethod.java:63)
12:14:41.101 [ERROR] [org.gradle.BuildExceptionReporter] at org.gradle.api.internal.project.taskfactory.AnnotationProcessingTaskFactory$IncrementalTaskAction.doExecute(AnnotationProcessingTaskFactory.java:235)
12:14:41.102 [ERROR] [org.gradle.BuildExceptionReporter] at org.gradle.api.internal.project.taskfactory.AnnotationProcessingTaskFactory$StandardTaskAction.execute(AnnotationProcessingTaskFactory.java:211)
12:14:41.102 [ERROR] [org.gradle.BuildExceptionReporter] at org.gradle.api.internal.project.taskfactory.AnnotationProcessingTaskFactory$IncrementalTaskAction.execute(AnnotationProcessingTaskFactory.java:222)
12:14:41.102 [ERROR] [org.gradle.BuildExceptionReporter] at org.gradle.api.internal.project.taskfactory.AnnotationProcessingTaskFactory$StandardTaskAction.execute(AnnotationProcessingTaskFactory.java:200)
12:14:41.102 [ERROR] [org.gradle.BuildExceptionReporter] at org.gradle.api.internal.tasks.execution.ExecuteActionsTaskExecuter.executeAction(ExecuteActionsTaskExecuter.java:80)
12:14:41.102 [ERROR] [org.gradle.BuildExceptionReporter] at org.gradle.api.internal.tasks.execution.ExecuteActionsTaskExecuter.executeActions(ExecuteActionsTaskExecuter.java:61)
12:14:41.102 [ERROR] [org.gradle.BuildExceptionReporter] ... 47 more
12:14:41.102 [ERROR] [org.gradle.BuildExceptionReporter]
12:14:41.102 [LIFECYCLE] [org.gradle.BuildResultLogger]
12:14:41.102 [LIFECYCLE] [org.gradle.BuildResultLogger] BUILD FAILED
12:14:41.102 [LIFECYCLE] [org.gradle.BuildResultLogger]
12:14:41.102 [LIFECYCLE] [org.gradle.BuildResultLogger] Total time: 6.295 secs
12:14:41.109 [DEBUG] [org.gradle.api.internal.tasks.compile.daemon.CompilerDaemonManager] Stopping 0 compiler daemon(s).
12:14:41.109 [INFO] [org.gradle.api.internal.tasks.compile.daemon.CompilerDaemonManager] Stopped 0 compiler daemon(s).
12:14:41.110 [DEBUG] [org.gradle.cache.internal.DefaultFileLockManager] Releasing lock on buildscript class cache for settings file '/home/josh/AndroidN-ify/settings.gradle' (/home/josh/.gradle/caches/2.2/scripts/settings_cj0dezzn9ypvmt0ekb7itqae2/SettingsScript/buildscript).
12:14:41.111 [DEBUG] [org.gradle.cache.internal.DefaultFileLockManager] Releasing lock on no_buildscript class cache for settings file '/home/josh/AndroidN-ify/settings.gradle' (/home/josh/.gradle/caches/2.2/scripts/settings_cj0dezzn9ypvmt0ekb7itqae2/SettingsScript/no_buildscript).
12:14:41.111 [DEBUG] [org.gradle.cache.internal.DefaultFileLockManager] Releasing lock on buildscript class cache for build file '/home/josh/AndroidN-ify/build.gradle' (/home/josh/.gradle/caches/2.2/scripts/build_42yf2uvlfewnck4p2tlhrwowm/ProjectScript/buildscript).
12:14:41.111 [DEBUG] [org.gradle.cache.internal.DefaultFileLockManager] Releasing lock on no_buildscript class cache for build file '/home/josh/AndroidN-ify/build.gradle' (/home/josh/.gradle/caches/2.2/scripts/build_42yf2uvlfewnck4p2tlhrwowm/ProjectScript/no_buildscript).
12:14:41.111 [DEBUG] [org.gradle.cache.internal.DefaultFileLockManager] Releasing lock on buildscript class cache for build file '/home/josh/AndroidN-ify/app/build.gradle' (/home/josh/.gradle/caches/2.2/scripts/build_2a0iklsupdsxhp83t5yayx4xn/ProjectScript/buildscript).
12:14:41.111 [DEBUG] [org.gradle.cache.internal.DefaultFileLockManager] Releasing lock on no_buildscript class cache for build file '/home/josh/AndroidN-ify/app/build.gradle' (/home/josh/.gradle/caches/2.2/scripts/build_2a0iklsupdsxhp83t5yayx4xn/ProjectScript/no_buildscript).
12:14:41.112 [DEBUG] [org.gradle.cache.internal.btree.BTreePersistentIndexedCache] Closing cache module-metadata.bin (/home/josh/.gradle/caches/modules-2/metadata-2.14/module-metadata.bin)
12:14:41.112 [DEBUG] [org.gradle.cache.internal.btree.BTreePersistentIndexedCache] Closing cache artifact-at-repository.bin (/home/josh/.gradle/caches/modules-2/metadata-2.14/artifact-at-repository.bin)
12:14:41.112 [DEBUG] [org.gradle.cache.internal.DefaultFileLockManager] Releasing lock on artifact cache (/home/josh/.gradle/caches/modules-2).
12:14:41.113 [DEBUG] [org.gradle.cache.internal.DefaultCacheAccess] Cache Plugin Resolution Cache (/home/josh/.gradle/caches/2.2/plugin-resolution) was closed 0 times.
12:14:41.114 [DEBUG] [org.gradle.cache.internal.btree.BTreePersistentIndexedCache] Closing cache fileSnapshots.bin (/home/josh/AndroidN-ify/.gradle/2.2/taskArtifacts/fileSnapshots.bin)
12:14:41.114 [DEBUG] [org.gradle.cache.internal.btree.BTreePersistentIndexedCache] Closing cache taskArtifacts.bin (/home/josh/AndroidN-ify/.gradle/2.2/taskArtifacts/taskArtifacts.bin)
12:14:41.114 [DEBUG] [org.gradle.cache.internal.btree.BTreePersistentIndexedCache] Closing cache outputFileStates.bin (/home/josh/AndroidN-ify/.gradle/2.2/taskArtifacts/outputFileStates.bin)
12:14:41.114 [DEBUG] [org.gradle.cache.internal.btree.BTreePersistentIndexedCache] Closing cache fileHashes.bin (/home/josh/AndroidN-ify/.gradle/2.2/taskArtifacts/fileHashes.bin)
12:14:41.114 [DEBUG] [org.gradle.cache.internal.DefaultFileLockManager] Releasing lock on task history cache (/home/josh/AndroidN-ify/.gradle/2.2/taskArtifacts).
12:14:41.115 [DEBUG] [org.gradle.api.internal.artifacts.ivyservice.ivyresolve.memcache.InMemoryCachedRepositoryFactory] In-memory dependency metadata cache closed. Repos cached: 7, cache instances: 3, modules served from cache: 0, artifacts: 0
12:14:41.116 [DEBUG] [org.gradle.api.internal.artifacts.ivyservice.resolveengine.store.CachedStoreFactory] Resolution result cache closed. Cache reads: 0, disk reads: 2 (avg: 0.001 secs, total: 0.002 secs)
12:14:41.116 [DEBUG] [org.gradle.api.internal.artifacts.ivyservice.resolveengine.store.CachedStoreFactory] Resolved configuration cache closed. Cache reads: 0, disk reads: 0 (avg: 0.0 secs, total: 0.0 secs)
12:14:41.117 [DEBUG] [org.gradle.api.internal.artifacts.ivyservice.resolveengine.store.ResolutionResultsStoreFactory] Deleted 2 resolution results binary files in 0.001 secs
Sign up for free to join this conversation on GitHub. Already have an account? Sign in to comment