public
Last active

libappindicator build()

  • Download Gist
gistfile1.txt
1 2 3 4 5 6 7 8 9 10 11 12 13 14 15 16 17 18 19 20 21 22 23 24 25 26 27 28 29 30 31 32 33 34 35 36 37 38 39 40 41 42 43 44 45 46 47 48 49 50 51 52 53 54 55 56 57 58 59 60 61 62 63 64 65 66 67 68 69 70 71 72 73 74 75 76 77 78 79 80 81 82 83 84 85 86 87 88 89 90 91 92 93 94 95 96 97 98 99 100 101 102 103 104 105 106 107 108 109 110 111 112 113 114 115 116 117 118 119 120 121 122 123 124 125 126 127 128 129 130 131 132 133 134 135 136 137 138 139 140 141 142 143 144 145 146 147 148 149 150 151 152 153 154 155 156 157 158 159 160 161 162 163 164 165 166 167 168 169 170 171 172 173 174 175 176 177 178 179 180 181 182 183 184 185 186 187 188 189 190 191 192 193 194 195 196 197 198 199 200 201 202 203 204 205 206 207 208 209 210 211 212 213 214 215 216 217 218 219 220 221 222 223 224 225 226 227 228 229 230 231 232 233 234 235 236 237 238 239 240 241 242 243 244 245 246 247 248 249 250 251 252 253 254 255 256 257 258 259 260 261 262 263 264 265 266 267 268 269 270 271 272 273 274 275 276 277 278 279 280 281 282 283 284 285 286 287 288 289 290 291 292 293 294 295 296 297 298 299 300 301 302 303 304 305 306 307 308 309 310 311 312 313 314 315 316 317
==> Starting build()...
checking for a BSD-compatible install... /usr/bin/install -c
checking whether build environment is sane... yes
checking for a thread-safe mkdir -p... /usr/bin/mkdir -p
checking for gawk... gawk
checking whether make sets $(MAKE)... yes
checking how to create a pax tar archive... gnutar
checking whether to enable maintainer-specific portions of Makefiles... yes
checking whether make supports nested variables... yes
checking for gcc... gcc
checking whether the C compiler works... yes
checking for C compiler default output file name... a.out
checking for suffix of executables...
checking whether we are cross compiling... no
checking for suffix of object files... o
checking whether we are using the GNU C compiler... yes
checking whether gcc accepts -g... yes
checking for gcc option to accept ISO C89... none needed
checking for style of include used by make... GNU
checking dependency style of gcc... gcc3
checking whether gcc and cc understand -c and -o together... yes
checking build system type... x86_64-unknown-linux-gnu
checking host system type... x86_64-unknown-linux-gnu
checking how to print strings... printf
checking for a sed that does not truncate output... /usr/bin/sed
checking for grep that handles long lines and -e... /usr/bin/grep
checking for egrep... /usr/bin/grep -E
checking for fgrep... /usr/bin/grep -F
checking for ld used by gcc... /usr/bin/ld
checking if the linker (/usr/bin/ld) is GNU ld... yes
checking for BSD- or MS-compatible name lister (nm)... /usr/bin/nm -B
checking the name lister (/usr/bin/nm -B) interface... BSD nm
checking whether ln -s works... yes
checking the maximum length of command line arguments... 1572864
checking whether the shell understands some XSI constructs... yes
checking whether the shell understands "+="... yes
checking how to convert x86_64-unknown-linux-gnu file names to x86_64-unknown-linux-gnu format... func_convert_file_noop
checking how to convert x86_64-unknown-linux-gnu file names to toolchain format... func_convert_file_noop
checking for /usr/bin/ld option to reload object files... -r
checking for objdump... objdump
checking how to recognize dependent libraries... pass_all
checking for dlltool... no
checking how to associate runtime and link libraries... printf %s\n
checking for ar... ar
checking for archiver @FILE support... @
checking for strip... strip
checking for ranlib... ranlib
checking command to parse /usr/bin/nm -B output from gcc object... ok
checking for sysroot... no
checking for mt... no
checking if : is a manifest tool... no
checking how to run the C preprocessor... gcc -E
checking for ANSI C header files... yes
checking for sys/types.h... yes
checking for sys/stat.h... yes
checking for stdlib.h... yes
checking for string.h... yes
checking for memory.h... yes
checking for strings.h... yes
checking for inttypes.h... yes
checking for stdint.h... yes
checking for unistd.h... yes
checking for dlfcn.h... yes
checking for objdir... .libs
checking if gcc supports -fno-rtti -fno-exceptions... no
checking for gcc option to produce PIC... -fPIC -DPIC
checking if gcc PIC flag -fPIC -DPIC works... yes
checking if gcc static flag -static works... yes
checking if gcc supports -c -o file.o... yes
checking if gcc supports -c -o file.o... (cached) yes
checking whether the gcc linker (/usr/bin/ld -m elf_x86_64) supports shared libraries... yes
checking whether -lc should be explicitly linked in... no
checking dynamic linker characteristics... GNU/Linux ld.so
checking how to hardcode library paths into programs... immediate
checking whether stripping libraries is possible... yes
checking if libtool supports shared libraries... yes
checking whether to build shared libraries... yes
checking whether to build static libraries... no
checking for glib-mkenums... /usr/bin/glib-mkenums
checking for glib-genmarshal... /usr/bin/glib-genmarshal
checking for pkg-config... /usr/bin/pkg-config
checking pkg-config is at least version 0.9.0... yes
checking for gtkdoc-check... no
checking for gtkdoc-rebase... no
checking for gtkdoc-mkpdf... no
checking whether to build gtk-doc documentation... no
checking for LIBRARY... yes
checking for TESTDEPS... yes
checking for gobject-introspection... yes
checking for vapigen... /usr/bin/vapigen
checking for valac... /usr/bin/valac
checking /usr/bin/valac is at least version 0.14.0... yes
checking for MONO_DEPENDENCY... yes
checking for al... /usr/bin/al
checking for mono... /usr/bin/mono
checking for gmcs... /usr/bin/gmcs
checking for gacutil... /usr/bin/gacutil
checking for GTK_SHARP... yes
checking for GAPI... yes
checking for gapi2-parser... /usr/bin/gapi2-parser
checking for gapi2-codegen... /usr/bin/gapi2-codegen
checking for gapi2-fixup... /usr/bin/gapi2-fixup
checking for NUNIT... no
checking for MONO_NUNIT... yes
checking for a Python interpreter with version >= 2.3.5... python2
checking for python2... /usr/bin/python2
checking for python2 version... 2.7
checking for python2 platform... linux2
checking for python2 script directory... ${prefix}/lib/python2.7/site-packages
checking for python2 extension module directory... ${exec_prefix}/lib/python2.7/site-packages
checking for headers required to compile python extensions... found
checking for APPINDICATOR_PYTHON... yes
checking for pygtk defs... /usr/share/pygtk/2.0/defs
checking for pygtk codegen... /usr/bin/python2 /usr/share/pygobject/2.0/codegen/codegen.py
configure: creating ./config.status
config.status: creating Makefile
config.status: creating src/Makefile
config.status: creating src/appindicator-0.1.pc
config.status: creating src/appindicator3-0.1.pc
config.status: creating bindings/Makefile
config.status: creating bindings/python/Makefile
config.status: creating bindings/python/appindicator.override
config.status: creating bindings/vala/Makefile
config.status: creating bindings/vala/examples/Makefile
config.status: creating tests/Makefile
config.status: creating example/Makefile
config.status: creating docs/Makefile
config.status: creating docs/reference/Makefile
config.status: creating docs/reference/version.xml
config.status: creating docs/reference/libappindicator-docs.sgml
config.status: creating bindings/mono/Makefile
config.status: creating bindings/mono/appindicator-sharp.dll.config
config.status: creating bindings/mono/appindicator-sharp-0.1.pc
config.status: creating bindings/mono/app-indicator.sources.xml
config.status: creating bindings/mono/examples/Makefile
config.status: creating bindings/mono/examples/indicator-example
config.status: creating config.h
config.status: config.h is unchanged
config.status: executing depfiles commands
config.status: executing libtool commands
configure:
 
Libappindicator Configuration:
 
Prefix: /usr
GTK+ Version: 2
Mono: true
Tests: yes
Mono tests: yes
gcov: no
 
make all-recursive
make[1]: Entering directory `/tmp/yaourt-tmp-refik/aur-libappindicator/src/libappindicator-12.10.0'
Making all in src
make[2]: Entering directory `/tmp/yaourt-tmp-refik/aur-libappindicator/src/libappindicator-12.10.0/src'
(echo "#include \"application-service-marshal.h\"" ; \
/usr/bin/glib-genmarshal \
--prefix=_application_service_marshal \
--body \
./application-service-marshal.list) > xgen-mc \
&& cp xgen-mc application-service-marshal.c \
&& rm -f xgen-mc
CC libappindicator_la-application-service-marshal.lo
CCLD libappindicator.la
GISCAN AppIndicator-0.1.gir
app-indicator.c:58: Warning: AppIndicator: '@id' parameter unexpected at this location:
* @id: The ID of the indicator. Maps to AppIndicator:id.
^
app-indicator.c:59: Warning: AppIndicator: '@category' parameter unexpected at this location:
* @category: Which category the indicator is. Maps to AppIndicator:category.
^
app-indicator.c:60: Warning: AppIndicator: '@status' parameter unexpected at this location:
* @status: The status of the indicator. Maps to AppIndicator:status.
^
app-indicator.c:61: Warning: AppIndicator: '@icon_name' parameter unexpected at this location:
* @icon_name: The name of the icon to use. Maps to AppIndicator:icon-name.
^
app-indicator.c:62: Warning: AppIndicator: '@attention_icon_name' parameter unexpected at this location:
* @attention_icon_name: The name of the attention icon to use. Maps to AppIndicator:attention-icon-name.
^
app-indicator.c:63: Warning: AppIndicator: '@menu' parameter unexpected at this location:
* @menu: The menu for this indicator. Maps to AppIndicator:menu
^
app-indicator.c:64: Warning: AppIndicator: '@watcher_proxy' parameter unexpected at this location:
* @watcher_proxy: The proxy connection to the watcher we're connected to. If we're not connected to one this will be %NULL.
^
app-indicator.c:482: Warning: AppIndicator: multiple '@arg1' parameters for identifier 'AppIndicator::new-label':
* @arg1: The string for the guide
^
app-indicator.h:243: Warning: AppIndicator: '@parent' parameter unexpected at this location:
* @parent: Parent object.
^
app-indicator.h:244: Warning: AppIndicator: '@priv' parameter unexpected at this location:
* @priv: Internal data.
^
cp -f ./AppIndicator-0.1.metadata.in AppIndicator-0.1.metadata
make all-am
make[3]: Entering directory `/tmp/yaourt-tmp-refik/aur-libappindicator/src/libappindicator-12.10.0/src'
GICOMP AppIndicator-0.1.gir
make[3]: Leaving directory `/tmp/yaourt-tmp-refik/aur-libappindicator/src/libappindicator-12.10.0/src'
make[2]: Leaving directory `/tmp/yaourt-tmp-refik/aur-libappindicator/src/libappindicator-12.10.0/src'
Making all in bindings
make[2]: Entering directory `/tmp/yaourt-tmp-refik/aur-libappindicator/src/libappindicator-12.10.0/bindings'
Making all in python
make[3]: Entering directory `/tmp/yaourt-tmp-refik/aur-libappindicator/src/libappindicator-12.10.0/bindings/python'
(/usr/bin/python2 /usr/share/pygobject/2.0/codegen/codegen.py \
--register /usr/share/pygtk/2.0/defs/gtk-types.defs \
--register /usr/share/pygtk/2.0/defs/gdk-types.defs \
--load-types ./appindicator-arg-types.py \
--override appindicator.override \
--prefix pyappindicator ./appindicator.defs) > gen-appindicator.c \
&& cp gen-appindicator.c appindicator.c \
&& rm -f gen-appindicator.c
Warning: generating old-style constructor for:app_indicator_new_with_path
Warning: Constructor for AppIndicator needs to be updated to new API
See http://live.gnome.org/PyGTK_2fWhatsNew28#update-constructors
***INFO*** The coverage of global functions is 100.00% (1/1)
***INFO*** The coverage of methods is 100.00% (20/20)
***INFO*** There are no declared virtual proxies.
***INFO*** There are no declared virtual accessors.
***INFO*** There are no declared interface proxies.
CC appindicator.lo
CCLD _appindicator.la
make[3]: Leaving directory `/tmp/yaourt-tmp-refik/aur-libappindicator/src/libappindicator-12.10.0/bindings/python'
Making all in vala
make[3]: Entering directory `/tmp/yaourt-tmp-refik/aur-libappindicator/src/libappindicator-12.10.0/bindings/vala'
Making all in .
make[4]: Entering directory `/tmp/yaourt-tmp-refik/aur-libappindicator/src/libappindicator-12.10.0/bindings/vala'
/usr/bin/vapigen --library=appindicator-0.1 --girdir=./src \
../../src/AppIndicator-0.1.gir ./appindicator-0.1-custom.vala
AppIndicator-0.1.metadata:2.16-3.16: warning: argument never used
AppIndicator-0.1.metadata:3.18-4.0: warning: argument never used
gtk+-2.0.vapi:5802.40-5802.42: warning: Gtk is deprecated. Use gtk+-3.0
Generation succeeded - 3 warning(s)
make[4]: Leaving directory `/tmp/yaourt-tmp-refik/aur-libappindicator/src/libappindicator-12.10.0/bindings/vala'
Making all in examples
make[4]: Entering directory `/tmp/yaourt-tmp-refik/aur-libappindicator/src/libappindicator-12.10.0/bindings/vala/examples'
make all-am
make[5]: Entering directory `/tmp/yaourt-tmp-refik/aur-libappindicator/src/libappindicator-12.10.0/bindings/vala/examples'
make[5]: Nothing to be done for `all-am'.
make[5]: Leaving directory `/tmp/yaourt-tmp-refik/aur-libappindicator/src/libappindicator-12.10.0/bindings/vala/examples'
make[4]: Leaving directory `/tmp/yaourt-tmp-refik/aur-libappindicator/src/libappindicator-12.10.0/bindings/vala/examples'
make[3]: Leaving directory `/tmp/yaourt-tmp-refik/aur-libappindicator/src/libappindicator-12.10.0/bindings/vala'
Making all in mono
make[3]: Entering directory `/tmp/yaourt-tmp-refik/aur-libappindicator/src/libappindicator-12.10.0/bindings/mono'
Making all in .
make[4]: Entering directory `/tmp/yaourt-tmp-refik/aur-libappindicator/src/libappindicator-12.10.0/bindings/mono'
/usr/bin/gapi2-parser app-indicator.sources.xml
mono: ../nptl/pthread_mutex_lock.c:80: __pthread_mutex_cond_lock: Assertion `mutex->__data.__owner == 0' failed.
Stacktrace:
 
at <unknown> <0xffffffff>
at System.Security.Cryptography.CryptoConfig.CreateFromName (string,object[]) <0x0006a>
at System.Security.Cryptography.CryptoConfig.CreateFromName (string) <0x0000e>
at System.Security.Cryptography.RandomNumberGenerator.Create (string) <0x0000f>
at System.Security.Cryptography.RandomNumberGenerator.Create () <0x0000f>
at System.Guid.NewGuid () <0x0005a>
at System.Xml.Schema.XmlSchemaSet..ctor (System.Xml.XmlNameTable) <0x00133>
at System.Xml.Schema.XmlSchemaSet..ctor () <0x00033>
at Mono.Xml.Schema.XsdValidatingReader..ctor (System.Xml.XmlReader) <0x00043>
at System.Xml.XmlValidatingReader.Read () <0x0011b>
at System.Xml.XmlDocument.ReadNodeCore (System.Xml.XmlReader) <0x00086>
at System.Xml.XmlDocument.ReadNode (System.Xml.XmlReader) <0x000e7>
at System.Xml.XmlDocument.Load (System.Xml.XmlReader) <0x00062>
at System.Xml.XmlDocument.Load (System.IO.Stream) <0x000bc>
at GtkSharp.Parsing.Parser.Main (string[]) <0x00168>
at (wrapper runtime-invoke) <Module>.runtime_invoke_int_object (object,intptr,intptr,intptr) <0xffffffff>
 
Native stacktrace:
 
mono() [0x4b2711]
/usr/lib/libpthread.so.0(+0xf870) [0x7f6f20bdd870]
/usr/lib/libc.so.6(gsignal+0x39) [0x7f6f208593d9]
/usr/lib/libc.so.6(abort+0x148) [0x7f6f2085a7d8]
/usr/lib/libc.so.6(+0x2e506) [0x7f6f20852506]
/usr/lib/libc.so.6(+0x2e5b2) [0x7f6f208525b2]
/usr/lib/libpthread.so.0(+0x11394) [0x7f6f20bdf394]
/usr/lib/libpthread.so.0(pthread_cond_wait+0x14f) [0x7f6f20bda0cf]
mono() [0x60daf3]
mono() [0x605d3c]
mono() [0x605eae]
mono() [0x606e87]
mono() [0x5ff45a]
mono() [0x5ffcef]
mono() [0x60045d]
mono() [0x60066e]
mono() [0x603888]
mono() [0x603992]
mono() [0x603b7b]
mono(mono_string_new_size+0x4b) [0x5af72b]
mono(mono_string_new_utf16+0x10) [0x5af7e0]
mono() [0x5af84f]
mono() [0x41f048]
mono() [0x4a6310]
mono() [0x4b41af]
[0x41110d76]
 
Debug info from gdb:
 
 
=================================================================
Got a SIGABRT while executing native code. This usually indicates
a fatal error in the mono runtime or one of the native libraries
used by your application.
=================================================================
 
/usr/bin/gapi2-parser: line 3: 10586 Aborted (core dumped) mono /usr/lib/gtk-sharp-2.0/gapi-parser.exe "$@"
make[4]: *** [libappindicator-api.raw] Error 134
make[4]: Leaving directory `/tmp/yaourt-tmp-refik/aur-libappindicator/src/libappindicator-12.10.0/bindings/mono'
make[3]: *** [all-recursive] Error 1
make[3]: Leaving directory `/tmp/yaourt-tmp-refik/aur-libappindicator/src/libappindicator-12.10.0/bindings/mono'
make[2]: *** [all-recursive] Error 1
make[2]: Leaving directory `/tmp/yaourt-tmp-refik/aur-libappindicator/src/libappindicator-12.10.0/bindings'
make[1]: *** [all-recursive] Error 1
make[1]: Leaving directory `/tmp/yaourt-tmp-refik/aur-libappindicator/src/libappindicator-12.10.0'
make: *** [all] Error 2
==> ERROR: A failure occurred in build().

Please sign in to comment on this gist.

Something went wrong with that request. Please try again.