Skip to content

Instantly share code, notes, and snippets.

Embed
What would you like to do?
Building Solution: TestCompileError (Debug|iPhoneSimulator)
Building: TestCompileError (Debug|iPhoneSimulator)
Build started 1/30/2015 10:38:32 AM.
__________________________________________________
Project "/Users/rolf/Downloads/TestCompileError/TestCompileError/TestCompileError.csproj" (Build target(s)):
Target PrepareForBuild:
Configuration: Debug Platform: iPhoneSimulator
Target _DetectAppManifest:
FindItemWithLogicalName Task
Items:
Info.plist
Entitlements.plist
LogicalName: Info.plist
ProjectDir: /Users/rolf/Downloads/TestCompileError/TestCompileError
ResourcePrefix: Resources
Target _DetectSdkLocations:
DetectSdkLocations Task
Platform: iPhoneSimulator
SdkVersion: 8.1
XamarinSdkRoot: /Library/Frameworks/Xamarin.iOS.framework/Versions/Current
Target _CoreCompileInterfaceDefinitions:
IBTool Task
AppManifest: Info.plist
InterfaceDefinitions:
Resources/LaunchScreen.xib
Views/HomeView.xib
IntermediateOutputPath: obj/iPhoneSimulator/Debug/
Platform: iPhoneSimulator
ResourcePrefix: Resources
SdkBinPath: /Applications/Xcode61.app/Contents/Developer/Platforms/iPhoneSimulator.platform/Developer/SDKs/iPhoneSimulator8.1.sdk/Developer/usr/bin
SdkRoot: /Applications/Xcode61.app/Contents/Developer/Platforms/iPhoneSimulator.platform/Developer/SDKs/iPhoneSimulator8.1.sdk
SdkVersion: 8.1
Tool /Applications/Xcode61.app/Contents/Developer/usr/bin/ibtool execution started with arguments: --errors --warnings --notices --output-format xml1 --minimum-deployment-target 8.0 --auto-activate-custom-fonts --sdk /Applications/Xcode61.app/Contents/Developer/Platforms/iPhoneSimulator.platform/Developer/SDKs/iPhoneSimulator8.1.sdk --compile /Users/rolf/Downloads/TestCompileError/TestCompileError/obj/iPhoneSimulator/Debug/ibtool/HomeView.nib /Users/rolf/Downloads/TestCompileError/TestCompileError/Views/HomeView.xib
Target _CoreCompileImageAssets:
ACTool Task
AppManifest: Info.plist
ImageAssets:
Resources/Images.xcassets/AppIcons.appiconset/Contents.json
IntermediateOutputPath: obj/iPhoneSimulator/Debug/
OptimizePNGs: True
Platform: iPhoneSimulator
ProjectDir: /Users/rolf/Downloads/TestCompileError/TestCompileError
ResourcePrefix: Resources
SdkBinPath: /Applications/Xcode61.app/Contents/Developer/Platforms/iPhoneSimulator.platform/Developer/SDKs/iPhoneSimulator8.1.sdk/Developer/usr/bin
SdkVersion: 8.1
Target _CollectColladaAssets:
CollectBundleResources Task
BundleResources: <null>
OptimizePNGs: False
ProjectDir: /Users/rolf/Downloads/TestCompileError/TestCompileError
ResourcePrefix: Resources
Target _CoreCompileColladaAssets:
No input files were specified for target _CoreCompileColladaAssets, skipping.
Target _CoreCompileSceneKitAssets:
CompileSceneKitAssets Task
IntermediateOutputPath: obj/iPhoneSimulator/Debug/
ProjectDir: /Users/rolf/Downloads/TestCompileError/TestCompileError
ResourcePrefix: Resources
SceneKitAssets:
SdkDevPath: /Applications/Xcode61.app/Contents/Developer
SdkRoot: /Applications/Xcode61.app/Contents/Developer/Platforms/iPhoneSimulator.platform/Developer/SDKs/iPhoneSimulator8.1.sdk
SdkVersion: 8.1
Target _CoreCompileTextureAtlases:
TextureAtlas Task
AtlasTextures: <null>
IntermediateOutputPath: obj/iPhoneSimulator/Debug/
ProjectDir: /Users/rolf/Downloads/TestCompileError/TestCompileError
ResourcePrefix: Resources
SdkBinPath: /Applications/Xcode61.app/Contents/Developer/Platforms/iPhoneSimulator.platform/Developer/SDKs/iPhoneSimulator8.1.sdk/Developer/usr/bin
SdkDevPath: /Applications/Xcode61.app/Contents/Developer
SdkUsrPath: /Applications/Xcode61.app/Contents/Developer/Platforms/iPhoneSimulator.platform/Developer/SDKs/iPhoneSimulator8.1.sdk/Developer/usr
Target _CollectITunesArtwork:
CollectITunesArtwork Task
ITunesArtwork: <null>
Target _CollectBundleResources:
CollectBundleResources Task
BundleResources:
OptimizePNGs: True
ProjectDir: /Users/rolf/Downloads/TestCompileError/TestCompileError
ResourcePrefix: Resources
Target _CoreOptimizePngImages:
No input files were specified for target _CoreOptimizePngImages, skipping.
Target _UnpackLibraryResources:
UnpackLibraryResources Task
IntermediateOutputPath: obj/iPhoneSimulator/Debug/
Prefix: monotouch
ReferencedLibraries:
/work/maccore/master/maccore/_build/Library/Frameworks/Xamarin.iOS.framework/Versions/Current/lib/mono/Xamarin.iOS/System.dll
/work/maccore/master/maccore/_build/Library/Frameworks/Xamarin.iOS.framework/Versions/Current/lib/mono/Xamarin.iOS/System.Xml.dll
/work/maccore/master/maccore/_build/Library/Frameworks/Xamarin.iOS.framework/Versions/Current/lib/mono/Xamarin.iOS/Xamarin.iOS.dll
/work/maccore/master/maccore/_build/Library/Frameworks/Xamarin.iOS.framework/Versions/Current/lib/mono/Xamarin.iOS/System.Core.dll
/work/maccore/master/maccore/_build/Library/Frameworks/Xamarin.iOS.framework/Versions/Current/lib/mono/Xamarin.iOS/mscorlib.dll
Target GenerateSatelliteAssemblies:
No input files were specified for target GenerateSatelliteAssemblies, skipping.
Target GenerateTargetFrameworkMonikerAttribute:
Skipping target "GenerateTargetFrameworkMonikerAttribute" because its outputs are up-to-date.
Target CoreCompile:
Skipping target "CoreCompile" because its outputs are up-to-date.
Target _DetectSigningIdentity:
DetectSigningIdentity Task
AppBundleName: TestCompileError
AppManifest: Info.plist
RequireCodesigning: True
Platform: iPhoneSimulator
ProvisioningProfile: <null>
SigningKey: iPhone Developer
Multiple provisioning profiles match the bundle identifier; using the first match.
1. Provisioning Profile: "Wildcard" (b3ce1cd1-8108-4979-a8d7-15d36857a2d3)
Signing Identity: "iPhone Developer: Rolf Kvinge (393EBW7829)"
2. Provisioning Profile: "iOSTeam Provisioning Profile: *" (ef9931e9-35a6-4df5-bdec-82afee61ef66)
Signing Identity: "iPhone Developer: Rolf Kvinge (393EBW7829)"
Detected signing identity:
Code Signing Key: "iPhone Developer: Rolf Kvinge (393EBW7829)" (C06FC374F031BC16CBD10FD27ADFDA52C2DB7556)
Provisioning Profile: "Wildcard" (b3ce1cd1-8108-4979-a8d7-15d36857a2d3)
Bundle Id: com.your-company.TestCompileError
App Id: C9D4426WFH.com.your-company.TestCompileError
Target _CopyContentToBundle:
Copying file from '/Users/rolf/Downloads/TestCompileError/TestCompileError/obj/iPhoneSimulator/Debug/ibtool/LaunchScreen.nib' to '/Users/rolf/Downloads/TestCompileError/TestCompileError/bin/iPhoneSimulator/Debug/TestCompileError.app/LaunchScreen.nib'
Copying file from '/Users/rolf/Downloads/TestCompileError/TestCompileError/obj/iPhoneSimulator/Debug/ibtool/HomeView.nib' to '/Users/rolf/Downloads/TestCompileError/TestCompileError/bin/iPhoneSimulator/Debug/TestCompileError.app/HomeView.nib'
/Library/Frameworks/Mono.framework/External/xbuild/Xamarin/iOS/Xamarin.iOS.Common.targets: error : /Users/rolf/Downloads/TestCompileError/TestCompileError/bin/iPhoneSimulator/Debug/TestCompileError.app/HomeView.nib is a directory at System.IO.File.Delete (System.String path) [0x00000] in <filename unknown>:0
at Microsoft.Build.Tasks.Copy.CopyFile (System.String source, System.String dest, Boolean create_dir) [0x00000] in <filename unknown>:0
at Microsoft.Build.Tasks.Copy.Execute () [0x00000] in <filename unknown>:0
Task "Copy" execution -- FAILED
Done building target "_CopyContentToBundle" in project "/Users/rolf/Downloads/TestCompileError/TestCompileError/TestCompileError.csproj".-- FAILED
Done building project "/Users/rolf/Downloads/TestCompileError/TestCompileError/TestCompileError.csproj".-- FAILED
Build FAILED.
Errors:
/Users/rolf/Downloads/TestCompileError/TestCompileError/TestCompileError.csproj (Build) ->
/Library/Frameworks/Mono.framework/External/xbuild/Xamarin/iOS/Xamarin.iOS.Common.targets (_CopyContentToBundle target) ->
/Library/Frameworks/Mono.framework/External/xbuild/Xamarin/iOS/Xamarin.iOS.Common.targets: error : /Users/rolf/Downloads/TestCompileError/TestCompileError/bin/iPhoneSimulator/Debug/TestCompileError.app/HomeView.nib is a directory at System.IO.File.Delete (System.String path) [0x00000] in <filename unknown>:0
at Microsoft.Build.Tasks.Copy.CopyFile (System.String source, System.String dest, Boolean create_dir) [0x00000] in <filename unknown>:0
at Microsoft.Build.Tasks.Copy.Execute () [0x00000] in <filename unknown>:0
0 Warning(s)
1 Error(s)
Time Elapsed 00:00:00.1918580
---------------------- Done ----------------------
Build: 1 error, 0 warnings
Sign up for free to join this conversation on GitHub. Already have an account? Sign in to comment
You can’t perform that action at this time.