Skip to content

Instantly share code, notes, and snippets.

Embed
What would you like to do?
Building Solution: SanityTests (Debug)
Building: SanityTests (Debug)
Build started 8/1/2013 5:33:15 PM.
__________________________________________________
Project "/Users/nischal/Desktop/19July/monodroid-samples-master/SanityTests/SanityTests.csproj" (Build target(s)):
Target BuildNativeLibs:
Skipping target "BuildNativeLibs" because its outputs are up-to-date.
Target BuildNativeJars:
Skipping target "BuildNativeJars" because its outputs are up-to-date.
Target _CheckProjectItems:
CheckProjectItems Task
NativeLibraries:
libs/armeabi/libfoo.so
libs/armeabi/libbar.so
libs/armeabi-v7a/libfoo.so
libs/armeabi-v7a/libbar.so
libs/x86/libfoo.so
libs/x86/libbar.so
JavaLibraries:
$(OutputPath)/custom.jar
JavaSourceFiles:
TestCubeEngine.java
Target _ComputeAndroidAssetsPaths:
ResourceFiles:
Assets/Hello.txt
Assets/Hello.txt
IntermediateFiles:
Target _ComputeAndroidResourcePaths:
ResourceFiles:
Resources/values/attrs.xml
Resources/drawable-hdpi/StatSample.png
Resources/drawable-mdpi/StatSample.png
Resources/drawable-ldpi/icon.png
Resources/drawable-xhdpi/icon.png
Resources/drawable-xxhdpi/icon.png
Resources/Drawable-mdpi/icon.png
IntermediateFiles:
Target _GenerateAndroidResourceDir:
Copying file from '/Users/nischal/Desktop/19July/monodroid-samples-master/SanityTests/Resources/values/attrs.xml' to '/Users/nischal/Desktop/19July/monodroid-samples-master/SanityTests/obj/Debug/res/values/attrs.xml'
/Library/Frameworks/Mono.framework/External/xbuild/Xamarin/Android/Xamarin.Android.Common.targets: error : Cannot copy /Users/nischal/Desktop/19July/monodroid-samples-master/SanityTests/Resources/Drawable-mdpi/icon.png to /Users/nischal/Desktop/19July/monodroid-samples-master/SanityTests/obj/Debug/res/drawable-mdpi/icon.png, as the source file doesn't exist.
Target _ResolveMonoAndroidSdks:
MonoAndroid Tools: /Library/Frameworks/Xamarin.Android.framework/Versions/Current/lib/mandroid/
MonoAndroid Framework: /Library/Frameworks/Xamarin.Android.framework/Versions/Current/lib/mandroid/platforms/android-14;/Library/Frameworks/Xamarin.Android.framework/Versions/Current/lib/mono/2.1
MonoAndroid Binaries: /Library/Frameworks/Xamarin.Android.framework/Versions/Current/bin/
Android Platform API level: 14
TargetFrameworkVersion: v4.0
Android NDK: /Users/nischal/Desktop/android-ndk-r8e/
Android SDK: /Users/nischal/Desktop/android-sdk-macosx/
Android SDK Build Tools: /Users/nischal/Desktop/android-sdk-macosx/platform-tools/
Java SDK: /usr/
Target _ValidateAndroidPackageProperties:
GetAndroidPackageName Task
ManifestFile: /Users/nischal/Desktop/19July/monodroid-samples-master/SanityTests/Properties/AndroidManifest.xml
AssemblyName: SanityTests
PackageName: Mono.Samples.SanityTests
Target _BuildDependencies:
Resolved library outputs:
Target _ExtractLibraryProjectImports:
Assemblies:
/Library/Frameworks/Xamarin.Android.framework/Versions/Current/lib/mandroid/platforms/android-14/Mono.Android.dll
/Library/Frameworks/Xamarin.Android.framework/Versions/Current/lib/mono/2.1/Mono.Data.Sqlite.dll
/Library/Frameworks/Xamarin.Android.framework/Versions/Current/lib/mono/2.1/System.dll
/Library/Frameworks/Xamarin.Android.framework/Versions/Current/lib/mono/2.1/System.Data.dll
/Library/Frameworks/Xamarin.Android.framework/Versions/Current/lib/mono/2.1/System.Xml.Linq.dll
/Library/Frameworks/Xamarin.Android.framework/Versions/Current/lib/mono/2.1/System.Xml.dll
/Library/Frameworks/Xamarin.Android.framework/Versions/Current/lib/mono/2.1/System.Numerics.dll
/Library/Frameworks/Xamarin.Android.framework/Versions/Current/lib/mono/2.1/System.Runtime.Serialization.dll
/Library/Frameworks/Xamarin.Android.framework/Versions/Current/lib/mono/2.1/System.ServiceModel.Web.dll
/Library/Frameworks/Xamarin.Android.framework/Versions/Current/lib/mandroid/platforms/android-14/Mono.Android.GoogleMaps.dll
/Library/Frameworks/Xamarin.Android.framework/Versions/Current/lib/mono/2.1/System.Core.dll
Jars:
ResolvedResourceDirectories:
Target _GetLibraryImports:
NativeLibraries:
Jars:
Target _CheckDuplicateJavaLibraries:
JavaSourceFiles:
TestCubeEngine.java
JavaLibraries:
$(OutputPath)/custom.jar
/Library/Frameworks/Mono.framework/External/xbuild/Xamarin/Android/Xamarin.Android.Common.targets: error : Error executing task CheckDuplicateJavaLibraries: Could not find file "$(OutputPath)/custom.jar".
Task "CheckDuplicateJavaLibraries" execution -- FAILED
Done building target "_CheckDuplicateJavaLibraries" in project "/Users/nischal/Desktop/19July/monodroid-samples-master/SanityTests/SanityTests.csproj".-- FAILED
Done building project "/Users/nischal/Desktop/19July/monodroid-samples-master/SanityTests/SanityTests.csproj".-- FAILED
Build FAILED.
Errors:
/Users/nischal/Desktop/19July/monodroid-samples-master/SanityTests/SanityTests.csproj (Build) ->
/Library/Frameworks/Mono.framework/External/xbuild/Xamarin/Android/Xamarin.Android.Common.targets (_GenerateAndroidResourceDir target) ->
/Library/Frameworks/Mono.framework/External/xbuild/Xamarin/Android/Xamarin.Android.Common.targets: error : Cannot copy /Users/nischal/Desktop/19July/monodroid-samples-master/SanityTests/Resources/Drawable-mdpi/icon.png to /Users/nischal/Desktop/19July/monodroid-samples-master/SanityTests/obj/Debug/res/drawable-mdpi/icon.png, as the source file doesn't exist.
/Users/nischal/Desktop/19July/monodroid-samples-master/SanityTests/SanityTests.csproj (Build) ->
/Library/Frameworks/Mono.framework/External/xbuild/Xamarin/Android/Xamarin.Android.Common.targets (_CheckDuplicateJavaLibraries target) ->
/Library/Frameworks/Mono.framework/External/xbuild/Xamarin/Android/Xamarin.Android.Common.targets: error : Error executing task CheckDuplicateJavaLibraries: Could not find file "$(OutputPath)/custom.jar".
0 Warning(s)
2 Error(s)
Time Elapsed 00:00:00.2477580
---------------------- Done ----------------------
Build: 2 errors, 0 warnings
Sign up for free to join this conversation on GitHub. Already have an account? Sign in to comment