Skip to content

Instantly share code, notes, and snippets.

Embed
What would you like to do?
Rebuilding...
Cleaning Solution: TestPro (Debug|iPhoneSimulator)
Build started 06-10-2016 14:07:41.
__________________________________________________
Project "/Users/360_macmini/Desktop/Xamarin/TestPro/TestPro/TestPro.csproj" (Clean target(s)):
Initial Properties:
__CF_USER_TEXT_ENCODING = 0x1F5:0x0:0x0
Apple_PubSub_Socket_Render = /private/tmp/com.apple.launchd.5ijC3R9YNB/Render
AssemblyName = TestPro
BuildingInsideVisualStudio = true
CodesignKey = iPhone Developer
Configuration = Debug
CurrentSolutionConfigurationContents = <SolutionConfiguration>
<ProjectConfiguration Project="{3F514866-8B74-4373-9A57-C5D1032D0EE3}" AbsolutePath="/Users/360_macmini/Desktop/Xamarin/TestPro/TestPro/TestPro.csproj" BuildProjectInSolution="True">Debug|iPhoneSimulator</ProjectConfiguration>
</SolutionConfiguration>
DebugSymbols = true
DebugType = full
DefineConstants = DEBUG;ENABLE_TEST_CLOUD;
DYLD_FALLBACK_LIBRARY_PATH = /Applications/Xamarin Studio.app/Contents/Resources/lib:/Applications/Xamarin Studio.app/Contents/Resources/lib/monodevelop/bin:/Library/Frameworks/Mono.framework/Libraries:/lib:/usr/lib:/Library/Developer/CommandLineTools/usr/lib:/usr/local/lib
ErrorReport = prompt
HOME = /Users/360_macmini
IPhoneResourcePrefix = Resources
LANGUAGE = en
LC_NUMERIC = C
LOGNAME = 360_macmini
MONO_GAC_PREFIX = /Applications/Xamarin Studio.app/Contents/Resources
MONODEVELOP_64BIT_SAFE = yes
MONODEVELOP_STUB_LANGUAGE = en
MSBuildBinPath = /Library/Frameworks/Mono.framework/Versions/4.6.1/lib/mono/xbuild/14.0/bin
MSBuildExtensionsPath = /Library/Frameworks/Mono.framework/External/xbuild
MSBuildExtensionsPath32 = /Library/Frameworks/Mono.framework/External/xbuild
MSBuildExtensionsPath64 = /Library/Frameworks/Mono.framework/External/xbuild
MSBuildFrameworkToolsPath = /Library/Frameworks/Mono.framework/Versions/4.6.1/lib/mono/4.5
MSBuildFrameworkToolsPath32 = /Library/Frameworks/Mono.framework/Versions/4.6.1/lib/mono/4.5
MSBuildProjectDefaultTargets = Build
MSBuildProjectDirectory = /Users/360_macmini/Desktop/Xamarin/TestPro/TestPro
MSBuildProjectExtension = .csproj
MSBuildProjectFile = TestPro.csproj
MSBuildProjectFullPath = /Users/360_macmini/Desktop/Xamarin/TestPro/TestPro/TestPro.csproj
MSBuildProjectName = TestPro
MSBuildThisFile = TestPro.csproj
MSBuildThisFileDirectory = /Users/360_macmini/Desktop/Xamarin/TestPro/TestPro/
MSBuildThisFileDirectoryNoRoot = Users/360_macmini/Desktop/Xamarin/TestPro/TestPro/
MSBuildThisFileExtension = .csproj
MSBuildThisFileFullPath = /Users/360_macmini/Desktop/Xamarin/TestPro/TestPro/TestPro.csproj
MSBuildThisFileName = TestPro
MSBuildToolsPath = /Library/Frameworks/Mono.framework/Versions/4.6.1/lib/mono/xbuild/14.0/bin
MSBuildToolsPath32 = /Library/Frameworks/Mono.framework/Versions/4.6.1/lib/mono/xbuild/14.0/bin
MSBuildToolsRoot = /Library/Frameworks/Mono.framework/Versions/4.6.1/lib/mono/xbuild/14.0
MSBuildToolsVersion = 14.0
MtouchArch = i386
MtouchDebug = true
MtouchFastDev = true
MtouchHttpClientHandler = HttpClientHandler
MtouchLink = Full
MtouchProfiling = true
MtouchTlsProvider = Default
MtouchUseRefCounting = true
MtouchUseSGen = true
MtouchVerbosity = 4
Optimize = false
OS = Unix
OutputPath = bin\iPhoneSimulator\Debug
OutputType = Exe
PATH = /Library/Frameworks/Mono.framework/Commands:/Applications/Xamarin Studio.app/Contents/Resources:/Applications/Xamarin Studio.app/Contents/MacOS:/usr/bin:/bin:/usr/sbin:/sbin
PKG_CONFIG_LIBDIR =
PKG_CONFIG_PATH = /Applications/Xamarin Studio.app/Contents/Resources/lib/pkgconfig:/Library/Frameworks/Mono.framework/Versions/4.6.1/lib/pkgconfig
Platform = iPhoneSimulator
PlatformTarget = x86
ProjectGuid = {3F514866-8B74-4373-9A57-C5D1032D0EE3}
ProjectTypeGuids = {FEACFBD2-3405-455C-9665-78FE426C6842};{FAE04EC0-301F-11D3-BF4B-00C04F79EFBC}
RootNamespace = TestPro
SHELL = /bin/bash
SolutionDir = /Users/360_macmini/Desktop/Xamarin/TestPro/
SolutionFilename = TestPro.sln
SolutionName = TestPro
SolutionPath = /Users/360_macmini/Desktop/Xamarin/TestPro/TestPro.sln
SSH_AUTH_SOCK = /private/tmp/com.apple.launchd.ebjkJRaSRS/Listeners
TMPDIR = /var/folders/58/y67gpq9x4zx44qk4bpvcgb540000gn/T/
UseHostCompilerIfAvailable = false
USER = 360_macmini
WarningLevel = 4
XPC_FLAGS = 0x0
XPC_SERVICE_NAME = com.xamarin.xamarinstudio.60192
Initial Items:
/Users/360_macmini/Desktop/Xamarin/TestPro/TestPro/TestPro.csproj: Importing project /Library/Frameworks/Mono.framework/External/xbuild/Xamarin/iOS/Xamarin.iOS.CSharp.targets from extension path /Library/Frameworks/Mono.framework/External/xbuild
/Library/Frameworks/Mono.framework/External/xbuild/Xamarin/iOS/Xamarin.iOS.CSharp.targets: Importing project /Library/Frameworks/Mono.framework/Versions/4.6.1/lib/mono/xbuild/14.0/bin/Microsoft.CSharp.targets from extension path /Library/Frameworks/Mono.framework/External/xbuild
/Library/Frameworks/Mono.framework/Versions/4.6.1/lib/mono/xbuild/14.0/bin/Microsoft.CSharp.targets: Importing project /Library/Frameworks/Mono.framework/Versions/4.6.1/lib/mono/xbuild/14.0/bin/Microsoft.Common.targets
/Library/Frameworks/Mono.framework/Versions/4.6.1/lib/mono/xbuild/14.0/bin/Microsoft.Common.targets: Importing project /Library/Frameworks/Mono.framework/Versions/4.6.1/lib/mono/xbuild/14.0/Microsoft.Common.props from extension path /Library/Frameworks/Mono.framework/Versions/4.6.1/lib/mono/xbuild
/Library/Frameworks/Mono.framework/Versions/4.6.1/lib/mono/xbuild/14.0/Microsoft.Common.props: Importing project /Library/Frameworks/Mono.framework/Versions/4.6.1/lib/mono/xbuild/14.0/Imports/Microsoft.Common.props/ImportBefore/Microsoft.NuGet.ImportBefore.props from extension path /Library/Frameworks/Mono.framework/Versions/4.6.1/lib/mono/xbuild
/Library/Frameworks/Mono.framework/Versions/4.6.1/lib/mono/xbuild/14.0/Imports/Microsoft.Common.props/ImportBefore/Microsoft.NuGet.ImportBefore.props: Importing project /Library/Frameworks/Mono.framework/Versions/4.6.1/lib/mono/xbuild/Microsoft/NuGet/Microsoft.NuGet.props from extension path /Library/Frameworks/Mono.framework/External/xbuild
/Library/Frameworks/Mono.framework/Versions/4.6.1/lib/mono/xbuild/14.0/bin/Microsoft.Common.targets: Importing project /Library/Frameworks/Mono.framework/Versions/4.6.1/lib/mono/xbuild/14.0/Microsoft.Common.targets/ImportAfter/Microsoft.NuGet.ImportAfter.targets from extension path /Library/Frameworks/Mono.framework/Versions/4.6.1/lib/mono/xbuild
/Library/Frameworks/Mono.framework/Versions/4.6.1/lib/mono/xbuild/14.0/Microsoft.Common.targets/ImportAfter/Microsoft.NuGet.ImportAfter.targets: Importing project /Library/Frameworks/Mono.framework/Versions/4.6.1/lib/mono/xbuild/Microsoft/NuGet/Microsoft.NuGet.targets from extension path /Library/Frameworks/Mono.framework/External/xbuild
/Library/Frameworks/Mono.framework/External/xbuild/Xamarin/iOS/Xamarin.iOS.CSharp.targets: Importing project /Library/Frameworks/Mono.framework/External/xbuild/Xamarin/iOS/Xamarin.iOS.Common.targets
/Library/Frameworks/Mono.framework/External/xbuild/Xamarin/iOS/Xamarin.iOS.Common.targets: Importing project /Library/Frameworks/Mono.framework/External/xbuild/Xamarin/iOS/Xamarin.iOS.Common.props from extension path /Library/Frameworks/Mono.framework/External/xbuild
/Library/Frameworks/Mono.framework/External/xbuild/Xamarin/iOS/Xamarin.iOS.Common.targets: Importing project /Library/Frameworks/Mono.framework/External/xbuild/Xamarin/iOS/Xamarin.Analysis.targets from extension path /Library/Frameworks/Mono.framework/External/xbuild
/Library/Frameworks/Mono.framework/External/xbuild/Xamarin/iOS/Xamarin.Analysis.targets: Importing project /Library/Frameworks/Mono.framework/External/xbuild/Xamarin/iOS/Xamarin.Analysis.Compatibility.targets from extension path /Library/Frameworks/Mono.framework/External/xbuild
Building target "_CheckForInvalidConfigurationAndPlatform" in project "/Users/360_macmini/Desktop/Xamarin/TestPro/TestPro/TestPro.csproj" ("/Library/Frameworks/Mono.framework/Versions/4.6.1/lib/mono/xbuild/14.0/bin/Microsoft.Common.targets").
Done building target "_CheckForInvalidConfigurationAndPlatform" in project "/Users/360_macmini/Desktop/Xamarin/TestPro/TestPro/TestPro.csproj" ("/Library/Frameworks/Mono.framework/Versions/4.6.1/lib/mono/xbuild/14.0/bin/Microsoft.Common.targets").
Building target "Clean" in project "/Users/360_macmini/Desktop/Xamarin/TestPro/TestPro/TestPro.csproj" ("/Library/Frameworks/Mono.framework/Versions/4.6.1/lib/mono/xbuild/14.0/bin/Microsoft.Common.targets").
Building target "BeforeClean" in project "/Users/360_macmini/Desktop/Xamarin/TestPro/TestPro/TestPro.csproj" ("/Library/Frameworks/Mono.framework/Versions/4.6.1/lib/mono/xbuild/14.0/bin/Microsoft.Common.targets"); "Clean" depends on it.
Done building target "BeforeClean" in project "/Users/360_macmini/Desktop/Xamarin/TestPro/TestPro/TestPro.csproj" ("/Library/Frameworks/Mono.framework/Versions/4.6.1/lib/mono/xbuild/14.0/bin/Microsoft.Common.targets"); "Clean" depends on it.
Building target "CleanReferencedProjects" in project "/Users/360_macmini/Desktop/Xamarin/TestPro/TestPro/TestPro.csproj" ("/Library/Frameworks/Mono.framework/Versions/4.6.1/lib/mono/xbuild/14.0/bin/Microsoft.Common.targets"); "Clean" depends on it.
Building target "AssignProjectConfiguration" in project "/Users/360_macmini/Desktop/Xamarin/TestPro/TestPro/TestPro.csproj" ("/Library/Frameworks/Mono.framework/Versions/4.6.1/lib/mono/xbuild/14.0/bin/Microsoft.Common.targets"); "CleanReferencedProjects" depends on it.
Target AssignProjectConfiguration skipped due to false condition: '@(ProjectReference)' != ''
Done building target "AssignProjectConfiguration" in project "/Users/360_macmini/Desktop/Xamarin/TestPro/TestPro/TestPro.csproj" ("/Library/Frameworks/Mono.framework/Versions/4.6.1/lib/mono/xbuild/14.0/bin/Microsoft.Common.targets"); "CleanReferencedProjects" depends on it.
Done building target "CleanReferencedProjects" in project "/Users/360_macmini/Desktop/Xamarin/TestPro/TestPro/TestPro.csproj" ("/Library/Frameworks/Mono.framework/Versions/4.6.1/lib/mono/xbuild/14.0/bin/Microsoft.Common.targets"); "Clean" depends on it.
Building target "CoreClean" in project "/Users/360_macmini/Desktop/Xamarin/TestPro/TestPro/TestPro.csproj" ("/Library/Frameworks/Mono.framework/Versions/4.6.1/lib/mono/xbuild/14.0/bin/Microsoft.Common.targets"); "Clean" depends on it.
Building target "_GetCleanFileWrites" in project "/Users/360_macmini/Desktop/Xamarin/TestPro/TestPro/TestPro.csproj" ("/Library/Frameworks/Mono.framework/Versions/4.6.1/lib/mono/xbuild/14.0/bin/Microsoft.Common.targets"); "CoreClean" depends on it.
Building target "_GetCompileOutputsForClean" in project "/Users/360_macmini/Desktop/Xamarin/TestPro/TestPro/TestPro.csproj" ("/Library/Frameworks/Mono.framework/Versions/4.6.1/lib/mono/xbuild/14.0/bin/Microsoft.Common.targets"); "_GetCleanFileWrites" depends on it.
Target _GetCompileOutputsForClean:
Task "CreateItem"
Using task CreateItem from Microsoft.Build.Tasks.CreateItem, Microsoft.Build.Tasks.Core, Version=14.0.0.0, Culture=neutral, PublicKeyToken=b03f5f7f11d50a3a
Done executing task "CreateItem"
Task "CreateItem"
Using task CreateItem from Microsoft.Build.Tasks.CreateItem, Microsoft.Build.Tasks.Core, Version=14.0.0.0, Culture=neutral, PublicKeyToken=b03f5f7f11d50a3a
Done executing task "CreateItem"
Done building target "_GetCompileOutputsForClean" in project "/Users/360_macmini/Desktop/Xamarin/TestPro/TestPro/TestPro.csproj".
Done building target "_GetCompileOutputsForClean" in project "/Users/360_macmini/Desktop/Xamarin/TestPro/TestPro/TestPro.csproj" ("/Library/Frameworks/Mono.framework/Versions/4.6.1/lib/mono/xbuild/14.0/bin/Microsoft.Common.targets"); "_GetCleanFileWrites" depends on it.
Target _GetCleanFileWrites:
Task "ReadLinesFromFile"
Using task ReadLinesFromFile from Microsoft.Build.Tasks.ReadLinesFromFile, Microsoft.Build.Tasks.Core, Version=14.0.0.0, Culture=neutral, PublicKeyToken=b03f5f7f11d50a3a
Done executing task "ReadLinesFromFile"
Done building target "_GetCleanFileWrites" in project "/Users/360_macmini/Desktop/Xamarin/TestPro/TestPro/TestPro.csproj".
Done building target "_GetCleanFileWrites" in project "/Users/360_macmini/Desktop/Xamarin/TestPro/TestPro/TestPro.csproj" ("/Library/Frameworks/Mono.framework/Versions/4.6.1/lib/mono/xbuild/14.0/bin/Microsoft.Common.targets"); "CoreClean" depends on it.
Target CoreClean:
Task "Delete"
Using task Delete from Microsoft.Build.Tasks.Delete, Xamarin.MacDev.Tasks, Version=1.0.6120.27414, Culture=neutral, PublicKeyToken=null
Deleting file '/Users/360_macmini/Desktop/Xamarin/TestPro/TestPro/obj/iPhoneSimulator/Debug/Xamarin.iOS,Version=v1.0.AssemblyAttribute.cs'
Deleting file '/Users/360_macmini/Desktop/Xamarin/TestPro/TestPro/obj/iPhoneSimulator/Debug/ibtool/_BundleResourceWithLogicalName.items'
Deleting file '/Users/360_macmini/Desktop/Xamarin/TestPro/TestPro/obj/iPhoneSimulator/Debug/actool/_PartialAppManifest.items'
Deleting file '/Users/360_macmini/Desktop/Xamarin/TestPro/TestPro/obj/iPhoneSimulator/Debug/actool/_BundleResourceWithLogicalName.items'
Deleting file '/Users/360_macmini/Desktop/Xamarin/TestPro/TestPro/bin/iPhoneSimulator/Debug/TestPro.exe.mdb'
Deleting file '/Users/360_macmini/Desktop/Xamarin/TestPro/TestPro/bin/iPhoneSimulator/Debug/TestPro.exe'
Deleting file '/Users/360_macmini/Desktop/Xamarin/TestPro/TestPro/obj/iPhoneSimulator/Debug/TestPro.exe'
Deleting file '/Users/360_macmini/Desktop/Xamarin/TestPro/TestPro/obj/iPhoneSimulator/Debug/TestPro.exe.mdb'
Deleting file '/Users/360_macmini/Desktop/Xamarin/TestPro/TestPro/bin/iPhoneSimulator/Debug/GoogleConversionTracking.Unified.dll'
Done executing task "Delete"
Task "Delete"
Using task Delete from Microsoft.Build.Tasks.Delete, Xamarin.MacDev.Tasks, Version=1.0.6120.27414, Culture=neutral, PublicKeyToken=null
Deleting file '/Users/360_macmini/Desktop/Xamarin/TestPro/TestPro/obj/iPhoneSimulator/Debug/TestPro.csproj.FilesWrittenAbsolute.txt'
Done executing task "Delete"
Done building target "CoreClean" in project "/Users/360_macmini/Desktop/Xamarin/TestPro/TestPro/TestPro.csproj".
Done building target "CoreClean" in project "/Users/360_macmini/Desktop/Xamarin/TestPro/TestPro/TestPro.csproj" ("/Library/Frameworks/Mono.framework/Versions/4.6.1/lib/mono/xbuild/14.0/bin/Microsoft.Common.targets"); "Clean" depends on it.
Building target "AfterClean" in project "/Users/360_macmini/Desktop/Xamarin/TestPro/TestPro/TestPro.csproj" ("/Library/Frameworks/Mono.framework/Versions/4.6.1/lib/mono/xbuild/14.0/bin/Microsoft.Common.targets"); "Clean" depends on it.
Done building target "AfterClean" in project "/Users/360_macmini/Desktop/Xamarin/TestPro/TestPro/TestPro.csproj" ("/Library/Frameworks/Mono.framework/Versions/4.6.1/lib/mono/xbuild/14.0/bin/Microsoft.Common.targets"); "Clean" depends on it.
Building target "_CleanUploaded" in project "/Users/360_macmini/Desktop/Xamarin/TestPro/TestPro/TestPro.csproj" ("/Library/Frameworks/Mono.framework/External/xbuild/Xamarin/iOS/Xamarin.iOS.Common.targets"); "Clean" depends on it.
Building target "_GenerateBundleName" in project "/Users/360_macmini/Desktop/Xamarin/TestPro/TestPro/TestPro.csproj" ("/Library/Frameworks/Mono.framework/External/xbuild/Xamarin/iOS/Xamarin.iOS.Common.targets"); "_CleanUploaded" depends on it.
Building target "_ComputeTargetArchitectures" in project "/Users/360_macmini/Desktop/Xamarin/TestPro/TestPro/TestPro.csproj" ("/Library/Frameworks/Mono.framework/External/xbuild/Xamarin/iOS/Xamarin.iOS.Common.targets"); "_GenerateBundleName" depends on it.
Done building target "_ComputeTargetArchitectures" in project "/Users/360_macmini/Desktop/Xamarin/TestPro/TestPro/TestPro.csproj" ("/Library/Frameworks/Mono.framework/External/xbuild/Xamarin/iOS/Xamarin.iOS.Common.targets"); "_GenerateBundleName" depends on it.
Done building target "_GenerateBundleName" in project "/Users/360_macmini/Desktop/Xamarin/TestPro/TestPro/TestPro.csproj" ("/Library/Frameworks/Mono.framework/External/xbuild/Xamarin/iOS/Xamarin.iOS.Common.targets"); "_CleanUploaded" depends on it.
Target _CleanUploaded:
Task "Delete"
Using task Delete from Microsoft.Build.Tasks.Delete, Xamarin.MacDev.Tasks, Version=1.0.6120.27414, Culture=neutral, PublicKeyToken=null
Done executing task "Delete"
Done building target "_CleanUploaded" in project "/Users/360_macmini/Desktop/Xamarin/TestPro/TestPro/TestPro.csproj".
Done building target "_CleanUploaded" in project "/Users/360_macmini/Desktop/Xamarin/TestPro/TestPro/TestPro.csproj" ("/Library/Frameworks/Mono.framework/External/xbuild/Xamarin/iOS/Xamarin.iOS.Common.targets"); "Clean" depends on it.
Building target "_CleanAppBundle" in project "/Users/360_macmini/Desktop/Xamarin/TestPro/TestPro/TestPro.csproj" ("/Library/Frameworks/Mono.framework/External/xbuild/Xamarin/iOS/Xamarin.iOS.Common.targets"); "Clean" depends on it.
Target _CleanAppBundle:
Task "RemoveDir"
Using task RemoveDir from Microsoft.Build.Tasks.RemoveDir, Xamarin.MacDev.Tasks, Version=1.0.6120.27414, Culture=neutral, PublicKeyToken=null
Done executing task "RemoveDir"
Done building target "_CleanAppBundle" in project "/Users/360_macmini/Desktop/Xamarin/TestPro/TestPro/TestPro.csproj".
Done building target "_CleanAppBundle" in project "/Users/360_macmini/Desktop/Xamarin/TestPro/TestPro/TestPro.csproj" ("/Library/Frameworks/Mono.framework/External/xbuild/Xamarin/iOS/Xamarin.iOS.Common.targets"); "Clean" depends on it.
Building target "_CleanDebugSymbols" in project "/Users/360_macmini/Desktop/Xamarin/TestPro/TestPro/TestPro.csproj" ("/Library/Frameworks/Mono.framework/External/xbuild/Xamarin/iOS/Xamarin.iOS.Common.targets"); "Clean" depends on it.
Target _CleanDebugSymbols:
Task "RemoveDir"
Using task RemoveDir from Microsoft.Build.Tasks.RemoveDir, Xamarin.MacDev.Tasks, Version=1.0.6120.27414, Culture=neutral, PublicKeyToken=null
Done executing task "RemoveDir"
Task "Delete"
Using task Delete from Microsoft.Build.Tasks.Delete, Xamarin.MacDev.Tasks, Version=1.0.6120.27414, Culture=neutral, PublicKeyToken=null
Done executing task "Delete"
Done building target "_CleanDebugSymbols" in project "/Users/360_macmini/Desktop/Xamarin/TestPro/TestPro/TestPro.csproj".
Done building target "_CleanDebugSymbols" in project "/Users/360_macmini/Desktop/Xamarin/TestPro/TestPro/TestPro.csproj" ("/Library/Frameworks/Mono.framework/External/xbuild/Xamarin/iOS/Xamarin.iOS.Common.targets"); "Clean" depends on it.
Building target "_CleanITunesArtwork" in project "/Users/360_macmini/Desktop/Xamarin/TestPro/TestPro/TestPro.csproj" ("/Library/Frameworks/Mono.framework/External/xbuild/Xamarin/iOS/Xamarin.iOS.Common.targets"); "Clean" depends on it.
Target _CleanITunesArtwork skipped due to false condition: '$(_CanArchive)' == 'true'
Done building target "_CleanITunesArtwork" in project "/Users/360_macmini/Desktop/Xamarin/TestPro/TestPro/TestPro.csproj" ("/Library/Frameworks/Mono.framework/External/xbuild/Xamarin/iOS/Xamarin.iOS.Common.targets"); "Clean" depends on it.
Building target "_CleanDeviceSpecificOutput" in project "/Users/360_macmini/Desktop/Xamarin/TestPro/TestPro/TestPro.csproj" ("/Library/Frameworks/Mono.framework/External/xbuild/Xamarin/iOS/Xamarin.iOS.Common.targets"); "Clean" depends on it.
Target _CleanDeviceSpecificOutput:
Task "RemoveDir"
Using task RemoveDir from Microsoft.Build.Tasks.RemoveDir, Xamarin.MacDev.Tasks, Version=1.0.6120.27414, Culture=neutral, PublicKeyToken=null
Done executing task "RemoveDir"
Done building target "_CleanDeviceSpecificOutput" in project "/Users/360_macmini/Desktop/Xamarin/TestPro/TestPro/TestPro.csproj".
Done building target "_CleanDeviceSpecificOutput" in project "/Users/360_macmini/Desktop/Xamarin/TestPro/TestPro/TestPro.csproj" ("/Library/Frameworks/Mono.framework/External/xbuild/Xamarin/iOS/Xamarin.iOS.Common.targets"); "Clean" depends on it.
Building target "_CleanIntermediateToolOutput" in project "/Users/360_macmini/Desktop/Xamarin/TestPro/TestPro/TestPro.csproj" ("/Library/Frameworks/Mono.framework/External/xbuild/Xamarin/iOS/Xamarin.iOS.Common.targets"); "Clean" depends on it.
Target _CleanIntermediateToolOutput:
Task "RemoveDir"
Using task RemoveDir from Microsoft.Build.Tasks.RemoveDir, Xamarin.MacDev.Tasks, Version=1.0.6120.27414, Culture=neutral, PublicKeyToken=null
Done executing task "RemoveDir"
Task "Delete"
Using task Delete from Microsoft.Build.Tasks.Delete, Xamarin.MacDev.Tasks, Version=1.0.6120.27414, Culture=neutral, PublicKeyToken=null
Done executing task "Delete"
Done building target "_CleanIntermediateToolOutput" in project "/Users/360_macmini/Desktop/Xamarin/TestPro/TestPro/TestPro.csproj".
Done building target "_CleanIntermediateToolOutput" in project "/Users/360_macmini/Desktop/Xamarin/TestPro/TestPro/TestPro.csproj" ("/Library/Frameworks/Mono.framework/External/xbuild/Xamarin/iOS/Xamarin.iOS.Common.targets"); "Clean" depends on it.
Done building target "Clean" in project "/Users/360_macmini/Desktop/Xamarin/TestPro/TestPro/TestPro.csproj" ("/Library/Frameworks/Mono.framework/Versions/4.6.1/lib/mono/xbuild/14.0/bin/Microsoft.Common.targets").
Done building project "/Users/360_macmini/Desktop/Xamarin/TestPro/TestPro/TestPro.csproj".
Target perfomance summary:
0.209 ms _CheckForInvalidConfigurationAndPlatform 1 calls
5.830 ms _CleanAppBundle 1 calls
0.590 ms _CleanDebugSymbols 1 calls
0.332 ms _CleanDeviceSpecificOutput 1 calls
16.328 ms _CleanIntermediateToolOutput 1 calls
0.255 ms _CleanUploaded 1 calls
0.177 ms _ComputeTargetArchitectures 1 calls
0.042 ms _GenerateBundleName 1 calls
1.076 ms _GetCleanFileWrites 1 calls
0.788 ms _GetCompileOutputsForClean 1 calls
0.127 ms CleanReferencedProjects 1 calls
2.990 ms CoreClean 1 calls
Tasks perfomance summary:
0.524 ms CreateItem 2 calls
3.585 ms Delete 5 calls
0.980 ms ReadLinesFromFile 1 calls
19.876 ms RemoveDir 4 calls
Build succeeded.
0 Warning(s)
0 Error(s)
Time Elapsed 00:00:00.1169290
Building Solution: TestPro (Debug|iPhoneSimulator)
Build started 06-10-2016 14:07:41.
__________________________________________________
Project "/Users/360_macmini/Desktop/Xamarin/TestPro/TestPro/TestPro.csproj" (Build target(s)):
Initial Properties:
__CF_USER_TEXT_ENCODING = 0x1F5:0x0:0x0
Apple_PubSub_Socket_Render = /private/tmp/com.apple.launchd.5ijC3R9YNB/Render
AssemblyName = TestPro
BuildingInsideVisualStudio = true
CodesignKey = iPhone Developer
Configuration = Debug
CurrentSolutionConfigurationContents = <SolutionConfiguration>
<ProjectConfiguration Project="{3F514866-8B74-4373-9A57-C5D1032D0EE3}" AbsolutePath="/Users/360_macmini/Desktop/Xamarin/TestPro/TestPro/TestPro.csproj" BuildProjectInSolution="True">Debug|iPhoneSimulator</ProjectConfiguration>
</SolutionConfiguration>
DebugSymbols = true
DebugType = full
DefineConstants = DEBUG;ENABLE_TEST_CLOUD;
DYLD_FALLBACK_LIBRARY_PATH = /Applications/Xamarin Studio.app/Contents/Resources/lib:/Applications/Xamarin Studio.app/Contents/Resources/lib/monodevelop/bin:/Library/Frameworks/Mono.framework/Libraries:/lib:/usr/lib:/Library/Developer/CommandLineTools/usr/lib:/usr/local/lib
ErrorReport = prompt
HOME = /Users/360_macmini
IPhoneResourcePrefix = Resources
LANGUAGE = en
LC_NUMERIC = C
LOGNAME = 360_macmini
MONO_GAC_PREFIX = /Applications/Xamarin Studio.app/Contents/Resources
MONODEVELOP_64BIT_SAFE = yes
MONODEVELOP_STUB_LANGUAGE = en
MSBuildBinPath = /Library/Frameworks/Mono.framework/Versions/4.6.1/lib/mono/xbuild/14.0/bin
MSBuildExtensionsPath = /Library/Frameworks/Mono.framework/External/xbuild
MSBuildExtensionsPath32 = /Library/Frameworks/Mono.framework/External/xbuild
MSBuildExtensionsPath64 = /Library/Frameworks/Mono.framework/External/xbuild
MSBuildFrameworkToolsPath = /Library/Frameworks/Mono.framework/Versions/4.6.1/lib/mono/4.5
MSBuildFrameworkToolsPath32 = /Library/Frameworks/Mono.framework/Versions/4.6.1/lib/mono/4.5
MSBuildProjectDefaultTargets = Build
MSBuildProjectDirectory = /Users/360_macmini/Desktop/Xamarin/TestPro/TestPro
MSBuildProjectExtension = .csproj
MSBuildProjectFile = TestPro.csproj
MSBuildProjectFullPath = /Users/360_macmini/Desktop/Xamarin/TestPro/TestPro/TestPro.csproj
MSBuildProjectName = TestPro
MSBuildThisFile = TestPro.csproj
MSBuildThisFileDirectory = /Users/360_macmini/Desktop/Xamarin/TestPro/TestPro/
MSBuildThisFileDirectoryNoRoot = Users/360_macmini/Desktop/Xamarin/TestPro/TestPro/
MSBuildThisFileExtension = .csproj
MSBuildThisFileFullPath = /Users/360_macmini/Desktop/Xamarin/TestPro/TestPro/TestPro.csproj
MSBuildThisFileName = TestPro
MSBuildToolsPath = /Library/Frameworks/Mono.framework/Versions/4.6.1/lib/mono/xbuild/14.0/bin
MSBuildToolsPath32 = /Library/Frameworks/Mono.framework/Versions/4.6.1/lib/mono/xbuild/14.0/bin
MSBuildToolsRoot = /Library/Frameworks/Mono.framework/Versions/4.6.1/lib/mono/xbuild/14.0
MSBuildToolsVersion = 14.0
MtouchArch = i386
MtouchDebug = true
MtouchFastDev = true
MtouchHttpClientHandler = HttpClientHandler
MtouchLink = Full
MtouchProfiling = true
MtouchTlsProvider = Default
MtouchUseRefCounting = true
MtouchUseSGen = true
MtouchVerbosity = 4
Optimize = false
OS = Unix
OutputPath = bin\iPhoneSimulator\Debug
OutputType = Exe
PATH = /Library/Frameworks/Mono.framework/Commands:/Applications/Xamarin Studio.app/Contents/Resources:/Applications/Xamarin Studio.app/Contents/MacOS:/usr/bin:/bin:/usr/sbin:/sbin
PKG_CONFIG_LIBDIR =
PKG_CONFIG_PATH = /Applications/Xamarin Studio.app/Contents/Resources/lib/pkgconfig:/Library/Frameworks/Mono.framework/Versions/4.6.1/lib/pkgconfig
Platform = iPhoneSimulator
PlatformTarget = x86
ProjectGuid = {3F514866-8B74-4373-9A57-C5D1032D0EE3}
ProjectTypeGuids = {FEACFBD2-3405-455C-9665-78FE426C6842};{FAE04EC0-301F-11D3-BF4B-00C04F79EFBC}
RootNamespace = TestPro
SHELL = /bin/bash
SolutionDir = /Users/360_macmini/Desktop/Xamarin/TestPro/
SolutionFilename = TestPro.sln
SolutionName = TestPro
SolutionPath = /Users/360_macmini/Desktop/Xamarin/TestPro/TestPro.sln
SSH_AUTH_SOCK = /private/tmp/com.apple.launchd.ebjkJRaSRS/Listeners
TMPDIR = /var/folders/58/y67gpq9x4zx44qk4bpvcgb540000gn/T/
UseHostCompilerIfAvailable = false
USER = 360_macmini
WarningLevel = 4
XPC_FLAGS = 0x0
XPC_SERVICE_NAME = com.xamarin.xamarinstudio.60192
Initial Items:
/Users/360_macmini/Desktop/Xamarin/TestPro/TestPro/TestPro.csproj: Importing project /Library/Frameworks/Mono.framework/External/xbuild/Xamarin/iOS/Xamarin.iOS.CSharp.targets from extension path /Library/Frameworks/Mono.framework/External/xbuild
/Library/Frameworks/Mono.framework/External/xbuild/Xamarin/iOS/Xamarin.iOS.CSharp.targets: Importing project /Library/Frameworks/Mono.framework/Versions/4.6.1/lib/mono/xbuild/14.0/bin/Microsoft.CSharp.targets from extension path /Library/Frameworks/Mono.framework/External/xbuild
/Library/Frameworks/Mono.framework/Versions/4.6.1/lib/mono/xbuild/14.0/bin/Microsoft.CSharp.targets: Importing project /Library/Frameworks/Mono.framework/Versions/4.6.1/lib/mono/xbuild/14.0/bin/Microsoft.Common.targets
/Library/Frameworks/Mono.framework/Versions/4.6.1/lib/mono/xbuild/14.0/bin/Microsoft.Common.targets: Importing project /Library/Frameworks/Mono.framework/Versions/4.6.1/lib/mono/xbuild/14.0/Microsoft.Common.props from extension path /Library/Frameworks/Mono.framework/Versions/4.6.1/lib/mono/xbuild
/Library/Frameworks/Mono.framework/Versions/4.6.1/lib/mono/xbuild/14.0/Microsoft.Common.props: Importing project /Library/Frameworks/Mono.framework/Versions/4.6.1/lib/mono/xbuild/14.0/Imports/Microsoft.Common.props/ImportBefore/Microsoft.NuGet.ImportBefore.props from extension path /Library/Frameworks/Mono.framework/Versions/4.6.1/lib/mono/xbuild
/Library/Frameworks/Mono.framework/Versions/4.6.1/lib/mono/xbuild/14.0/Imports/Microsoft.Common.props/ImportBefore/Microsoft.NuGet.ImportBefore.props: Importing project /Library/Frameworks/Mono.framework/Versions/4.6.1/lib/mono/xbuild/Microsoft/NuGet/Microsoft.NuGet.props from extension path /Library/Frameworks/Mono.framework/External/xbuild
/Library/Frameworks/Mono.framework/Versions/4.6.1/lib/mono/xbuild/14.0/bin/Microsoft.Common.targets: Importing project /Library/Frameworks/Mono.framework/Versions/4.6.1/lib/mono/xbuild/14.0/Microsoft.Common.targets/ImportAfter/Microsoft.NuGet.ImportAfter.targets from extension path /Library/Frameworks/Mono.framework/Versions/4.6.1/lib/mono/xbuild
/Library/Frameworks/Mono.framework/Versions/4.6.1/lib/mono/xbuild/14.0/Microsoft.Common.targets/ImportAfter/Microsoft.NuGet.ImportAfter.targets: Importing project /Library/Frameworks/Mono.framework/Versions/4.6.1/lib/mono/xbuild/Microsoft/NuGet/Microsoft.NuGet.targets from extension path /Library/Frameworks/Mono.framework/External/xbuild
/Library/Frameworks/Mono.framework/External/xbuild/Xamarin/iOS/Xamarin.iOS.CSharp.targets: Importing project /Library/Frameworks/Mono.framework/External/xbuild/Xamarin/iOS/Xamarin.iOS.Common.targets
/Library/Frameworks/Mono.framework/External/xbuild/Xamarin/iOS/Xamarin.iOS.Common.targets: Importing project /Library/Frameworks/Mono.framework/External/xbuild/Xamarin/iOS/Xamarin.iOS.Common.props from extension path /Library/Frameworks/Mono.framework/External/xbuild
/Library/Frameworks/Mono.framework/External/xbuild/Xamarin/iOS/Xamarin.iOS.Common.targets: Importing project /Library/Frameworks/Mono.framework/External/xbuild/Xamarin/iOS/Xamarin.Analysis.targets from extension path /Library/Frameworks/Mono.framework/External/xbuild
/Library/Frameworks/Mono.framework/External/xbuild/Xamarin/iOS/Xamarin.Analysis.targets: Importing project /Library/Frameworks/Mono.framework/External/xbuild/Xamarin/iOS/Xamarin.Analysis.Compatibility.targets from extension path /Library/Frameworks/Mono.framework/External/xbuild
Building target "_CheckForInvalidConfigurationAndPlatform" in project "/Users/360_macmini/Desktop/Xamarin/TestPro/TestPro/TestPro.csproj" ("/Library/Frameworks/Mono.framework/Versions/4.6.1/lib/mono/xbuild/14.0/bin/Microsoft.Common.targets").
Done building target "_CheckForInvalidConfigurationAndPlatform" in project "/Users/360_macmini/Desktop/Xamarin/TestPro/TestPro/TestPro.csproj" ("/Library/Frameworks/Mono.framework/Versions/4.6.1/lib/mono/xbuild/14.0/bin/Microsoft.Common.targets").
Building target "Build" in project "/Users/360_macmini/Desktop/Xamarin/TestPro/TestPro/TestPro.csproj" ("/Library/Frameworks/Mono.framework/Versions/4.6.1/lib/mono/xbuild/14.0/bin/Microsoft.Common.targets").
Building target "BuildOnlySettings" in project "/Users/360_macmini/Desktop/Xamarin/TestPro/TestPro/TestPro.csproj" ("/Library/Frameworks/Mono.framework/Versions/4.6.1/lib/mono/xbuild/14.0/bin/Microsoft.Common.targets"); "Build" depends on it.
Done building target "BuildOnlySettings" in project "/Users/360_macmini/Desktop/Xamarin/TestPro/TestPro/TestPro.csproj" ("/Library/Frameworks/Mono.framework/Versions/4.6.1/lib/mono/xbuild/14.0/bin/Microsoft.Common.targets"); "Build" depends on it.
Building target "PrepareForBuild" in project "/Users/360_macmini/Desktop/Xamarin/TestPro/TestPro/TestPro.csproj" ("/Library/Frameworks/Mono.framework/Versions/4.6.1/lib/mono/xbuild/14.0/bin/Microsoft.Common.targets"); "Build" depends on it.
Building target "AssignLinkMetadata" in project "/Users/360_macmini/Desktop/Xamarin/TestPro/TestPro/TestPro.csproj" ("/Library/Frameworks/Mono.framework/Versions/4.6.1/lib/mono/xbuild/14.0/bin/Microsoft.Common.targets"); "PrepareForBuild" depends on it.
Done building target "AssignLinkMetadata" in project "/Users/360_macmini/Desktop/Xamarin/TestPro/TestPro/TestPro.csproj" ("/Library/Frameworks/Mono.framework/Versions/4.6.1/lib/mono/xbuild/14.0/bin/Microsoft.Common.targets"); "PrepareForBuild" depends on it.
Target PrepareForBuild:
Task "Message"
Using task Message from Microsoft.Build.Tasks.Message, Microsoft.Build.Tasks.Core, Version=14.0.0.0, Culture=neutral, PublicKeyToken=b03f5f7f11d50a3a
Configuration: Debug Platform: iPhoneSimulator
Done executing task "Message"
Task "FindAppConfigFile"
Using task FindAppConfigFile from Microsoft.Build.Tasks.FindAppConfigFile, Microsoft.Build.Tasks.Core, Version=14.0.0.0, Culture=neutral, PublicKeyToken=b03f5f7f11d50a3a
Done executing task "FindAppConfigFile"
Task "MakeDir"
Using task MakeDir from Microsoft.Build.Tasks.MakeDir, Xamarin.MacDev.Tasks, Version=1.0.6120.27414, Culture=neutral, PublicKeyToken=null
Created directory "obj/iPhoneSimulator/Debug/"
Done executing task "MakeDir"
Done building target "PrepareForBuild" in project "/Users/360_macmini/Desktop/Xamarin/TestPro/TestPro/TestPro.csproj".
Done building target "PrepareForBuild" in project "/Users/360_macmini/Desktop/Xamarin/TestPro/TestPro/TestPro.csproj" ("/Library/Frameworks/Mono.framework/Versions/4.6.1/lib/mono/xbuild/14.0/bin/Microsoft.Common.targets"); "Build" depends on it.
Building target "_CollectBundleResources" in project "/Users/360_macmini/Desktop/Xamarin/TestPro/TestPro/TestPro.csproj" ("/Library/Frameworks/Mono.framework/External/xbuild/Xamarin/iOS/Xamarin.iOS.Common.targets"); "Build" depends on it.
Building target "_CompileInterfaceDefinitions" in project "/Users/360_macmini/Desktop/Xamarin/TestPro/TestPro/TestPro.csproj" ("/Library/Frameworks/Mono.framework/External/xbuild/Xamarin/iOS/Xamarin.iOS.Common.targets"); "_CollectBundleResources" depends on it.
Building target "_DetectAppManifest" in project "/Users/360_macmini/Desktop/Xamarin/TestPro/TestPro/TestPro.csproj" ("/Library/Frameworks/Mono.framework/External/xbuild/Xamarin/iOS/Xamarin.iOS.Common.targets"); "_CompileInterfaceDefinitions" depends on it.
Target _DetectAppManifest:
Task "FindItemWithLogicalName"
Using task FindItemWithLogicalName from Xamarin.MacDev.Tasks.FindItemWithLogicalName, Xamarin.MacDev.Tasks, Version=1.0.6120.27414, Culture=neutral, PublicKeyToken=null
FindItemWithLogicalName Task
Items:
Info.plist
Entitlements.plist
LogicalName: Info.plist
ProjectDir: /Users/360_macmini/Desktop/Xamarin/TestPro/TestPro
ResourcePrefix: Resources
Info.plist found at: Info.plist
Done executing task "FindItemWithLogicalName"
Done building target "_DetectAppManifest" in project "/Users/360_macmini/Desktop/Xamarin/TestPro/TestPro/TestPro.csproj".
Done building target "_DetectAppManifest" in project "/Users/360_macmini/Desktop/Xamarin/TestPro/TestPro/TestPro.csproj" ("/Library/Frameworks/Mono.framework/External/xbuild/Xamarin/iOS/Xamarin.iOS.Common.targets"); "_CompileInterfaceDefinitions" depends on it.
Building target "_DetectSdkLocations" in project "/Users/360_macmini/Desktop/Xamarin/TestPro/TestPro/TestPro.csproj" ("/Library/Frameworks/Mono.framework/External/xbuild/Xamarin/iOS/Xamarin.iOS.Common.targets"); "_CompileInterfaceDefinitions" depends on it.
Building target "_ComputeTargetArchitectures" in project "/Users/360_macmini/Desktop/Xamarin/TestPro/TestPro/TestPro.csproj" ("/Library/Frameworks/Mono.framework/External/xbuild/Xamarin/iOS/Xamarin.iOS.Common.targets"); "_DetectSdkLocations" depends on it.
Done building target "_ComputeTargetArchitectures" in project "/Users/360_macmini/Desktop/Xamarin/TestPro/TestPro/TestPro.csproj" ("/Library/Frameworks/Mono.framework/External/xbuild/Xamarin/iOS/Xamarin.iOS.Common.targets"); "_DetectSdkLocations" depends on it.
Target _DetectSdkLocations:
Task "DetectSdkLocations"
Using task DetectSdkLocations from Xamarin.iOS.Tasks.DetectSdkLocations, Xamarin.iOS.Tasks, Version=0.0.0.0, Culture=neutral, PublicKeyToken=null
DeveloperRoot: /Applications/Xcode.app/Contents/Developer
DevicePlatform: /Applications/Xcode.app/Contents/Developer/Platforms/iPhoneOS.platform
GetPlatformPath: /Applications/Xcode.app/Contents/Developer/Platforms/iPhoneOS.platform
Searching for 'SDK Usr directory' in '/Applications/Xcode.app/Contents/Developer/Platforms/iPhoneSimulator.platform/Developer/usr'
Searching for 'SDK Usr directory' in '/Applications/Xcode.app/Contents/Developer/usr'
Searching for 'SDK bin directory' in '/Applications/Xcode.app/Contents/Developer/usr/bin'
DetectSdkLocations Task
TargetFrameworkIdentifier: Xamarin.iOS
TargetArchitectures: i386
SdkVersion: 10.0
XamarinSdkRoot: /Library/Frameworks/Xamarin.iOS.framework/Versions/Current
SdkRoot: /Applications/Xcode.app/Contents/Developer/Platforms/iPhoneSimulator.platform/Developer/SDKs/iPhoneSimulator10.0.sdk
SdkDevPath: /Applications/Xcode.app/Contents/Developer
SdkUsrPath: /Applications/Xcode.app/Contents/Developer/usr
SdkPlatform: iPhoneSimulator
SdkIsSimulator: True
Done executing task "DetectSdkLocations"
Done building target "_DetectSdkLocations" in project "/Users/360_macmini/Desktop/Xamarin/TestPro/TestPro/TestPro.csproj".
Done building target "_DetectSdkLocations" in project "/Users/360_macmini/Desktop/Xamarin/TestPro/TestPro/TestPro.csproj" ("/Library/Frameworks/Mono.framework/External/xbuild/Xamarin/iOS/Xamarin.iOS.Common.targets"); "_CompileInterfaceDefinitions" depends on it.
Building target "_BeforeCoreCompileInterfaceDefinitions" in project "/Users/360_macmini/Desktop/Xamarin/TestPro/TestPro/TestPro.csproj" ("/Library/Frameworks/Mono.framework/External/xbuild/Xamarin/iOS/Xamarin.iOS.Common.targets"); "_CompileInterfaceDefinitions" depends on it.
Target _BeforeCoreCompileInterfaceDefinitions:
Target _BeforeCoreCompileInterfaceDefinitions needs to be built as output file 'obj/iPhoneSimulator/Debug/ibtool/_BundleResourceWithLogicalName.items' does not exist.
Task "Delete"
Using task Delete from Microsoft.Build.Tasks.Delete, Xamarin.MacDev.Tasks, Version=1.0.6120.27414, Culture=neutral, PublicKeyToken=null
Done executing task "Delete"
Done building target "_BeforeCoreCompileInterfaceDefinitions" in project "/Users/360_macmini/Desktop/Xamarin/TestPro/TestPro/TestPro.csproj".
Done building target "_BeforeCoreCompileInterfaceDefinitions" in project "/Users/360_macmini/Desktop/Xamarin/TestPro/TestPro/TestPro.csproj" ("/Library/Frameworks/Mono.framework/External/xbuild/Xamarin/iOS/Xamarin.iOS.Common.targets"); "_CompileInterfaceDefinitions" depends on it.
Building target "_ReadCoreCompileInterfaceDefinitions" in project "/Users/360_macmini/Desktop/Xamarin/TestPro/TestPro/TestPro.csproj" ("/Library/Frameworks/Mono.framework/External/xbuild/Xamarin/iOS/Xamarin.iOS.Common.targets"); "_CompileInterfaceDefinitions" depends on it.
Done building target "_ReadCoreCompileInterfaceDefinitions" in project "/Users/360_macmini/Desktop/Xamarin/TestPro/TestPro/TestPro.csproj" ("/Library/Frameworks/Mono.framework/External/xbuild/Xamarin/iOS/Xamarin.iOS.Common.targets"); "_CompileInterfaceDefinitions" depends on it.
Building target "_CoreCompileInterfaceDefinitions" in project "/Users/360_macmini/Desktop/Xamarin/TestPro/TestPro/TestPro.csproj" ("/Library/Frameworks/Mono.framework/External/xbuild/Xamarin/iOS/Xamarin.iOS.Common.targets"); "_CompileInterfaceDefinitions" depends on it.
Target _CoreCompileInterfaceDefinitions:
Target _CoreCompileInterfaceDefinitions needs to be built as output file 'obj/iPhoneSimulator/Debug/ibtool/_BundleResourceWithLogicalName.items' does not exist.
Task "IBTool"
Using task IBTool from Xamarin.iOS.Tasks.IBTool, Xamarin.iOS.Tasks, Version=0.0.0.0, Culture=neutral, PublicKeyToken=null
IBTool Task
AppManifest: Info.plist
InterfaceDefinitions:
LaunchScreen.storyboard
Main.storyboard
IntermediateOutputPath: obj/iPhoneSimulator/Debug/
IsWatchApp: False
IsWatch2App: False
IsAppExtension: False
ProjectDir: /Users/360_macmini/Desktop/Xamarin/TestPro/TestPro
ResourcePrefix: Resources
SdkBinPath: /Applications/Xcode.app/Contents/Developer/usr/bin
SdkPlatform: iPhoneSimulator
SdkRoot: /Applications/Xcode.app/Contents/Developer/Platforms/iPhoneSimulator.platform/Developer/SDKs/iPhoneSimulator10.0.sdk
SdkVersion: 10.0
Tool /Applications/Xcode.app/Contents/Developer/usr/bin/ibtool execution started with arguments: --errors --warnings --notices --output-format xml1 --minimum-deployment-target 10.0 --target-device iphone --target-device ipad --auto-activate-custom-fonts --sdk /Applications/Xcode.app/Contents/Developer/Platforms/iPhoneSimulator.platform/Developer/SDKs/iPhoneSimulator10.0.sdk --compilation-directory /Users/360_macmini/Desktop/Xamarin/TestPro/TestPro/obj/iPhoneSimulator/Debug/ibtool /Users/360_macmini/Desktop/Xamarin/TestPro/TestPro/LaunchScreen.storyboard
Tool /Applications/Xcode.app/Contents/Developer/usr/bin/ibtool execution finished (exit code = 0).
Tool /Applications/Xcode.app/Contents/Developer/usr/bin/ibtool execution started with arguments: --errors --warnings --notices --output-format xml1 --minimum-deployment-target 10.0 --target-device iphone --target-device ipad --auto-activate-custom-fonts --sdk /Applications/Xcode.app/Contents/Developer/Platforms/iPhoneSimulator.platform/Developer/SDKs/iPhoneSimulator10.0.sdk --compilation-directory /Users/360_macmini/Desktop/Xamarin/TestPro/TestPro/obj/iPhoneSimulator/Debug/ibtool /Users/360_macmini/Desktop/Xamarin/TestPro/TestPro/Main.storyboard
Tool /Applications/Xcode.app/Contents/Developer/usr/bin/ibtool execution finished (exit code = 0).
Tool /Applications/Xcode.app/Contents/Developer/usr/bin/ibtool execution started with arguments: --errors --warnings --notices --output-format xml1 --minimum-deployment-target 10.0 --target-device iphone --target-device ipad --auto-activate-custom-fonts --sdk /Applications/Xcode.app/Contents/Developer/Platforms/iPhoneSimulator.platform/Developer/SDKs/iPhoneSimulator10.0.sdk --link /Users/360_macmini/Desktop/Xamarin/TestPro/TestPro/obj/iPhoneSimulator/Debug/ibtool-link /Users/360_macmini/Desktop/Xamarin/TestPro/TestPro/obj/iPhoneSimulator/Debug/ibtool/LaunchScreen.storyboardc /Users/360_macmini/Desktop/Xamarin/TestPro/TestPro/obj/iPhoneSimulator/Debug/ibtool/Main.storyboardc
Tool /Applications/Xcode.app/Contents/Developer/usr/bin/ibtool execution finished (exit code = 0).
BundleResources Output:
obj/iPhoneSimulator/Debug/ibtool-link/LaunchScreen.storyboardc/01J-lp-oVM-view-Ze5-6b-2t3.nib
obj/iPhoneSimulator/Debug/ibtool-link/LaunchScreen.storyboardc/Info.plist
obj/iPhoneSimulator/Debug/ibtool-link/LaunchScreen.storyboardc/UIViewController-01J-lp-oVM.nib
obj/iPhoneSimulator/Debug/ibtool-link/Main.storyboardc/BYZ-38-t0r-view-8bC-Xf-vdC.nib
obj/iPhoneSimulator/Debug/ibtool-link/Main.storyboardc/Info.plist
obj/iPhoneSimulator/Debug/ibtool-link/Main.storyboardc/UIViewController-BYZ-38-t0r.nib
OutputManifests Output:
obj/iPhoneSimulator/Debug/ibtool-manifests/LaunchScreen.storyboardc
obj/iPhoneSimulator/Debug/ibtool-manifests/Main.storyboardc
obj/iPhoneSimulator/Debug/ibtool-manifests/link
Done executing task "IBTool"
Task "WriteItemsToFile"
Using task WriteItemsToFile from Xamarin.MacDev.Tasks.WriteItemsToFile, Xamarin.MacDev.Tasks, Version=1.0.6120.27414, Culture=neutral, PublicKeyToken=null
Done executing task "WriteItemsToFile"
Done building target "_CoreCompileInterfaceDefinitions" in project "/Users/360_macmini/Desktop/Xamarin/TestPro/TestPro/TestPro.csproj".
Done building target "_CoreCompileInterfaceDefinitions" in project "/Users/360_macmini/Desktop/Xamarin/TestPro/TestPro/TestPro.csproj" ("/Library/Frameworks/Mono.framework/External/xbuild/Xamarin/iOS/Xamarin.iOS.Common.targets"); "_CompileInterfaceDefinitions" depends on it.
Done building target "_CompileInterfaceDefinitions" in project "/Users/360_macmini/Desktop/Xamarin/TestPro/TestPro/TestPro.csproj" ("/Library/Frameworks/Mono.framework/External/xbuild/Xamarin/iOS/Xamarin.iOS.Common.targets"); "_CollectBundleResources" depends on it.
Building target "_CompileImageAssets" in project "/Users/360_macmini/Desktop/Xamarin/TestPro/TestPro/TestPro.csproj" ("/Library/Frameworks/Mono.framework/External/xbuild/Xamarin/iOS/Xamarin.iOS.Common.targets"); "_CollectBundleResources" depends on it.
Building target "_BeforeCoreCompileImageAssets" in project "/Users/360_macmini/Desktop/Xamarin/TestPro/TestPro/TestPro.csproj" ("/Library/Frameworks/Mono.framework/External/xbuild/Xamarin/iOS/Xamarin.iOS.Common.targets"); "_CompileImageAssets" depends on it.
Target _BeforeCoreCompileImageAssets:
Target _BeforeCoreCompileImageAssets needs to be built as output file 'obj/iPhoneSimulator/Debug/actool/_PartialAppManifest.items' does not exist.
Task "Delete"
Using task Delete from Microsoft.Build.Tasks.Delete, Xamarin.MacDev.Tasks, Version=1.0.6120.27414, Culture=neutral, PublicKeyToken=null
Done executing task "Delete"
Task "RemoveDir"
Using task RemoveDir from Microsoft.Build.Tasks.RemoveDir, Xamarin.MacDev.Tasks, Version=1.0.6120.27414, Culture=neutral, PublicKeyToken=null
Done executing task "RemoveDir"
Done building target "_BeforeCoreCompileImageAssets" in project "/Users/360_macmini/Desktop/Xamarin/TestPro/TestPro/TestPro.csproj".
Done building target "_BeforeCoreCompileImageAssets" in project "/Users/360_macmini/Desktop/Xamarin/TestPro/TestPro/TestPro.csproj" ("/Library/Frameworks/Mono.framework/External/xbuild/Xamarin/iOS/Xamarin.iOS.Common.targets"); "_CompileImageAssets" depends on it.
Building target "_ReadCompileImageAssets" in project "/Users/360_macmini/Desktop/Xamarin/TestPro/TestPro/TestPro.csproj" ("/Library/Frameworks/Mono.framework/External/xbuild/Xamarin/iOS/Xamarin.iOS.Common.targets"); "_CompileImageAssets" depends on it.
Done building target "_ReadCompileImageAssets" in project "/Users/360_macmini/Desktop/Xamarin/TestPro/TestPro/TestPro.csproj" ("/Library/Frameworks/Mono.framework/External/xbuild/Xamarin/iOS/Xamarin.iOS.Common.targets"); "_CompileImageAssets" depends on it.
Building target "_CoreCompileImageAssets" in project "/Users/360_macmini/Desktop/Xamarin/TestPro/TestPro/TestPro.csproj" ("/Library/Frameworks/Mono.framework/External/xbuild/Xamarin/iOS/Xamarin.iOS.Common.targets"); "_CompileImageAssets" depends on it.
Target _CoreCompileImageAssets:
Target _CoreCompileImageAssets needs to be built as output file 'obj/iPhoneSimulator/Debug/actool/_PartialAppManifest.items' does not exist.
Task "ACTool"
Using task ACTool from Xamarin.iOS.Tasks.ACTool, Xamarin.iOS.Tasks, Version=0.0.0.0, Culture=neutral, PublicKeyToken=null
ACTool Task
AppManifest: Info.plist
DeviceModel: <null>
DeviceOSVersion: <null>
ImageAssets:
Assets.xcassets/AppIcon.appiconset/Contents.json
Assets.xcassets/Contents.json
IntermediateOutputPath: obj/iPhoneSimulator/Debug/
IsWatchApp: False
OptimizePNGs: True
OutputPath: bin/iPhoneSimulator/Debug/
ProjectDir: /Users/360_macmini/Desktop/Xamarin/TestPro/TestPro
ResourcePrefix: Resources
SdkBinPath: /Applications/Xcode.app/Contents/Developer/usr/bin
SdkPlatform: iPhoneSimulator
SdkVersion: 10.0
Tool /Applications/Xcode.app/Contents/Developer/usr/bin/actool execution started with arguments: --errors --warnings --notices --output-format xml1 --output-partial-info-plist /Users/360_macmini/Desktop/Xamarin/TestPro/TestPro/obj/iPhoneSimulator/Debug/actool/partial-info.plist --app-icon AppIcon --compress-pngs --target-device iphone --target-device ipad --minimum-deployment-target 10.0 --platform iphonesimulator --compile /Users/360_macmini/Desktop/Xamarin/TestPro/TestPro/obj/iPhoneSimulator/Debug/actool/bundle /Users/360_macmini/Desktop/Xamarin/TestPro/TestPro/Assets.xcassets
Tool /Applications/Xcode.app/Contents/Developer/usr/bin/actool execution finished (exit code = 0).
Done executing task "ACTool"
Task "WriteItemsToFile"
Using task WriteItemsToFile from Xamarin.MacDev.Tasks.WriteItemsToFile, Xamarin.MacDev.Tasks, Version=1.0.6120.27414, Culture=neutral, PublicKeyToken=null
Done executing task "WriteItemsToFile"
Task "WriteItemsToFile"
Using task WriteItemsToFile from Xamarin.MacDev.Tasks.WriteItemsToFile, Xamarin.MacDev.Tasks, Version=1.0.6120.27414, Culture=neutral, PublicKeyToken=null
Done executing task "WriteItemsToFile"
Done building target "_CoreCompileImageAssets" in project "/Users/360_macmini/Desktop/Xamarin/TestPro/TestPro/TestPro.csproj".
Done building target "_CoreCompileImageAssets" in project "/Users/360_macmini/Desktop/Xamarin/TestPro/TestPro/TestPro.csproj" ("/Library/Frameworks/Mono.framework/External/xbuild/Xamarin/iOS/Xamarin.iOS.Common.targets"); "_CompileImageAssets" depends on it.
Done building target "_CompileImageAssets" in project "/Users/360_macmini/Desktop/Xamarin/TestPro/TestPro/TestPro.csproj" ("/Library/Frameworks/Mono.framework/External/xbuild/Xamarin/iOS/Xamarin.iOS.Common.targets"); "_CollectBundleResources" depends on it.
Building target "_CompileColladaAssets" in project "/Users/360_macmini/Desktop/Xamarin/TestPro/TestPro/TestPro.csproj" ("/Library/Frameworks/Mono.framework/External/xbuild/Xamarin/iOS/Xamarin.iOS.Common.targets"); "_CollectBundleResources" depends on it.
Building target "_CollectColladaAssets" in project "/Users/360_macmini/Desktop/Xamarin/TestPro/TestPro/TestPro.csproj" ("/Library/Frameworks/Mono.framework/External/xbuild/Xamarin/iOS/Xamarin.iOS.Common.targets"); "_CompileColladaAssets" depends on it.
Target _CollectColladaAssets:
Task "CollectBundleResources"
Using task CollectBundleResources from Xamarin.MacDev.Tasks.CollectBundleResources, Xamarin.MacDev.Tasks, Version=1.0.6120.27414, Culture=neutral, PublicKeyToken=null
CollectBundleResources Task
BundleResources: <null>
OptimizePropertyLists: False
OptimizePNGs: False
ProjectDir: /Users/360_macmini/Desktop/Xamarin/TestPro/TestPro
ResourcePrefix: Resources
Done executing task "CollectBundleResources"
Done building target "_CollectColladaAssets" in project "/Users/360_macmini/Desktop/Xamarin/TestPro/TestPro/TestPro.csproj".
Done building target "_CollectColladaAssets" in project "/Users/360_macmini/Desktop/Xamarin/TestPro/TestPro/TestPro.csproj" ("/Library/Frameworks/Mono.framework/External/xbuild/Xamarin/iOS/Xamarin.iOS.Common.targets"); "_CompileColladaAssets" depends on it.
Building target "_CoreCompileColladaAssets" in project "/Users/360_macmini/Desktop/Xamarin/TestPro/TestPro/TestPro.csproj" ("/Library/Frameworks/Mono.framework/External/xbuild/Xamarin/iOS/Xamarin.iOS.Common.targets"); "_CompileColladaAssets" depends on it.
Target _CoreCompileColladaAssets:
No input files were specified for target _CoreCompileColladaAssets, skipping.
Done building target "_CoreCompileColladaAssets" in project "/Users/360_macmini/Desktop/Xamarin/TestPro/TestPro/TestPro.csproj".
Done building target "_CoreCompileColladaAssets" in project "/Users/360_macmini/Desktop/Xamarin/TestPro/TestPro/TestPro.csproj" ("/Library/Frameworks/Mono.framework/External/xbuild/Xamarin/iOS/Xamarin.iOS.Common.targets"); "_CompileColladaAssets" depends on it.
Done building target "_CompileColladaAssets" in project "/Users/360_macmini/Desktop/Xamarin/TestPro/TestPro/TestPro.csproj" ("/Library/Frameworks/Mono.framework/External/xbuild/Xamarin/iOS/Xamarin.iOS.Common.targets"); "_CollectBundleResources" depends on it.
Building target "_CompileSceneKitAssets" in project "/Users/360_macmini/Desktop/Xamarin/TestPro/TestPro/TestPro.csproj" ("/Library/Frameworks/Mono.framework/External/xbuild/Xamarin/iOS/Xamarin.iOS.Common.targets"); "_CollectBundleResources" depends on it.
Building target "_BeforeCoreCompileSceneKitAssets" in project "/Users/360_macmini/Desktop/Xamarin/TestPro/TestPro/TestPro.csproj" ("/Library/Frameworks/Mono.framework/External/xbuild/Xamarin/iOS/Xamarin.iOS.Common.targets"); "_CompileSceneKitAssets" depends on it.
Target _BeforeCoreCompileSceneKitAssets:
No input files were specified for target _BeforeCoreCompileSceneKitAssets, skipping.
Done building target "_BeforeCoreCompileSceneKitAssets" in project "/Users/360_macmini/Desktop/Xamarin/TestPro/TestPro/TestPro.csproj".
Done building target "_BeforeCoreCompileSceneKitAssets" in project "/Users/360_macmini/Desktop/Xamarin/TestPro/TestPro/TestPro.csproj" ("/Library/Frameworks/Mono.framework/External/xbuild/Xamarin/iOS/Xamarin.iOS.Common.targets"); "_CompileSceneKitAssets" depends on it.
Building target "_ReadCoreCompileSceneKitAssets" in project "/Users/360_macmini/Desktop/Xamarin/TestPro/TestPro/TestPro.csproj" ("/Library/Frameworks/Mono.framework/External/xbuild/Xamarin/iOS/Xamarin.iOS.Common.targets"); "_CompileSceneKitAssets" depends on it.
Done building target "_ReadCoreCompileSceneKitAssets" in project "/Users/360_macmini/Desktop/Xamarin/TestPro/TestPro/TestPro.csproj" ("/Library/Frameworks/Mono.framework/External/xbuild/Xamarin/iOS/Xamarin.iOS.Common.targets"); "_CompileSceneKitAssets" depends on it.
Building target "_CoreCompileSceneKitAssets" in project "/Users/360_macmini/Desktop/Xamarin/TestPro/TestPro/TestPro.csproj" ("/Library/Frameworks/Mono.framework/External/xbuild/Xamarin/iOS/Xamarin.iOS.Common.targets"); "_CompileSceneKitAssets" depends on it.
Target _CoreCompileSceneKitAssets:
No input files were specified for target _CoreCompileSceneKitAssets, skipping.
Done building target "_CoreCompileSceneKitAssets" in project "/Users/360_macmini/Desktop/Xamarin/TestPro/TestPro/TestPro.csproj".
Done building target "_CoreCompileSceneKitAssets" in project "/Users/360_macmini/Desktop/Xamarin/TestPro/TestPro/TestPro.csproj" ("/Library/Frameworks/Mono.framework/External/xbuild/Xamarin/iOS/Xamarin.iOS.Common.targets"); "_CompileSceneKitAssets" depends on it.
Done building target "_CompileSceneKitAssets" in project "/Users/360_macmini/Desktop/Xamarin/TestPro/TestPro/TestPro.csproj" ("/Library/Frameworks/Mono.framework/External/xbuild/Xamarin/iOS/Xamarin.iOS.Common.targets"); "_CollectBundleResources" depends on it.
Building target "_CompileTextureAtlases" in project "/Users/360_macmini/Desktop/Xamarin/TestPro/TestPro/TestPro.csproj" ("/Library/Frameworks/Mono.framework/External/xbuild/Xamarin/iOS/Xamarin.iOS.Common.targets"); "_CollectBundleResources" depends on it.
Building target "_BeforeCompileTextureAtlases" in project "/Users/360_macmini/Desktop/Xamarin/TestPro/TestPro/TestPro.csproj" ("/Library/Frameworks/Mono.framework/External/xbuild/Xamarin/iOS/Xamarin.iOS.Common.targets"); "_CompileTextureAtlases" depends on it.
Target _BeforeCompileTextureAtlases:
No input files were specified for target _BeforeCompileTextureAtlases, skipping.
Done building target "_BeforeCompileTextureAtlases" in project "/Users/360_macmini/Desktop/Xamarin/TestPro/TestPro/TestPro.csproj".
Done building target "_BeforeCompileTextureAtlases" in project "/Users/360_macmini/Desktop/Xamarin/TestPro/TestPro/TestPro.csproj" ("/Library/Frameworks/Mono.framework/External/xbuild/Xamarin/iOS/Xamarin.iOS.Common.targets"); "_CompileTextureAtlases" depends on it.
Building target "_ReadCoreCompileTextureAtlases" in project "/Users/360_macmini/Desktop/Xamarin/TestPro/TestPro/TestPro.csproj" ("/Library/Frameworks/Mono.framework/External/xbuild/Xamarin/iOS/Xamarin.iOS.Common.targets"); "_CompileTextureAtlases" depends on it.
Done building target "_ReadCoreCompileTextureAtlases" in project "/Users/360_macmini/Desktop/Xamarin/TestPro/TestPro/TestPro.csproj" ("/Library/Frameworks/Mono.framework/External/xbuild/Xamarin/iOS/Xamarin.iOS.Common.targets"); "_CompileTextureAtlases" depends on it.
Building target "_CoreCompileTextureAtlases" in project "/Users/360_macmini/Desktop/Xamarin/TestPro/TestPro/TestPro.csproj" ("/Library/Frameworks/Mono.framework/External/xbuild/Xamarin/iOS/Xamarin.iOS.Common.targets"); "_CompileTextureAtlases" depends on it.
Target _CoreCompileTextureAtlases:
No input files were specified for target _CoreCompileTextureAtlases, skipping.
Done building target "_CoreCompileTextureAtlases" in project "/Users/360_macmini/Desktop/Xamarin/TestPro/TestPro/TestPro.csproj".
Done building target "_CoreCompileTextureAtlases" in project "/Users/360_macmini/Desktop/Xamarin/TestPro/TestPro/TestPro.csproj" ("/Library/Frameworks/Mono.framework/External/xbuild/Xamarin/iOS/Xamarin.iOS.Common.targets"); "_CompileTextureAtlases" depends on it.
Done building target "_CompileTextureAtlases" in project "/Users/360_macmini/Desktop/Xamarin/TestPro/TestPro/TestPro.csproj" ("/Library/Frameworks/Mono.framework/External/xbuild/Xamarin/iOS/Xamarin.iOS.Common.targets"); "_CollectBundleResources" depends on it.
Target _CollectBundleResources:
Task "CollectBundleResources"
Using task CollectBundleResources from Xamarin.MacDev.Tasks.CollectBundleResources, Xamarin.MacDev.Tasks, Version=1.0.6120.27414, Culture=neutral, PublicKeyToken=null
CollectBundleResources Task
BundleResources:
OptimizePropertyLists: True
OptimizePNGs: True
ProjectDir: /Users/360_macmini/Desktop/Xamarin/TestPro/TestPro
ResourcePrefix: Resources
Done executing task "CollectBundleResources"
Done building target "_CollectBundleResources" in project "/Users/360_macmini/Desktop/Xamarin/TestPro/TestPro/TestPro.csproj".
Done building target "_CollectBundleResources" in project "/Users/360_macmini/Desktop/Xamarin/TestPro/TestPro/TestPro.csproj" ("/Library/Frameworks/Mono.framework/External/xbuild/Xamarin/iOS/Xamarin.iOS.Common.targets"); "Build" depends on it.
Building target "_OptimizePngImages" in project "/Users/360_macmini/Desktop/Xamarin/TestPro/TestPro/TestPro.csproj" ("/Library/Frameworks/Mono.framework/External/xbuild/Xamarin/iOS/Xamarin.iOS.Common.targets"); "Build" depends on it.
Building target "_CollectPngImages" in project "/Users/360_macmini/Desktop/Xamarin/TestPro/TestPro/TestPro.csproj" ("/Library/Frameworks/Mono.framework/External/xbuild/Xamarin/iOS/Xamarin.iOS.Common.targets"); "_OptimizePngImages" depends on it.
Done building target "_CollectPngImages" in project "/Users/360_macmini/Desktop/Xamarin/TestPro/TestPro/TestPro.csproj" ("/Library/Frameworks/Mono.framework/External/xbuild/Xamarin/iOS/Xamarin.iOS.Common.targets"); "_OptimizePngImages" depends on it.
Building target "_CoreOptimizePngImages" in project "/Users/360_macmini/Desktop/Xamarin/TestPro/TestPro/TestPro.csproj" ("/Library/Frameworks/Mono.framework/External/xbuild/Xamarin/iOS/Xamarin.iOS.Common.targets"); "_OptimizePngImages" depends on it.
Target _CoreOptimizePngImages:
No output files were specified for target _CoreOptimizePngImages, skipping.
Done building target "_CoreOptimizePngImages" in project "/Users/360_macmini/Desktop/Xamarin/TestPro/TestPro/TestPro.csproj".
Done building target "_CoreOptimizePngImages" in project "/Users/360_macmini/Desktop/Xamarin/TestPro/TestPro/TestPro.csproj" ("/Library/Frameworks/Mono.framework/External/xbuild/Xamarin/iOS/Xamarin.iOS.Common.targets"); "_OptimizePngImages" depends on it.
Building target "_AfterCoreOptimizePngImages" in project "/Users/360_macmini/Desktop/Xamarin/TestPro/TestPro/TestPro.csproj" ("/Library/Frameworks/Mono.framework/External/xbuild/Xamarin/iOS/Xamarin.iOS.Common.targets"); "_OptimizePngImages" depends on it.
Target _AfterCoreOptimizePngImages skipped due to false condition: '@(_PngImage)' != ''
Done building target "_AfterCoreOptimizePngImages" in project "/Users/360_macmini/Desktop/Xamarin/TestPro/TestPro/TestPro.csproj" ("/Library/Frameworks/Mono.framework/External/xbuild/Xamarin/iOS/Xamarin.iOS.Common.targets"); "_OptimizePngImages" depends on it.
Done building target "_OptimizePngImages" in project "/Users/360_macmini/Desktop/Xamarin/TestPro/TestPro/TestPro.csproj" ("/Library/Frameworks/Mono.framework/External/xbuild/Xamarin/iOS/Xamarin.iOS.Common.targets"); "Build" depends on it.
Building target "_OptimizePropertyLists" in project "/Users/360_macmini/Desktop/Xamarin/TestPro/TestPro/TestPro.csproj" ("/Library/Frameworks/Mono.framework/External/xbuild/Xamarin/iOS/Xamarin.iOS.Common.targets"); "Build" depends on it.
Building target "_CollectPropertyLists" in project "/Users/360_macmini/Desktop/Xamarin/TestPro/TestPro/TestPro.csproj" ("/Library/Frameworks/Mono.framework/External/xbuild/Xamarin/iOS/Xamarin.iOS.Common.targets"); "_OptimizePropertyLists" depends on it.
Done building target "_CollectPropertyLists" in project "/Users/360_macmini/Desktop/Xamarin/TestPro/TestPro/TestPro.csproj" ("/Library/Frameworks/Mono.framework/External/xbuild/Xamarin/iOS/Xamarin.iOS.Common.targets"); "_OptimizePropertyLists" depends on it.
Building target "_CoreOptimizePropertyLists" in project "/Users/360_macmini/Desktop/Xamarin/TestPro/TestPro/TestPro.csproj" ("/Library/Frameworks/Mono.framework/External/xbuild/Xamarin/iOS/Xamarin.iOS.Common.targets"); "_OptimizePropertyLists" depends on it.
Target _CoreOptimizePropertyLists:
No input files were specified for target _CoreOptimizePropertyLists, skipping.
Done building target "_CoreOptimizePropertyLists" in project "/Users/360_macmini/Desktop/Xamarin/TestPro/TestPro/TestPro.csproj".
Done building target "_CoreOptimizePropertyLists" in project "/Users/360_macmini/Desktop/Xamarin/TestPro/TestPro/TestPro.csproj" ("/Library/Frameworks/Mono.framework/External/xbuild/Xamarin/iOS/Xamarin.iOS.Common.targets"); "_OptimizePropertyLists" depends on it.
Building target "_AfterCoreOptimizePropertyLists" in project "/Users/360_macmini/Desktop/Xamarin/TestPro/TestPro/TestPro.csproj" ("/Library/Frameworks/Mono.framework/External/xbuild/Xamarin/iOS/Xamarin.iOS.Common.targets"); "_OptimizePropertyLists" depends on it.
Target _AfterCoreOptimizePropertyLists skipped due to false condition: '@(_PropertyList)' != ''
Done building target "_AfterCoreOptimizePropertyLists" in project "/Users/360_macmini/Desktop/Xamarin/TestPro/TestPro/TestPro.csproj" ("/Library/Frameworks/Mono.framework/External/xbuild/Xamarin/iOS/Xamarin.iOS.Common.targets"); "_OptimizePropertyLists" depends on it.
Done building target "_OptimizePropertyLists" in project "/Users/360_macmini/Desktop/Xamarin/TestPro/TestPro/TestPro.csproj" ("/Library/Frameworks/Mono.framework/External/xbuild/Xamarin/iOS/Xamarin.iOS.Common.targets"); "Build" depends on it.
Building target "_OptimizeLocalizationFiles" in project "/Users/360_macmini/Desktop/Xamarin/TestPro/TestPro/TestPro.csproj" ("/Library/Frameworks/Mono.framework/External/xbuild/Xamarin/iOS/Xamarin.iOS.Common.targets"); "Build" depends on it.
Building target "_CollectLocalizationFiles" in project "/Users/360_macmini/Desktop/Xamarin/TestPro/TestPro/TestPro.csproj" ("/Library/Frameworks/Mono.framework/External/xbuild/Xamarin/iOS/Xamarin.iOS.Common.targets"); "_OptimizeLocalizationFiles" depends on it.
Done building target "_CollectLocalizationFiles" in project "/Users/360_macmini/Desktop/Xamarin/TestPro/TestPro/TestPro.csproj" ("/Library/Frameworks/Mono.framework/External/xbuild/Xamarin/iOS/Xamarin.iOS.Common.targets"); "_OptimizeLocalizationFiles" depends on it.
Building target "_CoreOptimizeLocalizationFiles" in project "/Users/360_macmini/Desktop/Xamarin/TestPro/TestPro/TestPro.csproj" ("/Library/Frameworks/Mono.framework/External/xbuild/Xamarin/iOS/Xamarin.iOS.Common.targets"); "_OptimizeLocalizationFiles" depends on it.
Target _CoreOptimizeLocalizationFiles:
No input files were specified for target _CoreOptimizeLocalizationFiles, skipping.
Done building target "_CoreOptimizeLocalizationFiles" in project "/Users/360_macmini/Desktop/Xamarin/TestPro/TestPro/TestPro.csproj".
Done building target "_CoreOptimizeLocalizationFiles" in project "/Users/360_macmini/Desktop/Xamarin/TestPro/TestPro/TestPro.csproj" ("/Library/Frameworks/Mono.framework/External/xbuild/Xamarin/iOS/Xamarin.iOS.Common.targets"); "_OptimizeLocalizationFiles" depends on it.
Building target "_AfterCoreOptimizeLocalizationFiles" in project "/Users/360_macmini/Desktop/Xamarin/TestPro/TestPro/TestPro.csproj" ("/Library/Frameworks/Mono.framework/External/xbuild/Xamarin/iOS/Xamarin.iOS.Common.targets"); "_OptimizeLocalizationFiles" depends on it.
Target _AfterCoreOptimizeLocalizationFiles skipped due to false condition: '@(_LocalizationFile)' != ''
Done building target "_AfterCoreOptimizeLocalizationFiles" in project "/Users/360_macmini/Desktop/Xamarin/TestPro/TestPro/TestPro.csproj" ("/Library/Frameworks/Mono.framework/External/xbuild/Xamarin/iOS/Xamarin.iOS.Common.targets"); "_OptimizeLocalizationFiles" depends on it.
Done building target "_OptimizeLocalizationFiles" in project "/Users/360_macmini/Desktop/Xamarin/TestPro/TestPro/TestPro.csproj" ("/Library/Frameworks/Mono.framework/External/xbuild/Xamarin/iOS/Xamarin.iOS.Common.targets"); "Build" depends on it.
Building target "_PackLibraryResources" in project "/Users/360_macmini/Desktop/Xamarin/TestPro/TestPro/TestPro.csproj" ("/Library/Frameworks/Mono.framework/External/xbuild/Xamarin/iOS/Xamarin.iOS.Common.targets"); "Build" depends on it.
Target _PackLibraryResources skipped due to false condition: '$(_CanOutputAppBundle)' == 'false'
Done building target "_PackLibraryResources" in project "/Users/360_macmini/Desktop/Xamarin/TestPro/TestPro/TestPro.csproj" ("/Library/Frameworks/Mono.framework/External/xbuild/Xamarin/iOS/Xamarin.iOS.Common.targets"); "Build" depends on it.
Building target "_UnpackLibraryResources" in project "/Users/360_macmini/Desktop/Xamarin/TestPro/TestPro/TestPro.csproj" ("/Library/Frameworks/Mono.framework/External/xbuild/Xamarin/iOS/Xamarin.iOS.Common.targets"); "Build" depends on it.
Building target "ResolveReferences" in project "/Users/360_macmini/Desktop/Xamarin/TestPro/TestPro/TestPro.csproj" ("/Library/Frameworks/Mono.framework/Versions/4.6.1/lib/mono/xbuild/14.0/bin/Microsoft.Common.targets"); "_UnpackLibraryResources" depends on it.
Building target "_SeparateAppExtensionReferences" in project "/Users/360_macmini/Desktop/Xamarin/TestPro/TestPro/TestPro.csproj" ("/Library/Frameworks/Mono.framework/External/xbuild/Xamarin/iOS/Xamarin.iOS.Common.targets"); "ResolveReferences" depends on it.
Done building target "_SeparateAppExtensionReferences" in project "/Users/360_macmini/Desktop/Xamarin/TestPro/TestPro/TestPro.csproj" ("/Library/Frameworks/Mono.framework/External/xbuild/Xamarin/iOS/Xamarin.iOS.Common.targets"); "ResolveReferences" depends on it.
Building target "_SeparateWatchAppReferences" in project "/Users/360_macmini/Desktop/Xamarin/TestPro/TestPro/TestPro.csproj" ("/Library/Frameworks/Mono.framework/External/xbuild/Xamarin/iOS/Xamarin.iOS.Common.targets"); "ResolveReferences" depends on it.
Done building target "_SeparateWatchAppReferences" in project "/Users/360_macmini/Desktop/Xamarin/TestPro/TestPro/TestPro.csproj" ("/Library/Frameworks/Mono.framework/External/xbuild/Xamarin/iOS/Xamarin.iOS.Common.targets"); "ResolveReferences" depends on it.
Building target "BeforeResolveReferences" in project "/Users/360_macmini/Desktop/Xamarin/TestPro/TestPro/TestPro.csproj" ("/Library/Frameworks/Mono.framework/Versions/4.6.1/lib/mono/xbuild/14.0/bin/Microsoft.Common.targets"); "ResolveReferences" depends on it.
Done building target "BeforeResolveReferences" in project "/Users/360_macmini/Desktop/Xamarin/TestPro/TestPro/TestPro.csproj" ("/Library/Frameworks/Mono.framework/Versions/4.6.1/lib/mono/xbuild/14.0/bin/Microsoft.Common.targets"); "ResolveReferences" depends on it.
Building target "ResolveProjectReferences" in project "/Users/360_macmini/Desktop/Xamarin/TestPro/TestPro/TestPro.csproj" ("/Library/Frameworks/Mono.framework/Versions/4.6.1/lib/mono/xbuild/14.0/bin/Microsoft.Common.targets"); "ResolveReferences" depends on it.
Building target "SplitProjectReferencesByExistent" in project "/Users/360_macmini/Desktop/Xamarin/TestPro/TestPro/TestPro.csproj" ("/Library/Frameworks/Mono.framework/Versions/4.6.1/lib/mono/xbuild/14.0/bin/Microsoft.Common.targets"); "ResolveProjectReferences" depends on it.
Building target "AssignProjectConfiguration" in project "/Users/360_macmini/Desktop/Xamarin/TestPro/TestPro/TestPro.csproj" ("/Library/Frameworks/Mono.framework/Versions/4.6.1/lib/mono/xbuild/14.0/bin/Microsoft.Common.targets"); "SplitProjectReferencesByExistent" depends on it.
Target AssignProjectConfiguration skipped due to false condition: '@(ProjectReference)' != ''
Done building target "AssignProjectConfiguration" in project "/Users/360_macmini/Desktop/Xamarin/TestPro/TestPro/TestPro.csproj" ("/Library/Frameworks/Mono.framework/Versions/4.6.1/lib/mono/xbuild/14.0/bin/Microsoft.Common.targets"); "SplitProjectReferencesByExistent" depends on it.
Done building target "SplitProjectReferencesByExistent" in project "/Users/360_macmini/Desktop/Xamarin/TestPro/TestPro/TestPro.csproj" ("/Library/Frameworks/Mono.framework/Versions/4.6.1/lib/mono/xbuild/14.0/bin/Microsoft.Common.targets"); "ResolveProjectReferences" depends on it.
Done building target "ResolveProjectReferences" in project "/Users/360_macmini/Desktop/Xamarin/TestPro/TestPro/TestPro.csproj" ("/Library/Frameworks/Mono.framework/Versions/4.6.1/lib/mono/xbuild/14.0/bin/Microsoft.Common.targets"); "ResolveReferences" depends on it.
Building target "ResolveAssemblyReferences" in project "/Users/360_macmini/Desktop/Xamarin/TestPro/TestPro/TestPro.csproj" ("/Library/Frameworks/Mono.framework/Versions/4.6.1/lib/mono/xbuild/14.0/bin/Microsoft.Common.targets"); "ResolveReferences" depends on it.
Building target "GetFrameworkPaths" in project "/Users/360_macmini/Desktop/Xamarin/TestPro/TestPro/TestPro.csproj" ("/Library/Frameworks/Mono.framework/Versions/4.6.1/lib/mono/xbuild/14.0/bin/Microsoft.Common.targets"); "ResolveAssemblyReferences" depends on it.
Target GetFrameworkPaths skipped due to false condition: '$(TargetFrameworkIdentifier)' == '' or '$(TargetFrameworkIdentifier)' == '.NETFramework'
Done building target "GetFrameworkPaths" in project "/Users/360_macmini/Desktop/Xamarin/TestPro/TestPro/TestPro.csproj" ("/Library/Frameworks/Mono.framework/Versions/4.6.1/lib/mono/xbuild/14.0/bin/Microsoft.Common.targets"); "ResolveAssemblyReferences" depends on it.
Building target "GetReferenceAssemblyPaths" in project "/Users/360_macmini/Desktop/Xamarin/TestPro/TestPro/TestPro.csproj" ("/Library/Frameworks/Mono.framework/Versions/4.6.1/lib/mono/xbuild/14.0/bin/Microsoft.Common.targets"); "ResolveAssemblyReferences" depends on it.
Target GetReferenceAssemblyPaths:
Task "CreateProperty"
Using task CreateProperty from Microsoft.Build.Tasks.CreateProperty, Microsoft.Build.Tasks.Core, Version=14.0.0.0, Culture=neutral, PublicKeyToken=b03f5f7f11d50a3a
Done executing task "CreateProperty"
Task "GetReferenceAssemblyPaths"
Using task GetReferenceAssemblyPaths from Microsoft.Build.Tasks.GetReferenceAssemblyPaths, Microsoft.Build.Tasks.Core, Version=14.0.0.0, Culture=neutral, PublicKeyToken=b03f5f7f11d50a3a
Looking for framework 'Xamarin.iOS,Version=v1.0' in root path '/Library/Frameworks/Mono.framework/External/xbuild-frameworks'
Found framework definition list '/Library/Frameworks/Mono.framework/External/xbuild-frameworks/Xamarin.iOS/v1.0/RedistList/FrameworkList.xml' for framework 'Xamarin.iOS,Version=v1.0'
Done executing task "GetReferenceAssemblyPaths"
Done building target "GetReferenceAssemblyPaths" in project "/Users/360_macmini/Desktop/Xamarin/TestPro/TestPro/TestPro.csproj".
Done building target "GetReferenceAssemblyPaths" in project "/Users/360_macmini/Desktop/Xamarin/TestPro/TestPro/TestPro.csproj" ("/Library/Frameworks/Mono.framework/Versions/4.6.1/lib/mono/xbuild/14.0/bin/Microsoft.Common.targets"); "ResolveAssemblyReferences" depends on it.
Building target "ResolveNuGetPackageAssets" in project "/Users/360_macmini/Desktop/Xamarin/TestPro/TestPro/TestPro.csproj" ("/Library/Frameworks/Mono.framework/Versions/4.6.1/lib/mono/xbuild/Microsoft/NuGet/Microsoft.NuGet.targets"); "ResolveAssemblyReferences" depends on it.
Target ResolveNuGetPackageAssets skipped due to false condition: '$(ResolveNuGetPackages)' == 'true' and exists('$(ProjectLockFile)')
Done building target "ResolveNuGetPackageAssets" in project "/Users/360_macmini/Desktop/Xamarin/TestPro/TestPro/TestPro.csproj" ("/Library/Frameworks/Mono.framework/Versions/4.6.1/lib/mono/xbuild/Microsoft/NuGet/Microsoft.NuGet.targets"); "ResolveAssemblyReferences" depends on it.
Building target "_AddCorlibReference" in project "/Users/360_macmini/Desktop/Xamarin/TestPro/TestPro/TestPro.csproj" ("/Library/Frameworks/Mono.framework/Versions/4.6.1/lib/mono/xbuild/14.0/bin/Microsoft.CSharp.targets"); "ResolveAssemblyReferences" depends on it.
Done building target "_AddCorlibReference" in project "/Users/360_macmini/Desktop/Xamarin/TestPro/TestPro/TestPro.csproj" ("/Library/Frameworks/Mono.framework/Versions/4.6.1/lib/mono/xbuild/14.0/bin/Microsoft.CSharp.targets"); "ResolveAssemblyReferences" depends on it.
Target ResolveAssemblyReferences:
Task "CreateItem"
Using task CreateItem from Microsoft.Build.Tasks.CreateItem, Microsoft.Build.Tasks.Core, Version=14.0.0.0, Culture=neutral, PublicKeyToken=b03f5f7f11d50a3a
Done executing task "CreateItem"
Task "CreateItem"
Using task CreateItem from Microsoft.Build.Tasks.CreateItem, Microsoft.Build.Tasks.Core, Version=14.0.0.0, Culture=neutral, PublicKeyToken=b03f5f7f11d50a3a
Done executing task "CreateItem"
Task "ResolveAssemblyReference"
Using task ResolveAssemblyReference from Microsoft.Build.Tasks.ResolveAssemblyReference, Microsoft.Build.Tasks.Core, Version=14.0.0.0, Culture=neutral, PublicKeyToken=b03f5f7f11d50a3a
TargetFrameworkDirectories:
/Library/Frameworks/Xamarin.iOS.framework/Versions/Current/lib/mono/Xamarin.iOS/
/Library/Frameworks/Xamarin.iOS.framework/Versions/Current/lib/mono/Xamarin.iOS//Facades/
SearchPaths:
{CandidateAssemblyFiles}
{HintPathFromItem}
{TargetFrameworkDirectory}
{PkgConfig}
{GAC}
{RawFileName}
bin/iPhoneSimulator/Debug/
Primary Reference System
Reference System resolved to /Library/Frameworks/Xamarin.iOS.framework/Versions/Current/lib/mono/Xamarin.iOS/System.dll. CopyLocal = False
Reference found at search path {TargetFrameworkDirectory}
For searchpath {CandidateAssemblyFiles}
Warning: {CandidateAssemblyFiles} not supported currently
For searchpath {HintPathFromItem}
HintPath attribute not found
For searchpath {TargetFrameworkDirectory}
Primary Reference System.Xml
Reference System.Xml resolved to /Library/Frameworks/Xamarin.iOS.framework/Versions/Current/lib/mono/Xamarin.iOS/System.Xml.dll. CopyLocal = False
Reference found at search path {TargetFrameworkDirectory}
For searchpath {CandidateAssemblyFiles}
Warning: {CandidateAssemblyFiles} not supported currently
For searchpath {HintPathFromItem}
HintPath attribute not found
For searchpath {TargetFrameworkDirectory}
Primary Reference System.Core
Reference System.Core resolved to /Library/Frameworks/Xamarin.iOS.framework/Versions/Current/lib/mono/Xamarin.iOS/System.Core.dll. CopyLocal = False
Reference found at search path {TargetFrameworkDirectory}
For searchpath {CandidateAssemblyFiles}
Warning: {CandidateAssemblyFiles} not supported currently
For searchpath {HintPathFromItem}
HintPath attribute not found
For searchpath {TargetFrameworkDirectory}
Primary Reference Xamarin.iOS
Reference Xamarin.iOS resolved to /Library/Frameworks/Xamarin.iOS.framework/Versions/Current/lib/mono/Xamarin.iOS/Xamarin.iOS.dll. CopyLocal = False
Reference found at search path {TargetFrameworkDirectory}
For searchpath {CandidateAssemblyFiles}
Warning: {CandidateAssemblyFiles} not supported currently
For searchpath {HintPathFromItem}
HintPath attribute not found
For searchpath {TargetFrameworkDirectory}
Primary Reference GoogleConversionTracking.Unified
Reference GoogleConversionTracking.Unified resolved to ../../../../Downloads/GoogleConversionTracking.Unified.dll. CopyLocal = True
Reference found at search path {HintPathFromItem}
For searchpath {CandidateAssemblyFiles}
Warning: {CandidateAssemblyFiles} not supported currently
For searchpath {HintPathFromItem}
Primary Reference from AssemblyFiles /Library/Frameworks/Xamarin.iOS.framework/Versions/Current/lib/mono/Xamarin.iOS//mscorlib.dll
Done executing task "ResolveAssemblyReference"
Done building target "ResolveAssemblyReferences" in project "/Users/360_macmini/Desktop/Xamarin/TestPro/TestPro/TestPro.csproj".
Done building target "ResolveAssemblyReferences" in project "/Users/360_macmini/Desktop/Xamarin/TestPro/TestPro/TestPro.csproj" ("/Library/Frameworks/Mono.framework/Versions/4.6.1/lib/mono/xbuild/14.0/bin/Microsoft.Common.targets"); "ResolveReferences" depends on it.
Building target "AfterResolveReferences" in project "/Users/360_macmini/Desktop/Xamarin/TestPro/TestPro/TestPro.csproj" ("/Library/Frameworks/Mono.framework/Versions/4.6.1/lib/mono/xbuild/14.0/bin/Microsoft.Common.targets"); "ResolveReferences" depends on it.
Done building target "AfterResolveReferences" in project "/Users/360_macmini/Desktop/Xamarin/TestPro/TestPro/TestPro.csproj" ("/Library/Frameworks/Mono.framework/Versions/4.6.1/lib/mono/xbuild/14.0/bin/Microsoft.Common.targets"); "ResolveReferences" depends on it.
Building target "ImplicitlyExpandDesignTimeFacades" in project "/Users/360_macmini/Desktop/Xamarin/TestPro/TestPro/TestPro.csproj" ("/Library/Frameworks/Mono.framework/External/xbuild/Xamarin/iOS/Xamarin.iOS.Common.targets"); "ResolveReferences" depends on it.
Done building target "ImplicitlyExpandDesignTimeFacades" in project "/Users/360_macmini/Desktop/Xamarin/TestPro/TestPro/TestPro.csproj" ("/Library/Frameworks/Mono.framework/External/xbuild/Xamarin/iOS/Xamarin.iOS.Common.targets"); "ResolveReferences" depends on it.
Done building target "ResolveReferences" in project "/Users/360_macmini/Desktop/Xamarin/TestPro/TestPro/TestPro.csproj" ("/Library/Frameworks/Mono.framework/Versions/4.6.1/lib/mono/xbuild/14.0/bin/Microsoft.Common.targets"); "_UnpackLibraryResources" depends on it.
Target _UnpackLibraryResources:
Task "UnpackLibraryResources"
Using task UnpackLibraryResources from Xamarin.MacDev.Tasks.UnpackLibraryResources, Xamarin.MacDev.Tasks, Version=1.0.6120.27414, Culture=neutral, PublicKeyToken=null
UnpackLibraryResources Task
Prefix: monotouch
IntermediateOutputPath: obj/iPhoneSimulator/Debug/
NoOverwrite:
obj/iPhoneSimulator/Debug/ibtool-link/LaunchScreen.storyboardc/01J-lp-oVM-view-Ze5-6b-2t3.nib
obj/iPhoneSimulator/Debug/ibtool-link/LaunchScreen.storyboardc/Info.plist
obj/iPhoneSimulator/Debug/ibtool-link/LaunchScreen.storyboardc/UIViewController-01J-lp-oVM.nib
obj/iPhoneSimulator/Debug/ibtool-link/Main.storyboardc/BYZ-38-t0r-view-8bC-Xf-vdC.nib
obj/iPhoneSimulator/Debug/ibtool-link/Main.storyboardc/Info.plist
obj/iPhoneSimulator/Debug/ibtool-link/Main.storyboardc/UIViewController-BYZ-38-t0r.nib
ReferencedLibraries:
/Library/Frameworks/Xamarin.iOS.framework/Versions/Current/lib/mono/Xamarin.iOS/System.dll
/Library/Frameworks/Xamarin.iOS.framework/Versions/Current/lib/mono/Xamarin.iOS/System.Xml.dll
/Library/Frameworks/Xamarin.iOS.framework/Versions/Current/lib/mono/Xamarin.iOS/System.Core.dll
/Library/Frameworks/Xamarin.iOS.framework/Versions/Current/lib/mono/Xamarin.iOS/Xamarin.iOS.dll
../../../../Downloads/GoogleConversionTracking.Unified.dll
/Library/Frameworks/Xamarin.iOS.framework/Versions/Current/lib/mono/Xamarin.iOS//mscorlib.dll
/Library/Frameworks/Xamarin.iOS.framework/Versions/Current/lib/mono/Xamarin.iOS//mscorlib.dll
Skipping framework assembly: /Library/Frameworks/Xamarin.iOS.framework/Versions/Current/lib/mono/Xamarin.iOS/System.dll
Skipping framework assembly: /Library/Frameworks/Xamarin.iOS.framework/Versions/Current/lib/mono/Xamarin.iOS/System.Xml.dll
Skipping framework assembly: /Library/Frameworks/Xamarin.iOS.framework/Versions/Current/lib/mono/Xamarin.iOS/System.Core.dll
Skipping framework assembly: /Library/Frameworks/Xamarin.iOS.framework/Versions/Current/lib/mono/Xamarin.iOS/Xamarin.iOS.dll
Inspecting assembly: ../../../../Downloads/GoogleConversionTracking.Unified.dll
Inspecting assembly: /Library/Frameworks/Xamarin.iOS.framework/Versions/Current/lib/mono/Xamarin.iOS//mscorlib.dll
Inspecting assembly: /Library/Frameworks/Xamarin.iOS.framework/Versions/Current/lib/mono/Xamarin.iOS//mscorlib.dll
Done executing task "UnpackLibraryResources"
Done building target "_UnpackLibraryResources" in project "/Users/360_macmini/Desktop/Xamarin/TestPro/TestPro/TestPro.csproj".
Done building target "_UnpackLibraryResources" in project "/Users/360_macmini/Desktop/Xamarin/TestPro/TestPro/TestPro.csproj" ("/Library/Frameworks/Mono.framework/External/xbuild/Xamarin/iOS/Xamarin.iOS.Common.targets"); "Build" depends on it.
Building target "BeforeBuild" in project "/Users/360_macmini/Desktop/Xamarin/TestPro/TestPro/TestPro.csproj" ("/Library/Frameworks/Mono.framework/Versions/4.6.1/lib/mono/xbuild/14.0/bin/Microsoft.Common.targets"); "Build" depends on it.
Done building target "BeforeBuild" in project "/Users/360_macmini/Desktop/Xamarin/TestPro/TestPro/TestPro.csproj" ("/Library/Frameworks/Mono.framework/Versions/4.6.1/lib/mono/xbuild/14.0/bin/Microsoft.Common.targets"); "Build" depends on it.
Building target "CoreBuild" in project "/Users/360_macmini/Desktop/Xamarin/TestPro/TestPro/TestPro.csproj" ("/Library/Frameworks/Mono.framework/Versions/4.6.1/lib/mono/xbuild/14.0/bin/Microsoft.Common.targets"); "Build" depends on it.
Building target "GetFrameworkPaths" in project "/Users/360_macmini/Desktop/Xamarin/TestPro/TestPro/TestPro.csproj" ("/Library/Frameworks/Mono.framework/Versions/4.6.1/lib/mono/xbuild/14.0/bin/Microsoft.Common.targets"); "CoreBuild" depends on it.
Target GetFrameworkPaths skipped due to false condition: '$(TargetFrameworkIdentifier)' == '' or '$(TargetFrameworkIdentifier)' == '.NETFramework'
Done building target "GetFrameworkPaths" in project "/Users/360_macmini/Desktop/Xamarin/TestPro/TestPro/TestPro.csproj" ("/Library/Frameworks/Mono.framework/Versions/4.6.1/lib/mono/xbuild/14.0/bin/Microsoft.Common.targets"); "CoreBuild" depends on it.
Building target "PreBuildEvent" in project "/Users/360_macmini/Desktop/Xamarin/TestPro/TestPro/TestPro.csproj" ("/Library/Frameworks/Mono.framework/Versions/4.6.1/lib/mono/xbuild/14.0/bin/Microsoft.Common.targets"); "CoreBuild" depends on it.
Target PreBuildEvent skipped due to false condition: '$(PreBuildEvent)' != ''
Done building target "PreBuildEvent" in project "/Users/360_macmini/Desktop/Xamarin/TestPro/TestPro/TestPro.csproj" ("/Library/Frameworks/Mono.framework/Versions/4.6.1/lib/mono/xbuild/14.0/bin/Microsoft.Common.targets"); "CoreBuild" depends on it.
Building target "CopyFilesMarkedCopyLocal" in project "/Users/360_macmini/Desktop/Xamarin/TestPro/TestPro/TestPro.csproj" ("/Library/Frameworks/Mono.framework/Versions/4.6.1/lib/mono/xbuild/14.0/bin/Microsoft.Common.targets"); "CoreBuild" depends on it.
Target CopyFilesMarkedCopyLocal:
Task "Copy"
Using task Copy from Microsoft.Build.Tasks.Copy, Xamarin.MacDev.Tasks, Version=1.0.6120.27414, Culture=neutral, PublicKeyToken=null
Copying file from '/Users/360_macmini/Downloads/GoogleConversionTracking.Unified.dll' to '/Users/360_macmini/Desktop/Xamarin/TestPro/TestPro/bin/iPhoneSimulator/Debug/GoogleConversionTracking.Unified.dll'
Done executing task "Copy"
Done building target "CopyFilesMarkedCopyLocal" in project "/Users/360_macmini/Desktop/Xamarin/TestPro/TestPro/TestPro.csproj".
Done building target "CopyFilesMarkedCopyLocal" in project "/Users/360_macmini/Desktop/Xamarin/TestPro/TestPro/TestPro.csproj" ("/Library/Frameworks/Mono.framework/Versions/4.6.1/lib/mono/xbuild/14.0/bin/Microsoft.Common.targets"); "CoreBuild" depends on it.
Building target "PrepareResources" in project "/Users/360_macmini/Desktop/Xamarin/TestPro/TestPro/TestPro.csproj" ("/Library/Frameworks/Mono.framework/Versions/4.6.1/lib/mono/xbuild/14.0/bin/Microsoft.Common.targets"); "CoreBuild" depends on it.
Building target "ResolveNuGetPackageAssets" in project "/Users/360_macmini/Desktop/Xamarin/TestPro/TestPro/TestPro.csproj" ("/Library/Frameworks/Mono.framework/Versions/4.6.1/lib/mono/xbuild/Microsoft/NuGet/Microsoft.NuGet.targets"); "PrepareResources" depends on it.
Target ResolveNuGetPackageAssets skipped due to false condition: '$(ResolveNuGetPackages)' == 'true' and exists('$(ProjectLockFile)')
Done building target "ResolveNuGetPackageAssets" in project "/Users/360_macmini/Desktop/Xamarin/TestPro/TestPro/TestPro.csproj" ("/Library/Frameworks/Mono.framework/Versions/4.6.1/lib/mono/xbuild/Microsoft/NuGet/Microsoft.NuGet.targets"); "PrepareResources" depends on it.
Building target "AssignTargetPaths" in project "/Users/360_macmini/Desktop/Xamarin/TestPro/TestPro/TestPro.csproj" ("/Library/Frameworks/Mono.framework/Versions/4.6.1/lib/mono/xbuild/14.0/bin/Microsoft.Common.targets"); "PrepareResources" depends on it.
Target AssignTargetPaths:
Task "AssignTargetPath"
Using task AssignTargetPath from Microsoft.Build.Tasks.AssignTargetPath, Microsoft.Build.Tasks.Core, Version=14.0.0.0, Culture=neutral, PublicKeyToken=b03f5f7f11d50a3a
Done executing task "AssignTargetPath"
Task "AssignTargetPath"
Using task AssignTargetPath from Microsoft.Build.Tasks.AssignTargetPath, Microsoft.Build.Tasks.Core, Version=14.0.0.0, Culture=neutral, PublicKeyToken=b03f5f7f11d50a3a
Done executing task "AssignTargetPath"
Task "AssignTargetPath"
Using task AssignTargetPath from Microsoft.Build.Tasks.AssignTargetPath, Microsoft.Build.Tasks.Core, Version=14.0.0.0, Culture=neutral, PublicKeyToken=b03f5f7f11d50a3a
Done executing task "AssignTargetPath"
Done building target "AssignTargetPaths" in project "/Users/360_macmini/Desktop/Xamarin/TestPro/TestPro/TestPro.csproj".
Done building target "AssignTargetPaths" in project "/Users/360_macmini/Desktop/Xamarin/TestPro/TestPro/TestPro.csproj" ("/Library/Frameworks/Mono.framework/Versions/4.6.1/lib/mono/xbuild/14.0/bin/Microsoft.Common.targets"); "PrepareResources" depends on it.
Building target "SplitResourcesByCulture" in project "/Users/360_macmini/Desktop/Xamarin/TestPro/TestPro/TestPro.csproj" ("/Library/Frameworks/Mono.framework/Versions/4.6.1/lib/mono/xbuild/14.0/bin/Microsoft.Common.targets"); "PrepareResources" depends on it.
Target SplitResourcesByCulture:
Task "AssignCulture"
Using task AssignCulture from Microsoft.Build.Tasks.AssignCulture, Microsoft.Build.Tasks.Core, Version=14.0.0.0, Culture=neutral, PublicKeyToken=b03f5f7f11d50a3a
Done executing task "AssignCulture"
Task "CreateItem"
Using task CreateItem from Microsoft.Build.Tasks.CreateItem, Microsoft.Build.Tasks.Core, Version=14.0.0.0, Culture=neutral, PublicKeyToken=b03f5f7f11d50a3a
Done executing task "CreateItem"
Task "CreateItem"
Using task CreateItem from Microsoft.Build.Tasks.CreateItem, Microsoft.Build.Tasks.Core, Version=14.0.0.0, Culture=neutral, PublicKeyToken=b03f5f7f11d50a3a
Done executing task "CreateItem"
Done building target "SplitResourcesByCulture" in project "/Users/360_macmini/Desktop/Xamarin/TestPro/TestPro/TestPro.csproj".
Done building target "SplitResourcesByCulture" in project "/Users/360_macmini/Desktop/Xamarin/TestPro/TestPro/TestPro.csproj" ("/Library/Frameworks/Mono.framework/Versions/4.6.1/lib/mono/xbuild/14.0/bin/Microsoft.Common.targets"); "PrepareResources" depends on it.
Building target "CreateManifestResourceNames" in project "/Users/360_macmini/Desktop/Xamarin/TestPro/TestPro/TestPro.csproj" ("/Library/Frameworks/Mono.framework/Versions/4.6.1/lib/mono/xbuild/14.0/bin/Microsoft.CSharp.targets"); "PrepareResources" depends on it.
Done building target "CreateManifestResourceNames" in project "/Users/360_macmini/Desktop/Xamarin/TestPro/TestPro/TestPro.csproj" ("/Library/Frameworks/Mono.framework/Versions/4.6.1/lib/mono/xbuild/14.0/bin/Microsoft.CSharp.targets"); "PrepareResources" depends on it.
Building target "CopyNonResxEmbeddedResources" in project "/Users/360_macmini/Desktop/Xamarin/TestPro/TestPro/TestPro.csproj" ("/Library/Frameworks/Mono.framework/Versions/4.6.1/lib/mono/xbuild/14.0/bin/Microsoft.Common.targets"); "PrepareResources" depends on it.
Target CopyNonResxEmbeddedResources skipped due to false condition: '@(NonResxWithCulture)' != '' or '@(NonResxWithNoCulture)' != '' or '@(ManifestNonResxWithCulture)' != '' or '@(ManifestNonResxWithNoCulture)' != ''
Done building target "CopyNonResxEmbeddedResources" in project "/Users/360_macmini/Desktop/Xamarin/TestPro/TestPro/TestPro.csproj" ("/Library/Frameworks/Mono.framework/Versions/4.6.1/lib/mono/xbuild/14.0/bin/Microsoft.Common.targets"); "PrepareResources" depends on it.
Building target "GenerateResources" in project "/Users/360_macmini/Desktop/Xamarin/TestPro/TestPro/TestPro.csproj" ("/Library/Frameworks/Mono.framework/Versions/4.6.1/lib/mono/xbuild/14.0/bin/Microsoft.Common.targets"); "PrepareResources" depends on it.
Done building target "GenerateResources" in project "/Users/360_macmini/Desktop/Xamarin/TestPro/TestPro/TestPro.csproj" ("/Library/Frameworks/Mono.framework/Versions/4.6.1/lib/mono/xbuild/14.0/bin/Microsoft.Common.targets"); "PrepareResources" depends on it.
Building target "GenerateSatelliteAssemblies" in project "/Users/360_macmini/Desktop/Xamarin/TestPro/TestPro/TestPro.csproj" ("/Library/Frameworks/Mono.framework/Versions/4.6.1/lib/mono/xbuild/14.0/bin/Microsoft.Common.targets"); "PrepareResources" depends on it.
Target GenerateSatelliteAssemblies:
No input files were specified for target GenerateSatelliteAssemblies, skipping.
Done building target "GenerateSatelliteAssemblies" in project "/Users/360_macmini/Desktop/Xamarin/TestPro/TestPro/TestPro.csproj".
Done building target "GenerateSatelliteAssemblies" in project "/Users/360_macmini/Desktop/Xamarin/TestPro/TestPro/TestPro.csproj" ("/Library/Frameworks/Mono.framework/Versions/4.6.1/lib/mono/xbuild/14.0/bin/Microsoft.Common.targets"); "PrepareResources" depends on it.
Building target "CompileLicxFiles" in project "/Users/360_macmini/Desktop/Xamarin/TestPro/TestPro/TestPro.csproj" ("/Library/Frameworks/Mono.framework/Versions/4.6.1/lib/mono/xbuild/14.0/bin/Microsoft.Common.targets"); "PrepareResources" depends on it.
Target CompileLicxFiles skipped due to false condition: '@(LicxFiles)' != ''
Done building target "CompileLicxFiles" in project "/Users/360_macmini/Desktop/Xamarin/TestPro/TestPro/TestPro.csproj" ("/Library/Frameworks/Mono.framework/Versions/4.6.1/lib/mono/xbuild/14.0/bin/Microsoft.Common.targets"); "PrepareResources" depends on it.
Done building target "PrepareResources" in project "/Users/360_macmini/Desktop/Xamarin/TestPro/TestPro/TestPro.csproj" ("/Library/Frameworks/Mono.framework/Versions/4.6.1/lib/mono/xbuild/14.0/bin/Microsoft.Common.targets"); "CoreBuild" depends on it.
Building target "Compile" in project "/Users/360_macmini/Desktop/Xamarin/TestPro/TestPro/TestPro.csproj" ("/Library/Frameworks/Mono.framework/Versions/4.6.1/lib/mono/xbuild/14.0/bin/Microsoft.Common.targets"); "CoreBuild" depends on it.
Building target "GenerateTargetFrameworkMonikerAttribute" in project "/Users/360_macmini/Desktop/Xamarin/TestPro/TestPro/TestPro.csproj" ("/Library/Frameworks/Mono.framework/Versions/4.6.1/lib/mono/xbuild/14.0/bin/Microsoft.Common.targets"); "Compile" depends on it.
Building target "_GenerateTargetFrameworkMonikerAttribute" in project "/Users/360_macmini/Desktop/Xamarin/TestPro/TestPro/TestPro.csproj" ("/Library/Frameworks/Mono.framework/Versions/4.6.1/lib/mono/xbuild/14.0/bin/Microsoft.Common.targets"); "GenerateTargetFrameworkMonikerAttribute" depends on it.
Target _GenerateTargetFrameworkMonikerAttribute:
Target _GenerateTargetFrameworkMonikerAttribute needs to be built as output file 'obj/iPhoneSimulator/Debug/Xamarin.iOS,Version=v1.0.AssemblyAttribute.cs' does not exist.
Task "WriteLinesToFile"
Using task WriteLinesToFile from Microsoft.Build.Tasks.WriteLinesToFile, Microsoft.Build.Tasks.Core, Version=14.0.0.0, Culture=neutral, PublicKeyToken=b03f5f7f11d50a3a
Done executing task "WriteLinesToFile"
Done building target "_GenerateTargetFrameworkMonikerAttribute" in project "/Users/360_macmini/Desktop/Xamarin/TestPro/TestPro/TestPro.csproj".
Done building target "_GenerateTargetFrameworkMonikerAttribute" in project "/Users/360_macmini/Desktop/Xamarin/TestPro/TestPro/TestPro.csproj" ("/Library/Frameworks/Mono.framework/Versions/4.6.1/lib/mono/xbuild/14.0/bin/Microsoft.Common.targets"); "GenerateTargetFrameworkMonikerAttribute" depends on it.
Done building target "GenerateTargetFrameworkMonikerAttribute" in project "/Users/360_macmini/Desktop/Xamarin/TestPro/TestPro/TestPro.csproj" ("/Library/Frameworks/Mono.framework/Versions/4.6.1/lib/mono/xbuild/14.0/bin/Microsoft.Common.targets"); "Compile" depends on it.
Building target "BeforeCompile" in project "/Users/360_macmini/Desktop/Xamarin/TestPro/TestPro/TestPro.csproj" ("/Library/Frameworks/Mono.framework/Versions/4.6.1/lib/mono/xbuild/14.0/bin/Microsoft.Common.targets"); "Compile" depends on it.
Done building target "BeforeCompile" in project "/Users/360_macmini/Desktop/Xamarin/TestPro/TestPro/TestPro.csproj" ("/Library/Frameworks/Mono.framework/Versions/4.6.1/lib/mono/xbuild/14.0/bin/Microsoft.Common.targets"); "Compile" depends on it.
Building target "_TimestampBeforeCompile" in project "/Users/360_macmini/Desktop/Xamarin/TestPro/TestPro/TestPro.csproj" ("/Library/Frameworks/Mono.framework/Versions/4.6.1/lib/mono/xbuild/14.0/bin/Microsoft.Common.targets"); "Compile" depends on it.
Target _TimestampBeforeCompile skipped due to false condition: '$(RunPostBuildEvent)' == 'OnOutputUpdated'
Done building target "_TimestampBeforeCompile" in project "/Users/360_macmini/Desktop/Xamarin/TestPro/TestPro/TestPro.csproj" ("/Library/Frameworks/Mono.framework/Versions/4.6.1/lib/mono/xbuild/14.0/bin/Microsoft.Common.targets"); "Compile" depends on it.
Building target "CoreCompile" in project "/Users/360_macmini/Desktop/Xamarin/TestPro/TestPro/TestPro.csproj" ("/Library/Frameworks/Mono.framework/Versions/4.6.1/lib/mono/xbuild/14.0/bin/Microsoft.CSharp.targets"); "Compile" depends on it.
Target CoreCompile:
Target CoreCompile needs to be built as output file 'obj/iPhoneSimulator/Debug/TestPro.exe' does not exist.
Task "Csc"
Using task Csc from Microsoft.Build.Tasks.Csc, Microsoft.Build.Tasks.Core, Version=14.0.0.0, Culture=neutral, PublicKeyToken=b03f5f7f11d50a3a
Tool /Library/Frameworks/Xamarin.iOS.framework/Versions/Current/bin/smcs execution started with arguments: /noconfig /debug:full /debug+ /optimize- /out:obj/iPhoneSimulator/Debug/TestPro.exe Main.cs AppDelegate.cs ViewController.cs ViewController.designer.cs obj/iPhoneSimulator/Debug/Xamarin.iOS,Version=v1.0.AssemblyAttribute.cs /target:exe /define:"__UNIFIED__;__MOBILE__;__IOS__;DEBUG;ENABLE_TEST_CLOUD" /nostdlib /platform:x86 /reference:/Library/Frameworks/Xamarin.iOS.framework/Versions/Current/lib/mono/Xamarin.iOS/System.dll /reference:/Library/Frameworks/Xamarin.iOS.framework/Versions/Current/lib/mono/Xamarin.iOS/System.Xml.dll /reference:/Library/Frameworks/Xamarin.iOS.framework/Versions/Current/lib/mono/Xamarin.iOS/System.Core.dll /reference:/Library/Frameworks/Xamarin.iOS.framework/Versions/Current/lib/mono/Xamarin.iOS/Xamarin.iOS.dll /reference:../../../../Downloads/GoogleConversionTracking.Unified.dll /reference:/Library/Frameworks/Xamarin.iOS.framework/Versions/Current/lib/mono/Xamarin.iOS//mscorlib.dll /warn:4
Environment variables being passed to the tool:
ViewController.cs(17,16): warning CS0219: The variable `obj' is assigned but its value is never used
Tool /Library/Frameworks/Xamarin.iOS.framework/Versions/Current/bin/smcs execution finished.
Done executing task "Csc"
Done building target "CoreCompile" in project "/Users/360_macmini/Desktop/Xamarin/TestPro/TestPro/TestPro.csproj".
Done building target "CoreCompile" in project "/Users/360_macmini/Desktop/Xamarin/TestPro/TestPro/TestPro.csproj" ("/Library/Frameworks/Mono.framework/Versions/4.6.1/lib/mono/xbuild/14.0/bin/Microsoft.CSharp.targets"); "Compile" depends on it.
Building target "_TimestampAfterCompile" in project "/Users/360_macmini/Desktop/Xamarin/TestPro/TestPro/TestPro.csproj" ("/Library/Frameworks/Mono.framework/Versions/4.6.1/lib/mono/xbuild/14.0/bin/Microsoft.Common.targets"); "Compile" depends on it.
Target _TimestampAfterCompile skipped due to false condition: '$(RunPostBuildEvent)' == 'OnOutputUpdated'
Done building target "_TimestampAfterCompile" in project "/Users/360_macmini/Desktop/Xamarin/TestPro/TestPro/TestPro.csproj" ("/Library/Frameworks/Mono.framework/Versions/4.6.1/lib/mono/xbuild/14.0/bin/Microsoft.Common.targets"); "Compile" depends on it.
Building target "AfterCompile" in project "/Users/360_macmini/Desktop/Xamarin/TestPro/TestPro/TestPro.csproj" ("/Library/Frameworks/Mono.framework/Versions/4.6.1/lib/mono/xbuild/14.0/bin/Microsoft.Common.targets"); "Compile" depends on it.
Done building target "AfterCompile" in project "/Users/360_macmini/Desktop/Xamarin/TestPro/TestPro/TestPro.csproj" ("/Library/Frameworks/Mono.framework/Versions/4.6.1/lib/mono/xbuild/14.0/bin/Microsoft.Common.targets"); "Compile" depends on it.
Done building target "Compile" in project "/Users/360_macmini/Desktop/Xamarin/TestPro/TestPro/TestPro.csproj" ("/Library/Frameworks/Mono.framework/Versions/4.6.1/lib/mono/xbuild/14.0/bin/Microsoft.Common.targets"); "CoreBuild" depends on it.
Building target "PrepareForRun" in project "/Users/360_macmini/Desktop/Xamarin/TestPro/TestPro/TestPro.csproj" ("/Library/Frameworks/Mono.framework/Versions/4.6.1/lib/mono/xbuild/14.0/bin/Microsoft.Common.targets"); "CoreBuild" depends on it.
Building target "DeployOutputFiles" in project "/Users/360_macmini/Desktop/Xamarin/TestPro/TestPro/TestPro.csproj" ("/Library/Frameworks/Mono.framework/Versions/4.6.1/lib/mono/xbuild/14.0/bin/Microsoft.Common.targets"); "PrepareForRun" depends on it.
Building target "_CopyDeployFilesToOutputDirectory" in project "/Users/360_macmini/Desktop/Xamarin/TestPro/TestPro/TestPro.csproj" ("/Library/Frameworks/Mono.framework/Versions/4.6.1/lib/mono/xbuild/14.0/bin/Microsoft.Common.targets"); "DeployOutputFiles" depends on it.
Building target "GetCopyToOutputDirectoryItems" in project "/Users/360_macmini/Desktop/Xamarin/TestPro/TestPro/TestPro.csproj" ("/Library/Frameworks/Mono.framework/Versions/4.6.1/lib/mono/xbuild/14.0/bin/Microsoft.Common.targets"); "_CopyDeployFilesToOutputDirectory" depends on it.
Done building target "GetCopyToOutputDirectoryItems" in project "/Users/360_macmini/Desktop/Xamarin/TestPro/TestPro/TestPro.csproj" ("/Library/Frameworks/Mono.framework/Versions/4.6.1/lib/mono/xbuild/14.0/bin/Microsoft.Common.targets"); "_CopyDeployFilesToOutputDirectory" depends on it.
Building target "_CopyDeployFilesToOutputDirectoryAlways" in project "/Users/360_macmini/Desktop/Xamarin/TestPro/TestPro/TestPro.csproj" ("/Library/Frameworks/Mono.framework/Versions/4.6.1/lib/mono/xbuild/14.0/bin/Microsoft.Common.targets"); "_CopyDeployFilesToOutputDirectory" depends on it.
Target _CopyDeployFilesToOutputDirectoryAlways skipped due to false condition: '@(ItemsToCopyToOutputDirectoryAlways)' != ''
Done building target "_CopyDeployFilesToOutputDirectoryAlways" in project "/Users/360_macmini/Desktop/Xamarin/TestPro/TestPro/TestPro.csproj" ("/Library/Frameworks/Mono.framework/Versions/4.6.1/lib/mono/xbuild/14.0/bin/Microsoft.Common.targets"); "_CopyDeployFilesToOutputDirectory" depends on it.
Building target "_CopyDeployFilesToOutputDirectoryPreserveNewest" in project "/Users/360_macmini/Desktop/Xamarin/TestPro/TestPro/TestPro.csproj" ("/Library/Frameworks/Mono.framework/Versions/4.6.1/lib/mono/xbuild/14.0/bin/Microsoft.Common.targets"); "_CopyDeployFilesToOutputDirectory" depends on it.
Target _CopyDeployFilesToOutputDirectoryPreserveNewest skipped due to false condition: '@(ItemsToCopyToOutputDirectoryPreserveNewest)' != ''
Done building target "_CopyDeployFilesToOutputDirectoryPreserveNewest" in project "/Users/360_macmini/Desktop/Xamarin/TestPro/TestPro/TestPro.csproj" ("/Library/Frameworks/Mono.framework/Versions/4.6.1/lib/mono/xbuild/14.0/bin/Microsoft.Common.targets"); "_CopyDeployFilesToOutputDirectory" depends on it.
Done building target "_CopyDeployFilesToOutputDirectory" in project "/Users/360_macmini/Desktop/Xamarin/TestPro/TestPro/TestPro.csproj" ("/Library/Frameworks/Mono.framework/Versions/4.6.1/lib/mono/xbuild/14.0/bin/Microsoft.Common.targets"); "DeployOutputFiles" depends on it.
Building target "_CopyAppConfigFile" in project "/Users/360_macmini/Desktop/Xamarin/TestPro/TestPro/TestPro.csproj" ("/Library/Frameworks/Mono.framework/Versions/4.6.1/lib/mono/xbuild/14.0/bin/Microsoft.Common.targets"); "DeployOutputFiles" depends on it.
Target _CopyAppConfigFile skipped due to false condition: '@(AppConfigWithTargetPath)' != ''
Done building target "_CopyAppConfigFile" in project "/Users/360_macmini/Desktop/Xamarin/TestPro/TestPro/TestPro.csproj" ("/Library/Frameworks/Mono.framework/Versions/4.6.1/lib/mono/xbuild/14.0/bin/Microsoft.Common.targets"); "DeployOutputFiles" depends on it.
Target DeployOutputFiles:
Task "Copy"
Using task Copy from Microsoft.Build.Tasks.Copy, Xamarin.MacDev.Tasks, Version=1.0.6120.27414, Culture=neutral, PublicKeyToken=null
Copying file from '/Users/360_macmini/Desktop/Xamarin/TestPro/TestPro/obj/iPhoneSimulator/Debug/TestPro.exe.mdb' to '/Users/360_macmini/Desktop/Xamarin/TestPro/TestPro/bin/iPhoneSimulator/Debug/TestPro.exe.mdb'
Done executing task "Copy"
Task "Copy"
Using task Copy from Microsoft.Build.Tasks.Copy, Xamarin.MacDev.Tasks, Version=1.0.6120.27414, Culture=neutral, PublicKeyToken=null
Copying file from '/Users/360_macmini/Desktop/Xamarin/TestPro/TestPro/obj/iPhoneSimulator/Debug/TestPro.exe' to '/Users/360_macmini/Desktop/Xamarin/TestPro/TestPro/bin/iPhoneSimulator/Debug/TestPro.exe'
Done executing task "Copy"
Done building target "DeployOutputFiles" in project "/Users/360_macmini/Desktop/Xamarin/TestPro/TestPro/TestPro.csproj".
Done building target "DeployOutputFiles" in project "/Users/360_macmini/Desktop/Xamarin/TestPro/TestPro/TestPro.csproj" ("/Library/Frameworks/Mono.framework/Versions/4.6.1/lib/mono/xbuild/14.0/bin/Microsoft.Common.targets"); "PrepareForRun" depends on it.
Done building target "PrepareForRun" in project "/Users/360_macmini/Desktop/Xamarin/TestPro/TestPro/TestPro.csproj" ("/Library/Frameworks/Mono.framework/Versions/4.6.1/lib/mono/xbuild/14.0/bin/Microsoft.Common.targets"); "CoreBuild" depends on it.
Building target "_RecordCleanFile" in project "/Users/360_macmini/Desktop/Xamarin/TestPro/TestPro/TestPro.csproj" ("/Library/Frameworks/Mono.framework/Versions/4.6.1/lib/mono/xbuild/14.0/bin/Microsoft.Common.targets"); "CoreBuild" depends on it.
Building target "_GetCompileOutputsForClean" in project "/Users/360_macmini/Desktop/Xamarin/TestPro/TestPro/TestPro.csproj" ("/Library/Frameworks/Mono.framework/Versions/4.6.1/lib/mono/xbuild/14.0/bin/Microsoft.Common.targets"); "_RecordCleanFile" depends on it.
Target _GetCompileOutputsForClean:
Task "CreateItem"
Using task CreateItem from Microsoft.Build.Tasks.CreateItem, Microsoft.Build.Tasks.Core, Version=14.0.0.0, Culture=neutral, PublicKeyToken=b03f5f7f11d50a3a
Done executing task "CreateItem"
Task "CreateItem"
Using task CreateItem from Microsoft.Build.Tasks.CreateItem, Microsoft.Build.Tasks.Core, Version=14.0.0.0, Culture=neutral, PublicKeyToken=b03f5f7f11d50a3a
Done executing task "CreateItem"
Done building target "_GetCompileOutputsForClean" in project "/Users/360_macmini/Desktop/Xamarin/TestPro/TestPro/TestPro.csproj".
Done building target "_GetCompileOutputsForClean" in project "/Users/360_macmini/Desktop/Xamarin/TestPro/TestPro/TestPro.csproj" ("/Library/Frameworks/Mono.framework/Versions/4.6.1/lib/mono/xbuild/14.0/bin/Microsoft.Common.targets"); "_RecordCleanFile" depends on it.
Target _RecordCleanFile:
Task "ReadLinesFromFile"
Using task ReadLinesFromFile from Microsoft.Build.Tasks.ReadLinesFromFile, Microsoft.Build.Tasks.Core, Version=14.0.0.0, Culture=neutral, PublicKeyToken=b03f5f7f11d50a3a
Done executing task "ReadLinesFromFile"
Task "FindUnderPath"
Using task FindUnderPath from Microsoft.Build.Tasks.FindUnderPath, Microsoft.Build.Tasks.Core, Version=14.0.0.0, Culture=neutral, PublicKeyToken=b03f5f7f11d50a3a
Done executing task "FindUnderPath"
Task "RemoveDuplicates"
Using task RemoveDuplicates from Microsoft.Build.Tasks.RemoveDuplicates, Microsoft.Build.Tasks.Core, Version=14.0.0.0, Culture=neutral, PublicKeyToken=b03f5f7f11d50a3a
Done executing task "RemoveDuplicates"
Task "WriteLinesToFile"
Using task WriteLinesToFile from Microsoft.Build.Tasks.WriteLinesToFile, Microsoft.Build.Tasks.Core, Version=14.0.0.0, Culture=neutral, PublicKeyToken=b03f5f7f11d50a3a
Done executing task "WriteLinesToFile"
Done building target "_RecordCleanFile" in project "/Users/360_macmini/Desktop/Xamarin/TestPro/TestPro/TestPro.csproj".
Done building target "_RecordCleanFile" in project "/Users/360_macmini/Desktop/Xamarin/TestPro/TestPro/TestPro.csproj" ("/Library/Frameworks/Mono.framework/Versions/4.6.1/lib/mono/xbuild/14.0/bin/Microsoft.Common.targets"); "CoreBuild" depends on it.
Building target "PostBuildEvent" in project "/Users/360_macmini/Desktop/Xamarin/TestPro/TestPro/TestPro.csproj" ("/Library/Frameworks/Mono.framework/Versions/4.6.1/lib/mono/xbuild/14.0/bin/Microsoft.Common.targets"); "CoreBuild" depends on it.
Target PostBuildEvent skipped due to false condition: '$(PostBuildEvent)' != '' and
('$(RunPostBuildEvent)' != 'OnOutputUpdated' or
'$(_AssemblyModifiedTimeBeforeCompile)' != '$(_AssemblyModifiedTimeAfterCompile)')
Done building target "PostBuildEvent" in project "/Users/360_macmini/Desktop/Xamarin/TestPro/TestPro/TestPro.csproj" ("/Library/Frameworks/Mono.framework/Versions/4.6.1/lib/mono/xbuild/14.0/bin/Microsoft.Common.targets"); "CoreBuild" depends on it.
Done building target "CoreBuild" in project "/Users/360_macmini/Desktop/Xamarin/TestPro/TestPro/TestPro.csproj" ("/Library/Frameworks/Mono.framework/Versions/4.6.1/lib/mono/xbuild/14.0/bin/Microsoft.Common.targets"); "Build" depends on it.
Building target "AfterBuild" in project "/Users/360_macmini/Desktop/Xamarin/TestPro/TestPro/TestPro.csproj" ("/Library/Frameworks/Mono.framework/Versions/4.6.1/lib/mono/xbuild/14.0/bin/Microsoft.Common.targets"); "Build" depends on it.
Done building target "AfterBuild" in project "/Users/360_macmini/Desktop/Xamarin/TestPro/TestPro/TestPro.csproj" ("/Library/Frameworks/Mono.framework/Versions/4.6.1/lib/mono/xbuild/14.0/bin/Microsoft.Common.targets"); "Build" depends on it.
Building target "_GenerateBundleName" in project "/Users/360_macmini/Desktop/Xamarin/TestPro/TestPro/TestPro.csproj" ("/Library/Frameworks/Mono.framework/External/xbuild/Xamarin/iOS/Xamarin.iOS.Common.targets"); "Build" depends on it.
Done building target "_GenerateBundleName" in project "/Users/360_macmini/Desktop/Xamarin/TestPro/TestPro/TestPro.csproj" ("/Library/Frameworks/Mono.framework/External/xbuild/Xamarin/iOS/Xamarin.iOS.Common.targets"); "Build" depends on it.
Building target "_CleanUploaded" in project "/Users/360_macmini/Desktop/Xamarin/TestPro/TestPro/TestPro.csproj" ("/Library/Frameworks/Mono.framework/External/xbuild/Xamarin/iOS/Xamarin.iOS.Common.targets"); "Build" depends on it.
Target _CleanUploaded:
Task "Delete"
Using task Delete from Microsoft.Build.Tasks.Delete, Xamarin.MacDev.Tasks, Version=1.0.6120.27414, Culture=neutral, PublicKeyToken=null
Done executing task "Delete"
Done building target "_CleanUploaded" in project "/Users/360_macmini/Desktop/Xamarin/TestPro/TestPro/TestPro.csproj".
Done building target "_CleanUploaded" in project "/Users/360_macmini/Desktop/Xamarin/TestPro/TestPro/TestPro.csproj" ("/Library/Frameworks/Mono.framework/External/xbuild/Xamarin/iOS/Xamarin.iOS.Common.targets"); "Build" depends on it.
Building target "_CreateAppBundle" in project "/Users/360_macmini/Desktop/Xamarin/TestPro/TestPro/TestPro.csproj" ("/Library/Frameworks/Mono.framework/External/xbuild/Xamarin/iOS/Xamarin.iOS.Common.targets"); "Build" depends on it.
Building target "_DetectSigningIdentity" in project "/Users/360_macmini/Desktop/Xamarin/TestPro/TestPro/TestPro.csproj" ("/Library/Frameworks/Mono.framework/External/xbuild/Xamarin/iOS/Xamarin.iOS.Common.targets"); "_CreateAppBundle" depends on it.
Target _DetectSigningIdentity:
Task "DetectSigningIdentity"
Using task DetectSigningIdentity from Xamarin.iOS.Tasks.DetectSigningIdentity, Xamarin.iOS.Tasks, Version=0.0.0.0, Culture=neutral, PublicKeyToken=null
DetectSigningIdentity Task
AppBundleName: TestPro
AppManifest: Info.plist
Keychain: <null>
ProvisioningProfile: <null>
RequireCodesigning: False
RequireProvisioningProfile: False
SdkPlatform: iPhoneSimulator
SdkIsSimulator: True
SigningKey: iPhone Developer
Detected signing identity:
Bundle Id: com.xamarin.testpro
App Id: com.xamarin.testpro
Done executing task "DetectSigningIdentity"
Done building target "_DetectSigningIdentity" in project "/Users/360_macmini/Desktop/Xamarin/TestPro/TestPro/TestPro.csproj".
Done building target "_DetectSigningIdentity" in project "/Users/360_macmini/Desktop/Xamarin/TestPro/TestPro/TestPro.csproj" ("/Library/Frameworks/Mono.framework/External/xbuild/Xamarin/iOS/Xamarin.iOS.Common.targets"); "_CreateAppBundle" depends on it.
Building target "_CopyResourcesToBundle" in project "/Users/360_macmini/Desktop/Xamarin/TestPro/TestPro/TestPro.csproj" ("/Library/Frameworks/Mono.framework/External/xbuild/Xamarin/iOS/Xamarin.iOS.Common.targets"); "_CreateAppBundle" depends on it.
Building target "_ComputeBundleResourceOutputPaths" in project "/Users/360_macmini/Desktop/Xamarin/TestPro/TestPro/TestPro.csproj" ("/Library/Frameworks/Mono.framework/External/xbuild/Xamarin/iOS/Xamarin.iOS.Common.targets"); "_CopyResourcesToBundle" depends on it.
Target _ComputeBundleResourceOutputPaths:
Task "ComputeBundleResourceOutputPaths"
Using task ComputeBundleResourceOutputPaths from Xamarin.MacDev.Tasks.ComputeBundleResourceOutputPaths, Xamarin.MacDev.Tasks, Version=1.0.6120.27414, Culture=neutral, PublicKeyToken=null
ComputeBundleResourceOutputPaths Task
AppBundleDir: bin/iPhoneSimulator/Debug/TestPro.app
BundleIdentifier: com.xamarin.testpro
BundleResources:
obj/iPhoneSimulator/Debug/ibtool-link/LaunchScreen.storyboardc/01J-lp-oVM-view-Ze5-6b-2t3.nib
obj/iPhoneSimulator/Debug/ibtool-link/LaunchScreen.storyboardc/Info.plist
obj/iPhoneSimulator/Debug/ibtool-link/LaunchScreen.storyboardc/UIViewController-01J-lp-oVM.nib
obj/iPhoneSimulator/Debug/ibtool-link/Main.storyboardc/BYZ-38-t0r-view-8bC-Xf-vdC.nib
obj/iPhoneSimulator/Debug/ibtool-link/Main.storyboardc/Info.plist
obj/iPhoneSimulator/Debug/ibtool-link/Main.storyboardc/UIViewController-BYZ-38-t0r.nib
IntermediateOutputPath: obj/iPhoneSimulator/Debug/
OutputPath: bin/iPhoneSimulator/Debug/
Done executing task "ComputeBundleResourceOutputPaths"
Done building target "_ComputeBundleResourceOutputPaths" in project "/Users/360_macmini/Desktop/Xamarin/TestPro/TestPro/TestPro.csproj".
Done building target "_ComputeBundleResourceOutputPaths" in project "/Users/360_macmini/Desktop/Xamarin/TestPro/TestPro/TestPro.csproj" ("/Library/Frameworks/Mono.framework/External/xbuild/Xamarin/iOS/Xamarin.iOS.Common.targets"); "_CopyResourcesToBundle" depends on it.
Target _CopyResourcesToBundle:
Target _CopyResourcesToBundle needs to be built as output file 'bin/iPhoneSimulator/Debug/TestPro.app/LaunchScreen.storyboardc/01J-lp-oVM-view-Ze5-6b-2t3.nib' does not exist.
Task "SmartCopy"
Using task SmartCopy from Xamarin.MacDev.Tasks.SmartCopy, Xamarin.MacDev.Tasks, Version=1.0.6120.27414, Culture=neutral, PublicKeyToken=null
SmartCopy Task
DestinationFiles:
bin/iPhoneSimulator/Debug/TestPro.app/LaunchScreen.storyboardc/01J-lp-oVM-view-Ze5-6b-2t3.nib
bin/iPhoneSimulator/Debug/TestPro.app/LaunchScreen.storyboardc/Info.plist
bin/iPhoneSimulator/Debug/TestPro.app/LaunchScreen.storyboardc/UIViewController-01J-lp-oVM.nib
bin/iPhoneSimulator/Debug/TestPro.app/Main.storyboardc/BYZ-38-t0r-view-8bC-Xf-vdC.nib
bin/iPhoneSimulator/Debug/TestPro.app/Main.storyboardc/Info.plist
bin/iPhoneSimulator/Debug/TestPro.app/Main.storyboardc/UIViewController-BYZ-38-t0r.nib
DestinationFolder:
SourceFiles:
obj/iPhoneSimulator/Debug/ibtool-link/LaunchScreen.storyboardc/01J-lp-oVM-view-Ze5-6b-2t3.nib
obj/iPhoneSimulator/Debug/ibtool-link/LaunchScreen.storyboardc/Info.plist
obj/iPhoneSimulator/Debug/ibtool-link/LaunchScreen.storyboardc/UIViewController-01J-lp-oVM.nib
obj/iPhoneSimulator/Debug/ibtool-link/Main.storyboardc/BYZ-38-t0r-view-8bC-Xf-vdC.nib
obj/iPhoneSimulator/Debug/ibtool-link/Main.storyboardc/Info.plist
obj/iPhoneSimulator/Debug/ibtool-link/Main.storyboardc/UIViewController-BYZ-38-t0r.nib
Creating directory '/Users/360_macmini/Desktop/Xamarin/TestPro/TestPro/bin/iPhoneSimulator/Debug/TestPro.app/LaunchScreen.storyboardc'
Copying file from '/Users/360_macmini/Desktop/Xamarin/TestPro/TestPro/obj/iPhoneSimulator/Debug/ibtool-link/LaunchScreen.storyboardc/01J-lp-oVM-view-Ze5-6b-2t3.nib' to '/Users/360_macmini/Desktop/Xamarin/TestPro/TestPro/bin/iPhoneSimulator/Debug/TestPro.app/LaunchScreen.storyboardc/01J-lp-oVM-view-Ze5-6b-2t3.nib'
Copying file from '/Users/360_macmini/Desktop/Xamarin/TestPro/TestPro/obj/iPhoneSimulator/Debug/ibtool-link/LaunchScreen.storyboardc/Info.plist' to '/Users/360_macmini/Desktop/Xamarin/TestPro/TestPro/bin/iPhoneSimulator/Debug/TestPro.app/LaunchScreen.storyboardc/Info.plist'
Copying file from '/Users/360_macmini/Desktop/Xamarin/TestPro/TestPro/obj/iPhoneSimulator/Debug/ibtool-link/LaunchScreen.storyboardc/UIViewController-01J-lp-oVM.nib' to '/Users/360_macmini/Desktop/Xamarin/TestPro/TestPro/bin/iPhoneSimulator/Debug/TestPro.app/LaunchScreen.storyboardc/UIViewController-01J-lp-oVM.nib'
Creating directory '/Users/360_macmini/Desktop/Xamarin/TestPro/TestPro/bin/iPhoneSimulator/Debug/TestPro.app/Main.storyboardc'
Copying file from '/Users/360_macmini/Desktop/Xamarin/TestPro/TestPro/obj/iPhoneSimulator/Debug/ibtool-link/Main.storyboardc/BYZ-38-t0r-view-8bC-Xf-vdC.nib' to '/Users/360_macmini/Desktop/Xamarin/TestPro/TestPro/bin/iPhoneSimulator/Debug/TestPro.app/Main.storyboardc/BYZ-38-t0r-view-8bC-Xf-vdC.nib'
Copying file from '/Users/360_macmini/Desktop/Xamarin/TestPro/TestPro/obj/iPhoneSimulator/Debug/ibtool-link/Main.storyboardc/Info.plist' to '/Users/360_macmini/Desktop/Xamarin/TestPro/TestPro/bin/iPhoneSimulator/Debug/TestPro.app/Main.storyboardc/Info.plist'
Copying file from '/Users/360_macmini/Desktop/Xamarin/TestPro/TestPro/obj/iPhoneSimulator/Debug/ibtool-link/Main.storyboardc/UIViewController-BYZ-38-t0r.nib' to '/Users/360_macmini/Desktop/Xamarin/TestPro/TestPro/bin/iPhoneSimulator/Debug/TestPro.app/Main.storyboardc/UIViewController-BYZ-38-t0r.nib'
Done executing task "SmartCopy"
Done building target "_CopyResourcesToBundle" in project "/Users/360_macmini/Desktop/Xamarin/TestPro/TestPro/TestPro.csproj".
Done building target "_CopyResourcesToBundle" in project "/Users/360_macmini/Desktop/Xamarin/TestPro/TestPro/TestPro.csproj" ("/Library/Frameworks/Mono.framework/External/xbuild/Xamarin/iOS/Xamarin.iOS.Common.targets"); "_CreateAppBundle" depends on it.
Building target "_CreateAssetPackManifest" in project "/Users/360_macmini/Desktop/Xamarin/TestPro/TestPro/TestPro.csproj" ("/Library/Frameworks/Mono.framework/External/xbuild/Xamarin/iOS/Xamarin.iOS.Common.targets"); "_CreateAppBundle" depends on it.
Target _CreateAssetPackManifest:
Task "CreateAssetPackManifest"
Using task CreateAssetPackManifest from Xamarin.MacDev.Tasks.CreateAssetPackManifest, Xamarin.MacDev.Tasks, Version=1.0.6120.27414, Culture=neutral, PublicKeyToken=null
CreateAssetPackManifest Task
AppBundleDir: bin/iPhoneSimulator/Debug/TestPro.app
InitialInstallTags: <null>
OutputPath: bin/iPhoneSimulator/Debug/
PrefetchOrder: <null>
Done executing task "CreateAssetPackManifest"
Done building target "_CreateAssetPackManifest" in project "/Users/360_macmini/Desktop/Xamarin/TestPro/TestPro/TestPro.csproj".
Done building target "_CreateAssetPackManifest" in project "/Users/360_macmini/Desktop/Xamarin/TestPro/TestPro/TestPro.csproj" ("/Library/Frameworks/Mono.framework/External/xbuild/Xamarin/iOS/Xamarin.iOS.Common.targets"); "_CreateAppBundle" depends on it.
Building target "_SmeltMetal" in project "/Users/360_macmini/Desktop/Xamarin/TestPro/TestPro/TestPro.csproj" ("/Library/Frameworks/Mono.framework/External/xbuild/Xamarin/iOS/Xamarin.iOS.Common.targets"); "_CreateAppBundle" depends on it.
Target _SmeltMetal skipped due to false condition: '$(_CanOutputAppBundle)' == 'true' And '@(Metal)' != ''
Done building target "_SmeltMetal" in project "/Users/360_macmini/Desktop/Xamarin/TestPro/TestPro/TestPro.csproj" ("/Library/Frameworks/Mono.framework/External/xbuild/Xamarin/iOS/Xamarin.iOS.Common.targets"); "_CreateAppBundle" depends on it.
Building target "_ForgeMetal" in project "/Users/360_macmini/Desktop/Xamarin/TestPro/TestPro/TestPro.csproj" ("/Library/Frameworks/Mono.framework/External/xbuild/Xamarin/iOS/Xamarin.iOS.Common.targets"); "_CreateAppBundle" depends on it.
Target _ForgeMetal skipped due to false condition: '$(_CanOutputAppBundle)' == 'true' And '@(_SmeltedMetal)' != ''
Done building target "_ForgeMetal" in project "/Users/360_macmini/Desktop/Xamarin/TestPro/TestPro/TestPro.csproj" ("/Library/Frameworks/Mono.framework/External/xbuild/Xamarin/iOS/Xamarin.iOS.Common.targets"); "_CreateAppBundle" depends on it.
Building target "_TemperMetal" in project "/Users/360_macmini/Desktop/Xamarin/TestPro/TestPro/TestPro.csproj" ("/Library/Frameworks/Mono.framework/External/xbuild/Xamarin/iOS/Xamarin.iOS.Common.targets"); "_CreateAppBundle" depends on it.
Target _TemperMetal skipped due to false condition: '$(_CanOutputAppBundle)' == 'true' And '@(_ForgedMetal)' != ''
Done building target "_TemperMetal" in project "/Users/360_macmini/Desktop/Xamarin/TestPro/TestPro/TestPro.csproj" ("/Library/Frameworks/Mono.framework/External/xbuild/Xamarin/iOS/Xamarin.iOS.Common.targets"); "_CreateAppBundle" depends on it.
Building target "_PrepareResourceRules" in project "/Users/360_macmini/Desktop/Xamarin/TestPro/TestPro/TestPro.csproj" ("/Library/Frameworks/Mono.framework/External/xbuild/Xamarin/iOS/Xamarin.iOS.Common.targets"); "_CreateAppBundle" depends on it.
Done building target "_PrepareResourceRules" in project "/Users/360_macmini/Desktop/Xamarin/TestPro/TestPro/TestPro.csproj" ("/Library/Frameworks/Mono.framework/External/xbuild/Xamarin/iOS/Xamarin.iOS.Common.targets"); "_CreateAppBundle" depends on it.
Building target "_CompileEntitlements" in project "/Users/360_macmini/Desktop/Xamarin/TestPro/TestPro/TestPro.csproj" ("/Library/Frameworks/Mono.framework/External/xbuild/Xamarin/iOS/Xamarin.iOS.Common.targets"); "_CreateAppBundle" depends on it.
Target _CompileEntitlements skipped due to false condition: '$(_RequireCodeSigning)' == 'true' Or '$(CodesignEntitlements)' != ''
Done building target "_CompileEntitlements" in project "/Users/360_macmini/Desktop/Xamarin/TestPro/TestPro/TestPro.csproj" ("/Library/Frameworks/Mono.framework/External/xbuild/Xamarin/iOS/Xamarin.iOS.Common.targets"); "_CreateAppBundle" depends on it.
Building target "_CompileAppManifest" in project "/Users/360_macmini/Desktop/Xamarin/TestPro/TestPro/TestPro.csproj" ("/Library/Frameworks/Mono.framework/External/xbuild/Xamarin/iOS/Xamarin.iOS.Common.targets"); "_CreateAppBundle" depends on it.
Building target "_ResolveWatchAppReferences" in project "/Users/360_macmini/Desktop/Xamarin/TestPro/TestPro/TestPro.csproj" ("/Library/Frameworks/Mono.framework/External/xbuild/Xamarin/iOS/Xamarin.iOS.Common.targets"); "_CompileAppManifest" depends on it.
Building target "_SplitWatchAppReferencesByExistent" in project "/Users/360_macmini/Desktop/Xamarin/TestPro/TestPro/TestPro.csproj" ("/Library/Frameworks/Mono.framework/External/xbuild/Xamarin/iOS/Xamarin.iOS.Common.targets"); "_ResolveWatchAppReferences" depends on it.
Building target "_AssignWatchAppConfiguration" in project "/Users/360_macmini/Desktop/Xamarin/TestPro/TestPro/TestPro.csproj" ("/Library/Frameworks/Mono.framework/External/xbuild/Xamarin/iOS/Xamarin.iOS.Common.targets"); "_SplitWatchAppReferencesByExistent" depends on it.
Target _AssignWatchAppConfiguration skipped due to false condition: '@(_WatchAppReference)' != ''
Done building target "_AssignWatchAppConfiguration" in project "/Users/360_macmini/Desktop/Xamarin/TestPro/TestPro/TestPro.csproj" ("/Library/Frameworks/Mono.framework/External/xbuild/Xamarin/iOS/Xamarin.iOS.Common.targets"); "_SplitWatchAppReferencesByExistent" depends on it.
Done building target "_SplitWatchAppReferencesByExistent" in project "/Users/360_macmini/Desktop/Xamarin/TestPro/TestPro/TestPro.csproj" ("/Library/Frameworks/Mono.framework/External/xbuild/Xamarin/iOS/Xamarin.iOS.Common.targets"); "_ResolveWatchAppReferences" depends on it.
Done building target "_ResolveWatchAppReferences" in project "/Users/360_macmini/Desktop/Xamarin/TestPro/TestPro/TestPro.csproj" ("/Library/Frameworks/Mono.framework/External/xbuild/Xamarin/iOS/Xamarin.iOS.Common.targets"); "_CompileAppManifest" depends on it.
Building target "_DetectDebugNetworkConfiguration" in project "/Users/360_macmini/Desktop/Xamarin/TestPro/TestPro/TestPro.csproj" ("/Library/Frameworks/Mono.framework/External/xbuild/Xamarin/iOS/Xamarin.iOS.Common.targets"); "_CompileAppManifest" depends on it.
Target _DetectDebugNetworkConfiguration:
Task "DetectDebugNetworkConfiguration"
Using task DetectDebugNetworkConfiguration from Xamarin.iOS.Tasks.DetectDebugNetworkConfiguration, Xamarin.iOS.Tasks, Version=0.0.0.0, Culture=neutral, PublicKeyToken=null
DetectDebugNetworkConfiguration Task
DebugOverWiFi: False
DebuggerHosts: <null>
SdkIsSimulator: True
DebugIPAddresses: 127.0.0.1
Done executing task "DetectDebugNetworkConfiguration"
Done building target "_DetectDebugNetworkConfiguration" in project "/Users/360_macmini/Desktop/Xamarin/TestPro/TestPro/TestPro.csproj".
Done building target "_DetectDebugNetworkConfiguration" in project "/Users/360_macmini/Desktop/Xamarin/TestPro/TestPro/TestPro.csproj" ("/Library/Frameworks/Mono.framework/External/xbuild/Xamarin/iOS/Xamarin.iOS.Common.targets"); "_CompileAppManifest" depends on it.
Target _CompileAppManifest:
Target _CompileAppManifest needs to be built as output file 'bin/iPhoneSimulator/Debug/TestPro.app/Info.plist' does not exist.
Task "CompileAppManifest"
Using task CompileAppManifest from Xamarin.iOS.Tasks.CompileAppManifest, Xamarin.iOS.Tasks, Version=0.0.0.0, Culture=neutral, PublicKeyToken=null
CompileAppManifest Task
AppBundleName: TestPro
AppBundleDir: bin/iPhoneSimulator/Debug/TestPro.app
AppManifest: Info.plist
Architecture: i386
AssemblyName: TestPro
BundleIdentifier: com.xamarin.testpro
Debug: True
DebugIPAddresses: 127.0.0.1
DefaultSdkVersion: 10.0
IsAppExtension: False
IsWatchApp: False
IsWatchExtension: False
PartialAppManifests:
obj/iPhoneSimulator/Debug/actool/partial-info.plist
ResourceRules: <null>
SdkPlatform: iPhoneSimulator
SdkIsSimulator: True
TargetFrameworkIdentifier: Xamarin.iOS
Done executing task "CompileAppManifest"
Task "RemoveDir"
Using task RemoveDir from Microsoft.Build.Tasks.RemoveDir, Xamarin.MacDev.Tasks, Version=1.0.6120.27414, Culture=neutral, PublicKeyToken=null
Done executing task "RemoveDir"
Task "Delete"
Using task Delete from Microsoft.Build.Tasks.Delete, Xamarin.MacDev.Tasks, Version=1.0.6120.27414, Culture=neutral, PublicKeyToken=null
Done executing task "Delete"
Done building target "_CompileAppManifest" in project "/Users/360_macmini/Desktop/Xamarin/TestPro/TestPro/TestPro.csproj".
Done building target "_CompileAppManifest" in project "/Users/360_macmini/Desktop/Xamarin/TestPro/TestPro/TestPro.csproj" ("/Library/Frameworks/Mono.framework/External/xbuild/Xamarin/iOS/Xamarin.iOS.Common.targets"); "_CreateAppBundle" depends on it.
Building target "_GetNativeExecutableName" in project "/Users/360_macmini/Desktop/Xamarin/TestPro/TestPro/TestPro.csproj" ("/Library/Frameworks/Mono.framework/External/xbuild/Xamarin/iOS/Xamarin.iOS.Common.targets"); "_CreateAppBundle" depends on it.
Target _GetNativeExecutableName:
Task "GetNativeExecutableName"
Using task GetNativeExecutableName from Xamarin.MacDev.Tasks.GetNativeExecutableName, Xamarin.MacDev.Tasks, Version=1.0.6120.27414, Culture=neutral, PublicKeyToken=null
GetNativeExecutableName Task
AppManifest: bin/iPhoneSimulator/Debug/TestPro.app/Info.plist
Done executing task "GetNativeExecutableName"
Done building target "_GetNativeExecutableName" in project "/Users/360_macmini/Desktop/Xamarin/TestPro/TestPro/TestPro.csproj".
Done building target "_GetNativeExecutableName" in project "/Users/360_macmini/Desktop/Xamarin/TestPro/TestPro/TestPro.csproj" ("/Library/Frameworks/Mono.framework/External/xbuild/Xamarin/iOS/Xamarin.iOS.Common.targets"); "_CreateAppBundle" depends on it.
Building target "_CompileToNative" in project "/Users/360_macmini/Desktop/Xamarin/TestPro/TestPro/TestPro.csproj" ("/Library/Frameworks/Mono.framework/External/xbuild/Xamarin/iOS/Xamarin.iOS.Common.targets"); "_CreateAppBundle" depends on it.
Building target "_CompileEntitlements" in project "/Users/360_macmini/Desktop/Xamarin/TestPro/TestPro/TestPro.csproj" ("/Library/Frameworks/Mono.framework/External/xbuild/Xamarin/iOS/Xamarin.iOS.Common.targets"); "_CompileToNative" depends on it.
Target _CompileEntitlements skipped due to false condition: '$(_RequireCodeSigning)' == 'true' Or '$(CodesignEntitlements)' != ''
Done building target "_CompileEntitlements" in project "/Users/360_macmini/Desktop/Xamarin/TestPro/TestPro/TestPro.csproj" ("/Library/Frameworks/Mono.framework/External/xbuild/Xamarin/iOS/Xamarin.iOS.Common.targets"); "_CompileToNative" depends on it.
Building target "_ResolveAppExtensionReferences" in project "/Users/360_macmini/Desktop/Xamarin/TestPro/TestPro/TestPro.csproj" ("/Library/Frameworks/Mono.framework/External/xbuild/Xamarin/iOS/Xamarin.iOS.Common.targets"); "_CompileToNative" depends on it.
Building target "_SplitAppExtensionReferencesByExistent" in project "/Users/360_macmini/Desktop/Xamarin/TestPro/TestPro/TestPro.csproj" ("/Library/Frameworks/Mono.framework/External/xbuild/Xamarin/iOS/Xamarin.iOS.Common.targets"); "_ResolveAppExtensionReferences" depends on it.
Building target "_AssignAppExtensionConfiguration" in project "/Users/360_macmini/Desktop/Xamarin/TestPro/TestPro/TestPro.csproj" ("/Library/Frameworks/Mono.framework/External/xbuild/Xamarin/iOS/Xamarin.iOS.Common.targets"); "_SplitAppExtensionReferencesByExistent" depends on it.
Target _AssignAppExtensionConfiguration skipped due to false condition: '@(_AppExtensionReference)' != ''
Done building target "_AssignAppExtensionConfiguration" in project "/Users/360_macmini/Desktop/Xamarin/TestPro/TestPro/TestPro.csproj" ("/Library/Frameworks/Mono.framework/External/xbuild/Xamarin/iOS/Xamarin.iOS.Common.targets"); "_SplitAppExtensionReferencesByExistent" depends on it.
Done building target "_SplitAppExtensionReferencesByExistent" in project "/Users/360_macmini/Desktop/Xamarin/TestPro/TestPro/TestPro.csproj" ("/Library/Frameworks/Mono.framework/External/xbuild/Xamarin/iOS/Xamarin.iOS.Common.targets"); "_ResolveAppExtensionReferences" depends on it.
Done building target "_ResolveAppExtensionReferences" in project "/Users/360_macmini/Desktop/Xamarin/TestPro/TestPro/TestPro.csproj" ("/Library/Frameworks/Mono.framework/External/xbuild/Xamarin/iOS/Xamarin.iOS.Common.targets"); "_CompileToNative" depends on it.
Target _CompileToNative:
Target _CompileToNative needs to be built as output file 'bin/iPhoneSimulator/Debug/TestPro.app/TestPro' does not exist.
Task "MTouch"
Using task MTouch from Xamarin.iOS.Tasks.MTouch, Xamarin.iOS.Tasks, Version=0.0.0.0, Culture=neutral, PublicKeyToken=null
MTouch Task
AppBundleDir: bin/iPhoneSimulator/Debug/TestPro.app
AppExtensionReferences:
AppManifest: bin/iPhoneSimulator/Debug/TestPro.app/Info.plist
Architectures: i386
ArchiveSymbols: <null>
BitcodeEnabled: False
CompiledEntitlements: obj/iPhoneSimulator/Debug/Entitlements.xcent
Debug: True
EnableGenericValueTypeSharing: True
Entitlements: <null>
ExecutableName: TestPro
ExtraArgs: <null>
FastDev: True
HttpClientHandler: HttpClientHandler
I18n: <null>
IntermediateOutputPath: obj/iPhoneSimulator/Debug/mtouch-cache
IsAppExtension: False
LinkerDumpDependencies: False
LinkMode: Full
MainAssembly: /Users/360_macmini/Desktop/Xamarin/TestPro/TestPro/bin/iPhoneSimulator/Debug//TestPro.exe
NativeReferences: <null>
OutputPath: bin/iPhoneSimulator/Debug/
Profiling: True
ProjectDir: /Users/360_macmini/Desktop/Xamarin/TestPro/TestPro
References:
/Library/Frameworks/Xamarin.iOS.framework/Versions/Current/lib/mono/Xamarin.iOS/System.dll
/Library/Frameworks/Xamarin.iOS.framework/Versions/Current/lib/mono/Xamarin.iOS/System.Xml.dll
/Library/Frameworks/Xamarin.iOS.framework/Versions/Current/lib/mono/Xamarin.iOS/System.Core.dll
/Library/Frameworks/Xamarin.iOS.framework/Versions/Current/lib/mono/Xamarin.iOS/Xamarin.iOS.dll
../../../../Downloads/GoogleConversionTracking.Unified.dll
/Library/Frameworks/Xamarin.iOS.framework/Versions/Current/lib/mono/Xamarin.iOS//mscorlib.dll
../../../../Downloads/GoogleConversionTracking.Unified.dll
SdkIsSimulator: True
SdkRoot: /Applications/Xcode.app/Contents/Developer
SdkVersion: 10.0
SymbolsList: obj/iPhoneSimulator/Debug/mtouch-symbols.list
TargetFrameworkIdentifier: Xamarin.iOS
TLSProvider: Default
UseFloat32: False
UseLlvm: False
UseThumb: False
Verbosity: 4
Tool /Library/Frameworks/Xamarin.iOS.framework/Versions/Current/bin/mtouch execution started with arguments: --cache /Users/360_macmini/Desktop/Xamarin/TestPro/TestPro/obj/iPhoneSimulator/Debug/mtouch-cache --sim /Users/360_macmini/Desktop/Xamarin/TestPro/TestPro/bin/iPhoneSimulator/Debug/TestPro.app --executable TestPro --fastdev --debug --profiling --sdkroot /Applications/Xcode.app/Contents/Developer --sdk 10.0 --targetver 10.0 --http-message-handler=HttpClientHandler --tls-provider=default --abi=i386 --symbollist /Users/360_macmini/Desktop/Xamarin/TestPro/TestPro/obj/iPhoneSimulator/Debug/mtouch-symbols.list --dsym=no -r /Library/Frameworks/Xamarin.iOS.framework/Versions/Current/lib/mono/Xamarin.iOS/System.dll -r /Library/Frameworks/Xamarin.iOS.framework/Versions/Current/lib/mono/Xamarin.iOS/System.Xml.dll -r /Library/Frameworks/Xamarin.iOS.framework/Versions/Current/lib/mono/Xamarin.iOS/System.Core.dll -r /Library/Frameworks/Xamarin.iOS.framework/Versions/Current/lib/mono/Xamarin.iOS/Xamarin.iOS.dll -r /Users/360_macmini/Downloads/GoogleConversionTracking.Unified.dll -r /Library/Frameworks/Xamarin.iOS.framework/Versions/Current/lib/mono/Xamarin.iOS/mscorlib.dll -r /Users/360_macmini/Downloads/GoogleConversionTracking.Unified.dll --target-framework Xamarin.iOS,v1.0 /Users/360_macmini/Desktop/Xamarin/TestPro/TestPro/bin/iPhoneSimulator/Debug//TestPro.exe -v -v -v -v
Environment variables being passed to the tool:
Using Xcode 8.0 found in /Applications/Xcode.app/Contents/Developer
Xamarin.iOS 10.0.1.10 (cycle8-sr0-xi: ad1cd42) using framework: /Applications/Xcode.app/Contents/Developer/Platforms/iPhoneSimulator.platform/Developer/SDKs/iPhoneSimulator10.0.sdk
A full rebuild will be performed because the cache is either incomplete or entirely missing.
Extracted third-party binding 'libGoogleConversionTracking.a' from '/Users/360_macmini/Downloads/GoogleConversionTracking.Unified.dll' to '/Users/360_macmini/Desktop/Xamarin/TestPro/TestPro/obj/iPhoneSimulator/Debug/mtouch-cache/libGoogleConversionTracking.a'
Copied /Users/360_macmini/Desktop/Xamarin/TestPro/TestPro/bin/iPhoneSimulator/Debug/TestPro.exe to /Users/360_macmini/Desktop/Xamarin/TestPro/TestPro/obj/iPhoneSimulator/Debug/mtouch-cache/Link/TestPro.exe
Copied /Users/360_macmini/Desktop/Xamarin/TestPro/TestPro/bin/iPhoneSimulator/Debug/TestPro.exe.mdb to /Users/360_macmini/Desktop/Xamarin/TestPro/TestPro/obj/iPhoneSimulator/Debug/mtouch-cache/Link/TestPro.exe.mdb
Copied /Library/Frameworks/Xamarin.iOS.framework/Versions/10.0.1.10/lib/32bits/Xamarin.iOS.dll to /Users/360_macmini/Desktop/Xamarin/TestPro/TestPro/obj/iPhoneSimulator/Debug/mtouch-cache/Link/Xamarin.iOS.dll
Copied /Library/Frameworks/Xamarin.iOS.framework/Versions/10.0.1.10/lib/32bits/Xamarin.iOS.dll.mdb to /Users/360_macmini/Desktop/Xamarin/TestPro/TestPro/obj/iPhoneSimulator/Debug/mtouch-cache/Link/Xamarin.iOS.dll.mdb
Copied /Library/Frameworks/Xamarin.iOS.framework/Versions/10.0.1.10/lib/mono/2.1/mscorlib.dll to /Users/360_macmini/Desktop/Xamarin/TestPro/TestPro/obj/iPhoneSimulator/Debug/mtouch-cache/Link/mscorlib.dll
Copied /Library/Frameworks/Xamarin.iOS.framework/Versions/10.0.1.10/lib/mono/2.1/mscorlib.dll.mdb to /Users/360_macmini/Desktop/Xamarin/TestPro/TestPro/obj/iPhoneSimulator/Debug/mtouch-cache/Link/mscorlib.dll.mdb
Copied /Library/Frameworks/Xamarin.iOS.framework/Versions/10.0.1.10/lib/mono/2.1/System.dll to /Users/360_macmini/Desktop/Xamarin/TestPro/TestPro/obj/iPhoneSimulator/Debug/mtouch-cache/Link/System.dll
Copied /Library/Frameworks/Xamarin.iOS.framework/Versions/10.0.1.10/lib/mono/2.1/System.dll.mdb to /Users/360_macmini/Desktop/Xamarin/TestPro/TestPro/obj/iPhoneSimulator/Debug/mtouch-cache/Link/System.dll.mdb
Copied /Library/Frameworks/Xamarin.iOS.framework/Versions/10.0.1.10/lib/mono/2.1/System.Xml.dll to /Users/360_macmini/Desktop/Xamarin/TestPro/TestPro/obj/iPhoneSimulator/Debug/mtouch-cache/Link/System.Xml.dll
Copied /Library/Frameworks/Xamarin.iOS.framework/Versions/10.0.1.10/lib/mono/2.1/System.Xml.dll.mdb to /Users/360_macmini/Desktop/Xamarin/TestPro/TestPro/obj/iPhoneSimulator/Debug/mtouch-cache/Link/System.Xml.dll.mdb
Copied /Library/Frameworks/Xamarin.iOS.framework/Versions/10.0.1.10/lib/mono/2.1/System.Core.dll to /Users/360_macmini/Desktop/Xamarin/TestPro/TestPro/obj/iPhoneSimulator/Debug/mtouch-cache/Link/System.Core.dll
Copied /Library/Frameworks/Xamarin.iOS.framework/Versions/10.0.1.10/lib/mono/2.1/System.Core.dll.mdb to /Users/360_macmini/Desktop/Xamarin/TestPro/TestPro/obj/iPhoneSimulator/Debug/mtouch-cache/Link/System.Core.dll.mdb
Copied /Library/Frameworks/Xamarin.iOS.framework/Versions/10.0.1.10/lib/mono/2.1/Mono.Dynamic.Interpreter.dll to /Users/360_macmini/Desktop/Xamarin/TestPro/TestPro/obj/iPhoneSimulator/Debug/mtouch-cache/Link/Mono.Dynamic.Interpreter.dll
Copied /Library/Frameworks/Xamarin.iOS.framework/Versions/10.0.1.10/lib/mono/2.1/Mono.Dynamic.Interpreter.dll.mdb to /Users/360_macmini/Desktop/Xamarin/TestPro/TestPro/obj/iPhoneSimulator/Debug/mtouch-cache/Link/Mono.Dynamic.Interpreter.dll.mdb
Copied /Users/360_macmini/Downloads/GoogleConversionTracking.Unified.dll to /Users/360_macmini/Desktop/Xamarin/TestPro/TestPro/obj/iPhoneSimulator/Debug/mtouch-cache/Link/GoogleConversionTracking.Unified.dll
Loaded '/Users/360_macmini/Desktop/Xamarin/TestPro/TestPro/obj/iPhoneSimulator/Debug/mtouch-cache/Link/TestPro.exe'
Loaded '/Users/360_macmini/Desktop/Xamarin/TestPro/TestPro/obj/iPhoneSimulator/Debug/mtouch-cache/Link/Xamarin.iOS.dll'
Loaded '/Users/360_macmini/Desktop/Xamarin/TestPro/TestPro/obj/iPhoneSimulator/Debug/mtouch-cache/Link/mscorlib.dll'
Loaded '/Users/360_macmini/Desktop/Xamarin/TestPro/TestPro/obj/iPhoneSimulator/Debug/mtouch-cache/Link/System.dll'
Loaded '/Users/360_macmini/Desktop/Xamarin/TestPro/TestPro/obj/iPhoneSimulator/Debug/mtouch-cache/Link/System.Xml.dll'
Loaded '/Users/360_macmini/Desktop/Xamarin/TestPro/TestPro/obj/iPhoneSimulator/Debug/mtouch-cache/Link/System.Core.dll'
Loaded '/Users/360_macmini/Desktop/Xamarin/TestPro/TestPro/obj/iPhoneSimulator/Debug/mtouch-cache/Link/Mono.Dynamic.Interpreter.dll'
Loaded '/Users/360_macmini/Desktop/Xamarin/TestPro/TestPro/obj/iPhoneSimulator/Debug/mtouch-cache/Link/GoogleConversionTracking.Unified.dll'
Linking /Users/360_macmini/Desktop/Xamarin/TestPro/TestPro/bin/iPhoneSimulator/Debug//TestPro.exe into /Users/360_macmini/Desktop/Xamarin/TestPro/TestPro/obj/iPhoneSimulator/Debug/mtouch-cache/PreBuild using mode 'All'
MTOUCH: error MT2001: Could not link assemblies. Reason: Object reference not set to an instance of an object
--- inner exception
System.NullReferenceException: Object reference not set to an instance of an object
at MonoTouch.Tuner.OptimizeGeneratedCodeSubStep.ProcessIsDirectBinding (Mono.Cecil.MethodDefinition caller, Mono.Cecil.Cil.Instruction ins) [0x00020] in <cb05882b2885456b977d8aad316be58c>:0
at MonoTouch.Tuner.OptimizeGeneratedCodeSubStep.ProcessCalls (Mono.Cecil.MethodDefinition caller, System.Int32 i) [0x00308] in <cb05882b2885456b977d8aad316be58c>:0
at MonoTouch.Tuner.OptimizeGeneratedCodeSubStep.ProcessMethod (Mono.Cecil.MethodDefinition method) [0x00045] in <cb05882b2885456b977d8aad316be58c>:0
at Xamarin.Linker.CoreOptimizeGeneratedCode.ProcessMethods (System.Collections.Generic.IEnumerable`1[T] c, System.Boolean extensions) [0x0003a] in <cb05882b2885456b977d8aad316be58c>:0
at Xamarin.Linker.CoreOptimizeGeneratedCode.ProcessType (Mono.Cecil.TypeDefinition type) [0x0005a] in <cb05882b2885456b977d8aad316be58c>:0
at MonoTouch.Tuner.OptimizeGeneratedCodeSubStep.ProcessType (Mono.Cecil.TypeDefinition type) [0x00018] in <cb05882b2885456b977d8aad316be58c>:0
at Mono.Tuner.SubStepDispatcher.DispatchType (Mono.Cecil.TypeDefinition type) [0x00032] in <cb05882b2885456b977d8aad316be58c>:0
at Mono.Tuner.SubStepDispatcher.BrowseTypes (System.Collections.ICollection types) [0x00018] in <cb05882b2885456b977d8aad316be58c>:0
at Mono.Tuner.SubStepDispatcher.BrowseAssemblies (System.Collections.Generic.IEnumerable`1[T] assemblies) [0x0004d] in <cb05882b2885456b977d8aad316be58c>:0
at Mono.Tuner.SubStepDispatcher.Process (Mono.Linker.LinkContext context) [0x0000e] in <cb05882b2885456b977d8aad316be58c>:0
at Mono.Linker.Pipeline.Process (Mono.Linker.LinkContext context) [0x00023] in <cb05882b2885456b977d8aad316be58c>:0
at MonoTouch.Tuner.Linker.Process (MonoTouch.Tuner.LinkerOptions options, MonoTouch.Tuner.MonoTouchLinkContext& context, System.Collections.Generic.List`1[System.String]& assemblies) [0x000a5] in <cb05882b2885456b977d8aad316be58c>:0
---
at MonoTouch.Tuner.Linker.Process (MonoTouch.Tuner.LinkerOptions options, MonoTouch.Tuner.MonoTouchLinkContext& context, System.Collections.Generic.List`1[System.String]& assemblies) [0x0014f] in <cb05882b2885456b977d8aad316be58c>:0
at Xamarin.Bundler.Target.LinkAssemblies (System.String main, System.Collections.Generic.List`1[System.String]& assemblies, System.String output_dir, MonoTouch.Tuner.MonoTouchLinkContext& link_context) [0x00236] in <cb05882b2885456b977d8aad316be58c>:0
at Xamarin.Bundler.Target.ManagedLink () [0x003a6] in <cb05882b2885456b977d8aad316be58c>:0
at Xamarin.Bundler.Target.ProcessAssemblies () [0x000e4] in <cb05882b2885456b977d8aad316be58c>:0
at Xamarin.Bundler.Application.BuildApp () [0x0002f] in <cb05882b2885456b977d8aad316be58c>:0
at Xamarin.Bundler.Application.Build () [0x00053] in <cb05882b2885456b977d8aad316be58c>:0
at Xamarin.Bundler.Driver.Main2 (System.String[] args) [0x01c73] in <cb05882b2885456b977d8aad316be58c>:0
at Xamarin.Bundler.Driver.Main (System.String[] args) [0x0000c] in <cb05882b2885456b977d8aad316be58c>:0
Tool /Library/Frameworks/Xamarin.iOS.framework/Versions/Current/bin/mtouch execution finished.
Task "MTouch" execution -- FAILED
Done building target "_CompileToNative" in project "/Users/360_macmini/Desktop/Xamarin/TestPro/TestPro/TestPro.csproj".-- FAILED
Done building target "_CompileToNative" in project "/Users/360_macmini/Desktop/Xamarin/TestPro/TestPro/TestPro.csproj" ("/Library/Frameworks/Mono.framework/External/xbuild/Xamarin/iOS/Xamarin.iOS.Common.targets"); "_CreateAppBundle" depends on it.
Done building target "_CreateAppBundle" in project "/Users/360_macmini/Desktop/Xamarin/TestPro/TestPro/TestPro.csproj" ("/Library/Frameworks/Mono.framework/External/xbuild/Xamarin/iOS/Xamarin.iOS.Common.targets"); "Build" depends on it.
Done building target "Build" in project "/Users/360_macmini/Desktop/Xamarin/TestPro/TestPro/TestPro.csproj" ("/Library/Frameworks/Mono.framework/Versions/4.6.1/lib/mono/xbuild/14.0/bin/Microsoft.Common.targets").
Done building project "/Users/360_macmini/Desktop/Xamarin/TestPro/TestPro/TestPro.csproj".-- FAILED
Target perfomance summary:
0.717 ms _AddCorlibReference 1 calls
0.066 ms _BeforeCompileTextureAtlases 1 calls
1.251 ms _BeforeCoreCompileImageAssets 1 calls
1.718 ms _BeforeCoreCompileInterfaceDefinitions 1 calls
0.068 ms _BeforeCoreCompileSceneKitAssets 1 calls
0.497 ms _CheckForInvalidConfigurationAndPlatform 1 calls
0.566 ms _CleanUploaded 1 calls
0.428 ms _CollectBundleResources 1 calls
1.110 ms _CollectColladaAssets 1 calls
0.952 ms _CollectLocalizationFiles 1 calls
0.415 ms _CollectPngImages 1 calls
1.459 ms _CollectPropertyLists 1 calls
8.130 ms _CompileAppManifest 1 calls
4764.991 ms _CompileToNative 1 calls
3.319 ms _ComputeBundleResourceOutputPaths 1 calls
0.160 ms _ComputeTargetArchitectures 1 calls
9.434 ms _CopyResourcesToBundle 1 calls
0.080 ms _CoreCompileColladaAssets 1 calls
130.886 ms _CoreCompileImageAssets 1 calls
144.659 ms _CoreCompileInterfaceDefinitions 1 calls
0.069 ms _CoreCompileSceneKitAssets 1 calls
0.071 ms _CoreCompileTextureAtlases 1 calls
0.090 ms _CoreOptimizeLocalizationFiles 1 calls
1.279 ms _CoreOptimizePngImages 1 calls
0.194 ms _CoreOptimizePropertyLists 1 calls
1.317 ms _CreateAssetPackManifest 1 calls
1.460 ms _DetectAppManifest 1 calls
1.130 ms _DetectDebugNetworkConfiguration 1 calls
2.557 ms _DetectSdkLocations 1 calls
2.849 ms _DetectSigningIdentity 1 calls
0.105 ms _GenerateBundleName 1 calls
1.108 ms _GenerateTargetFrameworkMonikerAttribute 1 calls
1.542 ms _GetCompileOutputsForClean 1 calls
2.413 ms _GetNativeExecutableName 1 calls
0.205 ms _PrepareResourceRules 1 calls
0.137 ms _ReadCompileImageAssets 1 calls
0.209 ms _ReadCoreCompileInterfaceDefinitions 1 calls
0.114 ms _ReadCoreCompileSceneKitAssets 1 calls
0.105 ms _ReadCoreCompileTextureAtlases 1 calls
3.210 ms _RecordCleanFile 1 calls
0.336 ms _ResolveAppExtensionReferences 1 calls
0.562 ms _ResolveWatchAppReferences 1 calls
0.143 ms _SeparateAppExtensionReferences 1 calls
0.132 ms _SeparateWatchAppReferences 1 calls
0.143 ms _SplitAppExtensionReferencesByExistent 1 calls
0.249 ms _SplitWatchAppReferencesByExistent 1 calls
10.074 ms _UnpackLibraryResources 1 calls
0.164 ms AssignLinkMetadata 1 calls
0.722 ms AssignTargetPaths 1 calls
3.790 ms CopyFilesMarkedCopyLocal 1 calls
352.546 ms CoreCompile 1 calls
0.236 ms CreateManifestResourceNames 1 calls
4.091 ms DeployOutputFiles 1 calls
0.183 ms GenerateResources 1 calls
0.082 ms GenerateSatelliteAssemblies 1 calls
0.409 ms GenerateTargetFrameworkMonikerAttribute 1 calls
1.047 ms GetCopyToOutputDirectoryItems 1 calls
12.916 ms GetReferenceAssemblyPaths 1 calls
23.498 ms ImplicitlyExpandDesignTimeFacades 1 calls
1.604 ms PrepareForBuild 1 calls
8.473 ms ResolveAssemblyReferences 1 calls
0.452 ms ResolveProjectReferences 1 calls
0.128 ms SplitProjectReferencesByExistent 1 calls
0.743 ms SplitResourcesByCulture 1 calls
Tasks perfomance summary:
128.065 ms ACTool 1 calls
0.157 ms AssignCulture 1 calls
0.613 ms AssignTargetPath 3 calls
1.318 ms CollectBundleResources 2 calls
6.903 ms CompileAppManifest 1 calls
3.125 ms ComputeBundleResourceOutputPaths 1 calls
7.142 ms Copy 3 calls
1.108 ms CreateAssetPackManifest 1 calls
1.857 ms CreateItem 6 calls
0.239 ms CreateProperty 1 calls
351.464 ms Csc 1 calls
2.378 ms Delete 4 calls
1.003 ms DetectDebugNetworkConfiguration 1 calls
2.296 ms DetectSdkLocations 1 calls
2.514 ms DetectSigningIdentity 1 calls
0.219 ms FindAppConfigFile 1 calls
1.223 ms FindItemWithLogicalName 1 calls
0.393 ms FindUnderPath 1 calls
2.235 ms GetNativeExecutableName 1 calls
0.812 ms GetReferenceAssemblyPaths 1 calls
142.107 ms IBTool 1 calls
0.998 ms MakeDir 1 calls
0.243 ms Message 1 calls
4764.168 ms MTouch 1 calls
0.367 ms ReadLinesFromFile 1 calls
1.031 ms RemoveDir 2 calls
1.592 ms RemoveDuplicates 1 calls
7.614 ms ResolveAssemblyReference 1 calls
8.824 ms SmartCopy 1 calls
9.930 ms UnpackLibraryResources 1 calls
3.425 ms WriteItemsToFile 3 calls
1.411 ms WriteLinesToFile 2 calls
Build FAILED.
Warnings:
/Users/360_macmini/Desktop/Xamarin/TestPro/TestPro/TestPro.csproj (Build) ->
/Library/Frameworks/Mono.framework/Versions/4.6.1/lib/mono/xbuild/14.0/bin/Microsoft.CSharp.targets (CoreCompile target) ->
ViewController.cs(17,16): warning CS0219: The variable `obj' is assigned but its value is never used
Errors:
/Users/360_macmini/Desktop/Xamarin/TestPro/TestPro/TestPro.csproj (Build) ->
/Library/Frameworks/Mono.framework/External/xbuild/Xamarin/iOS/Xamarin.iOS.Common.targets (_CompileToNative target) ->
MTOUCH: error MT2001: Could not link assemblies. Reason: Object reference not set to an instance of an object
1 Warning(s)
1 Error(s)
Time Elapsed 00:00:05.6336240
---------------------- Done ----------------------
Xamarin Inspector Integration
Enabled for project: no
Reason: Inspector support requires this project's Linker Behavior to be set to "Don't Link"
Version: 0.9.0.14
Hash: 4d868da
Build: 1 error, 1 warning
Sign up for free to join this conversation on GitHub. Already have an account? Sign in to comment
You can’t perform that action at this time.