Skip to content

Instantly share code, notes, and snippets.

Embed
What would you like to do?
Seam 2.x integration test failure doing "mvn clean install test"
Seam Integration Tests ............................ FAILURE [3.289s]
[INFO] ------------------------------------------------------------------------
[INFO] BUILD FAILURE
[INFO] ------------------------------------------------------------------------
[INFO] Total time: 2:36.172s
[INFO] Finished at: Fri Jul 12 17:04:37 EDT 2013
[INFO] Final Memory: 93M/529M
[INFO] ------------------------------------------------------------------------
[ERROR] Failed to execute goal org.apache.maven.plugins:maven-war-plugin:2.3:war (default-war) on project seam-integration-tests: Failed to copy file for artifact [org.jboss.seam:jboss-seam:ejb:2.3.2-SNAPSHOT:compile]: /home/smarlow/work/jboss-seam/jboss-seam/target/classes (Is a directory) -> [Help 1]
[ERROR]
[ERROR] To see the full stack trace of the errors, re-run Maven with the -e switch.
[ERROR] Re-run Maven using the -X switch to enable full debug logging.
[ERROR]
[ERROR] For more information about the errors and possible solutions, please read the following articles:
[ERROR] [Help 1] http://cwiki.apache.org/confluence/display/MAVEN/MojoExecutionException
[ERROR]
[ERROR] After correcting the problems, you can resume the build with the command
[ERROR] mvn <goals> -rf :seam-integration-tests
Sign up for free to join this conversation on GitHub. Already have an account? Sign in to comment