Skip to content

Instantly share code, notes, and snippets.

Embed
What would you like to do?
yarn
yarn install v1.17.3
[1/4] 🔍 Resolving packages...
[2/4] 🚚 Fetching packages...
[3/4] 🔗 Linking dependencies...
warning "firebase > @firebase/database@0.3.8" has unmet peer dependency "@firebase/app-types@0.x".
warning "firebase > @firebase/firestore@0.9.2" has unmet peer dependency "@firebase/app-types@0.x".
warning "firebase > @firebase/functions@0.3.3" has unmet peer dependency "@firebase/app-types@0.x".
warning "firebase > @firebase/messaging@0.3.7" has unmet peer dependency "@firebase/app-types@0.x".
warning "firebase > @firebase/storage@0.2.4" has unmet peer dependency "@firebase/app-types@0.x".
warning "firebase > @firebase/auth > @firebase/auth-types@0.5.0" has unmet peer dependency "@firebase/app-types@0.x".
warning "firebase > @firebase/database > @firebase/database-types@0.3.2" has unmet peer dependency "@firebase/app-types@0.x".
warning "firebase > @firebase/firestore > @firebase/firestore-types@0.8.0" has unmet peer dependency "@firebase/app-types@0.x".
warning "firebase > @firebase/functions > @firebase/messaging-types@0.2.3" has unmet peer dependency "@firebase/app-types@0.x".
warning "firebase > @firebase/storage > @firebase/storage-types@0.2.3" has unmet peer dependency "@firebase/app-types@0.x".
warning " > react-codemirror@1.0.0" has incorrect peer dependency "react@>=15.5 <16".
warning " > react-codemirror@1.0.0" has incorrect peer dependency "react-dom@>=15.5 <16".
warning " > react-count-down@1.1.0" has incorrect peer dependency "react@^15.1.0".
warning " > react-dates@18.3.1" has unmet peer dependency "react-with-direction@^1.3.0".
warning " > react-drawer@1.3.4" has incorrect peer dependency "react@^0.14.7 || ^15.0.0".
[4/4] 🔨 Building fresh packages...
[1/4] ⢀ grpc
[2/4] ⢀ node-sass
[3/4] ⢀ fsevents
warning Error running install script for optional dependency: "/Volumes/Works/www/my-app/node_modules/fsevents: Command failed.
Exit code: 1
Command: node install
Arguments:
Directory: /Volumes/Works/www/my-app/node_modules/fsevents
Output:
node-pre-gyp info it worked if it ends with ok
node-pre-gyp info using node-pre-gyp@0.10.0
node-pre-gyp info using node@12.7.0 | darwin | x64
node-pre-gyp info check checked for \"/Volumes/Works/www/my-app/node_modules/fsevents/lib/binding/Release/node-v72-darwin-x64/fse.node\" (not found)
node-pre-gyp http GET https://fsevents-binaries.s3-us-west-2.amazonaws.com/v1.2.4/fse-v1.2.4-node-v72-darwin-x64.tar.gz
node-pre-gyp http 404 https://fsevents-binaries.s3-us-west-2.amazonaws.com/v1.2.4/fse-v1.2.4-node-v72-darwin-x64.tar.gz
node-pre-gyp WARN Tried to download(404): https://fsevents-binaries.s3-us-west-2.amazonaws.com/v1.2.4/fse-v1.2.4-node-v72-darwin-x64.tar.gz
node-pre-gyp WARN Pre-built binaries not found for fsevents@1.2.4 and node@12.7.0 (node-v72 ABI, unknown) (falling back to source compile with node-gyp)
node-pre-gyp http 404 status code downloading tarball https://fsevents-binaries.s3-us-west-2.amazonaws.com/v1.2.4/fse-v1.2.4-node-v72-darwin-x64.tar.gz
gyp info it worked if it ends with ok
gyp info using node-gyp@3.8.0
gyp info using node@12.7.0 | darwin | x64
gyp info ok
gyp info it worked if it ends with ok
gyp info using node-gyp@3.8.0
gyp info using node@12.7.0 | darwin | x64
gyp info spawn /usr/bin/python
gyp info spawn args [
gyp info spawn args '/Volumes/Works/www/my-app/node_modules/node-gyp/gyp/gyp_main.py',
gyp info spawn args 'binding.gyp',
gyp info spawn args '-f',
gyp info spawn args 'make',
gyp info spawn args '-I',
gyp info spawn args '/Volumes/Works/www/my-app/node_modules/fsevents/build/config.gypi',
gyp info spawn args '-I',
gyp info spawn args '/Volumes/Works/www/my-app/node_modules/node-gyp/addon.gypi',
gyp info spawn args '-I',
gyp info spawn args '/Users/truongsa/.node-gyp/12.7.0/include/node/common.gypi',
gyp info spawn args '-Dlibrary=shared_library',
gyp info spawn args '-Dvisibility=default',
gyp info spawn args '-Dnode_root_dir=/Users/truongsa/.node-gyp/12.7.0',
gyp info spawn args '-Dnode_gyp_dir=/Volumes/Works/www/my-app/node_modules/node-gyp',
gyp info spawn args '-Dnode_lib_file=/Users/truongsa/.node-gyp/12.7.0/<(target_arch)/node.lib',
gyp info spawn args '-Dmodule_root_dir=/Volumes/Works/www/my-app/node_modules/fsevents',
gyp info spawn args '-Dnode_engine=v8',
gyp info spawn args '--depth=.',
gyp info spawn args '--no-parallel',
gyp info spawn args '--generator-output',
gyp info spawn args 'build',
gyp info spawn args '-Goutput_dir=.'
gyp info spawn args ]
gyp info ok
gyp info it worked if it ends with ok
gyp info using node-gyp@3.8.0
gyp info using node@12.7.0 | darwin | x64
gyp info spawn make
gyp info spawn args [ 'BUILDTYPE=Release', '-C', 'build' ]
SOLINK_MODULE(target) Release/.node
CXX(target) Release/obj.target/fse/fsevents.o
In file included from ../fsevents.cc:6:
In file included from ../../nan/nan.h:221:
In file included from ../../nan/nan_converters.h:67:
../../nan/nan_converters_43_inl.h:22:1: warning: 'ToBoolean' is deprecated: ToBoolean can never throw. Use Local version. [-Wdeprecated-declarations]
X(Boolean)
^
../../nan/nan_converters_43_inl.h:18:12: note: expanded from macro 'X'
val->To ## TYPE(isolate->GetCurrentContext()) \\\n ^
<scratch space>:176:1: note: expanded from here
ToBoolean
^
/Users/truongsa/.node-gyp/12.7.0/include/node/v8.h:2530:3: note: 'ToBoolean' has been explicitly marked deprecated here
V8_DEPRECATED(\"ToBoolean can never throw. Use Local version.\",
^
/Users/truongsa/.node-gyp/12.7.0/include/node/v8config.h:311:29: note: expanded from macro 'V8_DEPRECATED'
declarator __attribute__((deprecated(message)))
^
In file included from ../fsevents.cc:6:
In file included from ../../nan/nan.h:221:
In file included from ../../nan/nan_converters.h:67:
../../nan/nan_converters_43_inl.h:40:1: warning: 'BooleanValue' is deprecated: BooleanValue can never throw. Use Isolate version. [-Wdeprecated-declarations]
X(bool, Boolean)
^
../../nan/nan_converters_43_inl.h:37:15: note: expanded from macro 'X'
return val->NAME ## Value(isolate->GetCurrentContext()); \\\n ^
<scratch space>:183:1: note: expanded from here
BooleanValue
^
/Users/truongsa/.node-gyp/12.7.0/include/node/v8.h:2568:3: note: 'BooleanValue' has been explicitly marked deprecated here
V8_DEPRECATED(\"BooleanValue can never throw. Use Isolate version.\",
^
/Users/truongsa/.node-gyp/12.7.0/include/node/v8config.h:311:29: note: expanded from macro 'V8_DEPRECATED'
declarator __attribute__((deprecated(message)))
^
In file included from ../fsevents.cc:6:
In file included from ../../nan/nan.h:222:
In file included from ../../nan/nan_new.h:189:
../../nan/nan_implementation_12_inl.h:103:42: error: no viable conversion from 'v8::Isolate *' to 'Local<v8::Context>'
return scope.Escape(v8::Function::New( isolate
^~~~~~~
/Users/truongsa/.node-gyp/12.7.0/include/node/v8.h:183:7: note: candidate constructor (the implicit copy constructor) not viable: no known conversion from 'v8::Isolate *' to 'const v8::Local<v8::Context> &' for 1st argument
class Local {
^
/Users/truongsa/.node-gyp/12.7.0/include/node/v8.h:183:7: note: candidate constructor (the implicit move constructor) not viable: no known conversion from 'v8::Isolate *' to 'v8::Local<v8::Context> &&' for 1st argument
/Users/truongsa/.node-gyp/12.7.0/include/node/v8.h:187:13: note: candidate template ignored: could not match 'Local<type-parameter-0-0>' against 'v8::Isolate *'
V8_INLINE Local(Local<S> that)
^
/Users/truongsa/.node-gyp/12.7.0/include/node/v8.h:4133:22: note: passing argument to parameter 'context' here
Local<Context> context, FunctionCallback callback,
^
In file included from ../fsevents.cc:6:
../../nan/nan.h:1064:44: warning: 'ToString' is deprecated: Use maybe version [-Wdeprecated-declarations]
v8::Local<v8::String> string = from->ToString(v8::Isolate::GetCurrent());
^
/Users/truongsa/.node-gyp/12.7.0/include/node/v8.h:2550:3: note: 'ToString' has been explicitly marked deprecated here
V8_DEPRECATED(\"Use maybe version\",
^
/Users/truongsa/.node-gyp/12.7.0/include/node/v8config.h:311:29: note: expanded from macro 'V8_DEPRECATED'
declarator __attribute__((deprecated(message)))
^
In file included from ../fsevents.cc:6:
../../nan/nan.h:1855:28: warning: 'Set' is deprecated: Use maybe version [-Wdeprecated-declarations]
New(persistentHandle)->Set(New(key).ToLocalChecked(), value);
^
/Users/truongsa/.node-gyp/12.7.0/include/node/v8.h:3365:3: note: 'Set' has been explicitly marked deprecated here
V8_DEPRECATE_SOON(\"Use maybe version\",
^
/Users/truongsa/.node-gyp/12.7.0/include/node/v8config.h:326:29: note: expanded from macro 'V8_DEPRECATE_SOON'
declarator __attribute__((deprecated(message)))
^
In file included from ../fsevents.cc:6:
../../nan/nan.h:1861:28: warning: 'Set' is deprecated: Use maybe version [-Wdeprecated-declarations]
New(persistentHandle)->Set(key, value);
^
/Users/truongsa/.node-gyp/12.7.0/include/node/v8.h:3365:3: note: 'Set' has been explicitly marked deprecated here
V8_DEPRECATE_SOON(\"Use maybe version\",
^
/Users/truongsa/.node-gyp/12.7.0/include/node/v8config.h:326:29: note: expanded from macro 'V8_DEPRECATE_SOON'
declarator __attribute__((deprecated(message)))
^
In file included from ../fsevents.cc:6:
../../nan/nan.h:1867:28: warning: 'Set' is deprecated: Use maybe version [-Wdeprecated-declarations]
New(persistentHandle)->Set(index, value);
^
/Users/truongsa/.node-gyp/12.7.0/include/node/v8.h:3374:3: note: 'Set' has been explicitly marked deprecated here
V8_DEPRECATE_SOON(\"Use maybe version\",
^
/Users/truongsa/.node-gyp/12.7.0/include/node/v8config.h:326:29: note: expanded from macro 'V8_DEPRECATE_SOON'
declarator __attribute__((deprecated(message)))
^
In file included from ../fsevents.cc:6:
../../nan/nan.h:1873:32: warning: 'Get' is deprecated: Use maybe version [-Wdeprecated-declarations]
New(persistentHandle)->Get(New(key).ToLocalChecked()));
^
/Users/truongsa/.node-gyp/12.7.0/include/node/v8.h:3419:3: note: 'Get' has been explicitly marked deprecated here
V8_DEPRECATE_SOON(\"Use maybe version\", Local<Value> Get(Local<Value> key));
^
/Users/truongsa/.node-gyp/12.7.0/include/node/v8config.h:326:29: note: expanded from macro 'V8_DEPRECATE_SOON'
declarator __attribute__((deprecated(message)))
^
In file included from ../fsevents.cc:6:
../../nan/nan.h:1879:48: warning: 'Get' is deprecated: Use maybe version [-Wdeprecated-declarations]
return scope.Escape(New(persistentHandle)->Get(key));
^
/Users/truongsa/.node-gyp/12.7.0/include/node/v8.h:3419:3: note: 'Get' has been explicitly marked deprecated here
V8_DEPRECATE_SOON(\"Use maybe version\", Local<Value> Get(Local<Value> key));
^
/Users/truongsa/.node-gyp/12.7.0/include/node/v8config.h:326:29: note: expanded from macro 'V8_DEPRECATE_SOON'
declarator __attribute__((deprecated(message)))
^
In file included from ../fsevents.cc:6:
../../nan/nan.h:1884:48: warning: 'Get' is deprecated: Use maybe version [-Wdeprecated-declarations]
return scope.Escape(New(persistentHandle)->Get(index));
^
/Users/truongsa/.node-gyp/12.7.0/include/node/v8.h:3423:3: note: 'Get' has been explicitly marked deprecated here
V8_DEPRECATE_SOON(\"Use maybe version\", Local<Value> Get(uint32_t index));
^
/Users/truongsa/.node-gyp/12.7.0/include/node/v8config.h:326:29: note: expanded from macro 'V8_DEPRECATE_SOON'
declarator __attribute__((deprecated(message)))
^
In file included from ../fsevents.cc:6:
In file included from ../../nan/nan.h:2698:
../../nan/nan_object_wrap.h:24:25: error: no member named 'IsNearDeath' in 'Nan::Persistent<v8::Object, v8::NonCopyablePersistentTraits<v8::Object> >'
assert(persistent().IsNearDeath());
~~~~~~~~~~~~ ^
/Applications/Xcode.app/Contents/Developer/Platforms/MacOSX.platform/Developer/SDKs/MacOSX10.14.sdk/usr/include/assert.h:93:25: note: expanded from macro 'assert'
(__builtin_expect(!(e), 0) ? __assert_rtn(__func__, __FILE__, __LINE__, #e) : (void)0)
^
In file included from ../fsevents.cc:6:
In file included from ../../nan/nan.h:2698:
../../nan/nan_object_wrap.h:67:18: warning: 'MarkIndependent' is deprecated: Weak objects are always considered independent. Use TracedGlobal when trying to use EmbedderHeapTracer. Use a strong handle when trying to keep an object alive. [-Wdeprecated-declarations]
persistent().MarkIndependent();
^
/Users/truongsa/.node-gyp/12.7.0/include/node/v8.h:563:3: note: 'MarkIndependent' has been explicitly marked deprecated here
V8_DEPRECATED(
^
/Users/truongsa/.node-gyp/12.7.0/include/node/v8config.h:311:29: note: expanded from macro 'V8_DEPRECATED'
declarator __attribute__((deprecated(message)))
^
In file included from ../fsevents.cc:6:
In file included from ../../nan/nan.h:2698:
../../nan/nan_object_wrap.h:124:26: error: no member named 'IsNearDeath' in 'Nan::Persistent<v8::Object, v8::NonCopyablePersistentTraits<v8::Object> >'
assert(wrap->handle_.IsNearDeath());
~~~~~~~~~~~~~ ^
/Applications/Xcode.app/Contents/Developer/Platforms/MacOSX.platform/Developer/SDKs/MacOSX10.14.sdk/usr/include/assert.h:93:25: note: expanded from macro 'assert'
(__builtin_expect(!(e), 0) ? __assert_rtn(__func__, __FILE__, __LINE__, #e) : (void)0)
^
../fsevents.cc:50:32: error: no template named 'Handle' in namespace 'v8'
static void Initialize(v8::Handle<v8::Object> exports);
~~~~^
../fsevents.cc:63:6: warning: field 'async_resource' will be initialized after field 'lockStarted' [-Wreorder]
: async_resource(\"fsevents:FSEvents\"), lockStarted(false) {
^
In file included from ../fsevents.cc:82:
../src/constants.cc:89:11: warning: 'Set' is deprecated: Use maybe version [-Wdeprecated-declarations]
object->Set(Nan::New<v8::String>(\"kFSEventStreamEventFlagNone\").ToLocalChecked(), Nan::New<v8::Integer>(kFSEventStreamEventFlagNone));
^
/Users/truongsa/.node-gyp/12.7.0/include/node/v8.h:3365:3: note: 'Set' has been explicitly marked deprecated here
V8_DEPRECATE_SOON(\"Use maybe version\",
^
/Users/truongsa/.node-gyp/12.7.0/include/node/v8config.h:326:29: note: expanded from macro 'V8_DEPRECATE_SOON'
declarator __attribute__((deprecated(message)))
^
In file included from ../fsevents.cc:82:
../src/constants.cc:90:11: warning: 'Set' is deprecated: Use maybe version [-Wdeprecated-declarations]
object->Set(Nan::New<v8::String>(\"kFSEventStreamEventFlagMustScanSubDirs\").ToLocalChecked(), Nan::New<v8::Integer>(kFSEventStreamEventFlagMustScanSubDirs));
^
/Users/truongsa/.node-gyp/12.7.0/include/node/v8.h:3365:3: note: 'Set' has been explicitly marked deprecated here
V8_DEPRECATE_SOON(\"Use maybe version\",
^
/Users/truongsa/.node-gyp/12.7.0/include/node/v8config.h:326:29: note: expanded from macro 'V8_DEPRECATE_SOON'
declarator __attribute__((deprecated(message)))
^
In file included from ../fsevents.cc:82:
../src/constants.cc:91:11: warning: 'Set' is deprecated: Use maybe version [-Wdeprecated-declarations]
object->Set(Nan::New<v8::String>(\"kFSEventStreamEventFlagUserDropped\").ToLocalChecked(), Nan::New<v8::Integer>(kFSEventStreamEventFlagUserDropped));
^
/Users/truongsa/.node-gyp/12.7.0/include/node/v8.h:3365:3: note: 'Set' has been explicitly marked deprecated here
V8_DEPRECATE_SOON(\"Use maybe version\",
^
/Users/truongsa/.node-gyp/12.7.0/include/node/v8config.h:326:29: note: expanded from macro 'V8_DEPRECATE_SOON'
declarator __attribute__((deprecated(message)))
^
In file included from ../fsevents.cc:82:
../src/constants.cc:92:11: warning: 'Set' is deprecated: Use maybe version [-Wdeprecated-declarations]
object->Set(Nan::New<v8::String>(\"kFSEventStreamEventFlagKernelDropped\").ToLocalChecked(), Nan::New<v8::Integer>(kFSEventStreamEventFlagKernelDropped));
^
/Users/truongsa/.node-gyp/12.7.0/include/node/v8.h:3365:3: note: 'Set' has been explicitly marked deprecated here
V8_DEPRECATE_SOON(\"Use maybe version\",
^
/Users/truongsa/.node-gyp/12.7.0/include/node/v8config.h:326:29: note: expanded from macro 'V8_DEPRECATE_SOON'
declarator __attribute__((deprecated(message)))
^
In file included from ../fsevents.cc:82:
../src/constants.cc:93:11: warning: 'Set' is deprecated: Use maybe version [-Wdeprecated-declarations]
object->Set(Nan::New<v8::String>(\"kFSEventStreamEventFlagEventIdsWrapped\").ToLocalChecked(), Nan::New<v8::Integer>(kFSEventStreamEventFlagEventIdsWrapped));
^
/Users/truongsa/.node-gyp/12.7.0/include/node/v8.h:3365:3: note: 'Set' has been explicitly marked deprecated here
V8_DEPRECATE_SOON(\"Use maybe version\",
^
/Users/truongsa/.node-gyp/12.7.0/include/node/v8config.h:326:29: note: expanded from macro 'V8_DEPRECATE_SOON'
declarator __attribute__((deprecated(message)))
^
In file included from ../fsevents.cc:82:
../src/constants.cc:94:11: warning: 'Set' is deprecated: Use maybe version [-Wdeprecated-declarations]
object->Set(Nan::New<v8::String>(\"kFSEventStreamEventFlagHistoryDone\").ToLocalChecked(), Nan::New<v8::Integer>(kFSEventStreamEventFlagHistoryDone));
^
/Users/truongsa/.node-gyp/12.7.0/include/node/v8.h:3365:3: note: 'Set' has been explicitly marked deprecated here
V8_DEPRECATE_SOON(\"Use maybe version\",
^
/Users/truongsa/.node-gyp/12.7.0/include/node/v8config.h:326:29: note: expanded from macro 'V8_DEPRECATE_SOON'
declarator __attribute__((deprecated(message)))
^
In file included from ../fsevents.cc:82:
../src/constants.cc:95:11: warning: 'Set' is deprecated: Use maybe version [-Wdeprecated-declarations]
object->Set(Nan::New<v8::String>(\"kFSEventStreamEventFlagRootChanged\").ToLocalChecked(), Nan::New<v8::Integer>(kFSEventStreamEventFlagRootChanged));
^
/Users/truongsa/.node-gyp/12.7.0/include/node/v8.h:3365:3: note: 'Set' has been explicitly marked deprecated here
V8_DEPRECATE_SOON(\"Use maybe version\",
^
/Users/truongsa/.node-gyp/12.7.0/include/node/v8config.h:326:29: note: expanded from macro 'V8_DEPRECATE_SOON'
declarator __attribute__((deprecated(message)))
^
In file included from ../fsevents.cc:82:
../src/constants.cc:96:11: warning: 'Set' is deprecated: Use maybe version [-Wdeprecated-declarations]
object->Set(Nan::New<v8::String>(\"kFSEventStreamEventFlagMount\").ToLocalChecked(), Nan::New<v8::Integer>(kFSEventStreamEventFlagMount));
^
/Users/truongsa/.node-gyp/12.7.0/include/node/v8.h:3365:3: note: 'Set' has been explicitly marked deprecated here
V8_DEPRECATE_SOON(\"Use maybe version\",
^
/Users/truongsa/.node-gyp/12.7.0/include/node/v8config.h:326:29: note: expanded from macro 'V8_DEPRECATE_SOON'
declarator __attribute__((deprecated(message)))
^
In file included from ../fsevents.cc:82:
../src/constants.cc:97:11: warning: 'Set' is deprecated: Use maybe version [-Wdeprecated-declarations]
object->Set(Nan::New<v8::String>(\"kFSEventStreamEventFlagUnmount\").ToLocalChecked(), Nan::New<v8::Integer>(kFSEventStreamEventFlagUnmount));
^
/Users/truongsa/.node-gyp/12.7.0/include/node/v8.h:3365:3: note: 'Set' has been explicitly marked deprecated here
V8_DEPRECATE_SOON(\"Use maybe version\",
^
/Users/truongsa/.node-gyp/12.7.0/include/node/v8config.h:326:29: note: expanded from macro 'V8_DEPRECATE_SOON'
declarator __attribute__((deprecated(message)))
^
In file included from ../fsevents.cc:82:
../src/constants.cc:98:11: warning: 'Set' is deprecated: Use maybe version [-Wdeprecated-declarations]
object->Set(Nan::New<v8::String>(\"kFSEventStreamEventFlagItemCreated\").ToLocalChecked(), Nan::New<v8::Integer>(kFSEventStreamEventFlagItemCreated));
^
/Users/truongsa/.node-gyp/12.7.0/include/node/v8.h:3365:3: note: 'Set' has been explicitly marked deprecated here
V8_DEPRECATE_SOON(\"Use maybe version\",
^
/Users/truongsa/.node-gyp/12.7.0/include/node/v8config.h:326:29: note: expanded from macro 'V8_DEPRECATE_SOON'
declarator __attribute__((deprecated(message)))
^
In file included from ../fsevents.cc:82:
../src/constants.cc:99:11: warning: 'Set' is deprecated: Use maybe version [-Wdeprecated-declarations]
object->Set(Nan::New<v8::String>(\"kFSEventStreamEventFlagItemRemoved\").ToLocalChecked(), Nan::New<v8::Integer>(kFSEventStreamEventFlagItemRemoved));
^
/Users/truongsa/.node-gyp/12.7.0/include/node/v8.h:3365:3: note: 'Set' has been explicitly marked deprecated here
V8_DEPRECATE_SOON(\"Use maybe version\",
^
/Users/truongsa/.node-gyp/12.7.0/include/node/v8config.h:326:29: note: expanded from macro 'V8_DEPRECATE_SOON'
declarator __attribute__((deprecated(message)))
^
In file included from ../fsevents.cc:82:
../src/constants.cc:100:11: warning: 'Set' is deprecated: Use maybe version [-Wdeprecated-declarations]
object->Set(Nan::New<v8::String>(\"kFSEventStreamEventFlagItemInodeMetaMod\").ToLocalChecked(), Nan::New<v8::Integer>(kFSEventStreamEventFlagItemInodeMetaMod));
^
/Users/truongsa/.node-gyp/12.7.0/include/node/v8.h:3365:3: note: 'Set' has been explicitly marked deprecated here
V8_DEPRECATE_SOON(\"Use maybe version\",
^
/Users/truongsa/.node-gyp/12.7.0/include/node/v8config.h:326:29: note: expanded from macro 'V8_DEPRECATE_SOON'
declarator __attribute__((deprecated(message)))
^
In file included from ../fsevents.cc:82:
../src/constants.cc:101:11: warning: 'Set' is deprecated: Use maybe version [-Wdeprecated-declarations]
object->Set(Nan::New<v8::String>(\"kFSEventStreamEventFlagItemRenamed\").ToLocalChecked(), Nan::New<v8::Integer>(kFSEventStreamEventFlagItemRenamed));
^
/Users/truongsa/.node-gyp/12.7.0/include/node/v8.h:3365:3: note: 'Set' has been explicitly marked deprecated here
V8_DEPRECATE_SOON(\"Use maybe version\",
^
/Users/truongsa/.node-gyp/12.7.0/include/node/v8config.h:326:29: note: expanded from macro 'V8_DEPRECATE_SOON'
declarator __attribute__((deprecated(message)))
^
In file included from ../fsevents.cc:82:
../src/constants.cc:102:11: warning: 'Set' is deprecated: Use maybe version [-Wdeprecated-declarations]
object->Set(Nan::New<v8::String>(\"kFSEventStreamEventFlagItemModified\").ToLocalChecked(), Nan::New<v8::Integer>(kFSEventStreamEventFlagItemModified));
^
/Users/truongsa/.node-gyp/12.7.0/include/node/v8.h:3365:3: note: 'Set' has been explicitly marked deprecated here
V8_DEPRECATE_SOON(\"Use maybe version\",
^
/Users/truongsa/.node-gyp/12.7.0/include/node/v8config.h:326:29: note: expanded from macro 'V8_DEPRECATE_SOON'
declarator __attribute__((deprecated(message)))
^
In file included from ../fsevents.cc:82:
../src/constants.cc:103:11: warning: 'Set' is deprecated: Use maybe version [-Wdeprecated-declarations]
object->Set(Nan::New<v8::String>(\"kFSEventStreamEventFlagItemFinderInfoMod\").ToLocalChecked(), Nan::New<v8::Integer>(kFSEventStreamEventFlagItemFinderInfoMod));
^
/Users/truongsa/.node-gyp/12.7.0/include/node/v8.h:3365:3: note: 'Set' has been explicitly marked deprecated here
V8_DEPRECATE_SOON(\"Use maybe version\",
^
/Users/truongsa/.node-gyp/12.7.0/include/node/v8config.h:326:29: note: expanded from macro 'V8_DEPRECATE_SOON'
declarator __attribute__((deprecated(message)))
^
In file included from ../fsevents.cc:82:
../src/constants.cc:104:11: warning: 'Set' is deprecated: Use maybe version [-Wdeprecated-declarations]
object->Set(Nan::New<v8::String>(\"kFSEventStreamEventFlagItemChangeOwner\").ToLocalChecked(), Nan::New<v8::Integer>(kFSEventStreamEventFlagItemChangeOwner));
^
/Users/truongsa/.node-gyp/12.7.0/include/node/v8.h:3365:3: note: 'Set' has been explicitly marked deprecated here
V8_DEPRECATE_SOON(\"Use maybe version\",
^
/Users/truongsa/.node-gyp/12.7.0/include/node/v8config.h:326:29: note: expanded from macro 'V8_DEPRECATE_SOON'
declarator __attribute__((deprecated(message)))
^
In file included from ../fsevents.cc:82:
../src/constants.cc:105:11: warning: 'Set' is deprecated: Use maybe version [-Wdeprecated-declarations]
object->Set(Nan::New<v8::String>(\"kFSEventStreamEventFlagItemXattrMod\").ToLocalChecked(), Nan::New<v8::Integer>(kFSEventStreamEventFlagItemXattrMod));
^
/Users/truongsa/.node-gyp/12.7.0/include/node/v8.h:3365:3: note: 'Set' has been explicitly marked deprecated here
V8_DEPRECATE_SOON(\"Use maybe version\",
^
/Users/truongsa/.node-gyp/12.7.0/include/node/v8config.h:326:29: note: expanded from macro 'V8_DEPRECATE_SOON'
declarator __attribute__((deprecated(message)))
^
In file included from ../fsevents.cc:82:
../src/constants.cc:106:11: warning: 'Set' is deprecated: Use maybe version [-Wdeprecated-declarations]
object->Set(Nan::New<v8::String>(\"kFSEventStreamEventFlagItemIsFile\").ToLocalChecked(), Nan::New<v8::Integer>(kFSEventStreamEventFlagItemIsFile));
^
/Users/truongsa/.node-gyp/12.7.0/include/node/v8.h:3365:3: note: 'Set' has been explicitly marked deprecated here
V8_DEPRECATE_SOON(\"Use maybe version\",
^
/Users/truongsa/.node-gyp/12.7.0/include/node/v8config.h:326:29: note: expanded from macro 'V8_DEPRECATE_SOON'
declarator __attribute__((deprecated(message)))
^
In file included from ../fsevents.cc:82:
../src/constants.cc:107:11: warning: 'Set' is deprecated: Use maybe version [-Wdeprecated-declarations]
object->Set(Nan::New<v8::String>(\"kFSEventStreamEventFlagItemIsDir\").ToLocalChecked(), Nan::New<v8::Integer>(kFSEventStreamEventFlagItemIsDir));
^
/Users/truongsa/.node-gyp/12.7.0/include/node/v8.h:3365:3: note: 'Set' has been explicitly marked deprecated here
V8_DEPRECATE_SOON(\"Use maybe version\",
^
/Users/truongsa/.node-gyp/12.7.0/include/node/v8config.h:326:29: note: expanded from macro 'V8_DEPRECATE_SOON'
declarator __attribute__((deprecated(message)))
^
In file included from ../fsevents.cc:82:
../src/constants.cc:108:11: warning: 'Set' is deprecated: Use maybe version [-Wdeprecated-declarations]
object->Set(Nan::New<v8::String>(\"kFSEventStreamEventFlagItemIsSymlink\").ToLocalChecked(), Nan::New<v8::Integer>(kFSEventStreamEventFlagItemIsSymlink));
^
/Users/truongsa/.node-gyp/12.7.0/include/node/v8.h:3365:3: note: 'Set' has been explicitly marked deprecated here
V8_DEPRECATE_SOON(\"Use maybe version\",
^
/Users/truongsa/.node-gyp/12.7.0/include/node/v8config.h:326:29: note: expanded from macro 'V8_DEPRECATE_SOON'
declarator __attribute__((deprecated(message)))
^
../fsevents.cc:85:16: error: variable has incomplete type 'void'
void FSEvents::Initialize(v8::Handle<v8::Object> exports) {
^
../fsevents.cc:85:31: error: no member named 'Handle' in namespace 'v8'
void FSEvents::Initialize(v8::Handle<v8::Object> exports) {
~~~~^
../fsevents.cc:85:48: error: expected '(' for function-style cast or type construction
void FSEvents::Initialize(v8::Handle<v8::Object> exports) {
~~~~~~~~~~^
../fsevents.cc:85:50: error: use of undeclared identifier 'exports'
void FSEvents::Initialize(v8::Handle<v8::Object> exports) {
^
../fsevents.cc:85:58: error: expected ';' after top level declarator
void FSEvents::Initialize(v8::Handle<v8::Object> exports) {
^
;
31 warnings and 9 errors generated.
make: *** [Release/obj.target/fse/fsevents.o] Error 1
gyp ERR! build error
gyp ERR! stack Error: `make` failed with exit code: 2
gyp ERR! stack at ChildProcess.onExit (/Volumes/Works/www/my-app/node_modules/node-gyp/lib/build.js:262:23)
gyp ERR! stack at ChildProcess.emit (events.js:203:13)
gyp ERR! stack at Process.ChildProcess._handle.onexit (internal/child_process.js:272:12)
gyp ERR! System Darwin 18.6.0
gyp ERR! command \"/usr/local/lib/node_modules/node/bin/node\" \"/Volumes/Works/www/my-app/node_modules/node-gyp/bin/node-gyp.js\" \"build\" \"--fallback-to-build\" \"--module=/Volumes/Works/www/my-app/node_modules/fsevents/lib/binding/Release/node-v72-darwin-x64/fse.node\" \"--module_name=fse\" \"--module_path=/Volumes/Works/www/my-app/node_modules/fsevents/lib/binding/Release/node-v72-darwin-x64\" \"--napi_version=4\" \"--node_abi_napi=napi\"
gyp ERR! cwd /Volumes/Works/www/my-app/node_modules/fsevents
gyp ERR! node -v v12.7.0
gyp ERR! node-gyp -v v3.8.0
gyp ERR! not ok
node-pre-gyp ERR! build error
node-pre-gyp ERR! stack Error: Failed to execute '/usr/local/lib/node_modules/node/bin/node /Volumes/Works/www/my-app/node_modules/node-gyp/bin/node-gyp.js build --fallback-to-build --module=/Volumes/Works/www/my-app/node_modules/fsevents/lib/binding/Release/node-v72-darwin-x64/fse.node --module_name=fse --module_path=/Volumes/Works/www/my-app/node_modules/fsevents/lib/binding/Release/node-v72-darwin-x64 --napi_version=4 --node_abi_napi=napi' (1)
node-pre-gyp ERR! stack at ChildProcess.<anonymous> (/Volumes/Works/www/my-app/node_modules/fsevents/node_modules/node-pre-gyp/lib/util/compile.js:83:29)
node-pre-gyp ERR! stack at ChildProcess.emit (events.js:203:13)
node-pre-gyp ERR! stack at maybeClose (internal/child_process.js:1021:16)
node-pre-gyp ERR! stack at Process.ChildProcess._handle.onexit (internal/child_process.js:283:5)
node-pre-gyp ERR! System Darwin 18.6.0
node-pre-gyp ERR! command \"/usr/local/lib/node_modules/node/bin/node\" \"/Volumes/Works/www/my-app/node_modules/fsevents/node_modules/node-pre-gyp/bin/node-pre-gyp\" \"install\" \"--fallback-to-build\"
node-pre-gyp ERR! cwd /Volumes/Works/www/my-app/node_modules/fsevents
node-pre-gyp ERR! node -v v12.7.0
node-pre-gyp ERR! node-pre-gyp -v v0.10.0
node-pre-gyp ERR! not ok
Failed to execute '/usr/local/lib/node_modules/node/bin/node /Volumes/Works/www/my-app/node_modules/node-gyp/bin/node-gyp.js build --fallback-to-build --module=[1/4] ⠠ grpc[2/4] ⠠ node-sass
[-/4] ⠠ waiting...
error /Volumes/Works/www/my-app/node_modules/grpc: Command failed.
Exit code: 1
Command: node-pre-gyp install --fallback-to-build --library=static_library
Arguments:
Directory: /Volumes/Works/www/my-app/node_modules/grpc
Output:
node-pre-gyp info it worked if it ends with ok
node-pre-gyp info using node-pre-gyp@0.12.0
node-pre-gyp info using node@12.7.0 | darwin | x64
node-pre-gyp WARN Using request for node-pre-gyp https download
node-pre-gyp info check checked for "/Volumes/Works/www/my-app/node_modules/grpc/src/node/extension_binary/node-v72-darwin-x64-unknown/grpc_node.node" (not found)
node-pre-gyp http GET https://node-precompiled-binaries.grpc.io/grpc/v1.16.1/node-v72-darwin-x64-unknown.tar.gz
node-pre-gyp http 404 https://node-precompiled-binaries.grpc.io/grpc/v1.16.1/node-v72-darwin-x64-unknown.tar.gz
node-pre-gyp WARN Tried to download(404): https://node-precompiled-binaries.grpc.io/grpc/v1.16.1/node-v72-darwin-x64-unknown.tar.gz
node-pre-gyp WARN Pre-built binaries not found for grpc@1.16.1 and node@12.7.0 (node-v72 ABI, unknown) (falling back to source compile with node-gyp)
node-pre-gyp http 404 status code downloading tarball https://node-precompiled-binaries.grpc.io/grpc/v1.16.1/node-v72-darwin-x64-unknown.tar.gz
gyp info it worked if it ends with ok
gyp info using node-gyp@3.8.0
gyp info using node@12.7.0 | darwin | x64
gyp info ok
gyp info it worked if it ends with ok
gyp info using node-gyp@3.8.0
gyp info using node@12.7.0 | darwin | x64
gyp info spawn /usr/bin/python
gyp info spawn args [
gyp info spawn args '/Volumes/Works/www/my-app/node_modules/node-gyp/gyp/gyp_main.py',
gyp info spawn args 'binding.gyp',
gyp info spawn args '-f',
gyp info spawn args 'make',
gyp info spawn args '-I',
gyp info spawn args '/Volumes/Works/www/my-app/node_modules/grpc/build/config.gypi',
gyp info spawn args '-I',
gyp info spawn args '/Volumes/Works/www/my-app/node_modules/node-gyp/addon.gypi',
gyp info spawn args '-I',
gyp info spawn args '/Users/truongsa/.node-gyp/12.7.0/include/node/common.gypi',
gyp info spawn args '-Dlibrary=shared_library',
gyp info spawn args '-Dvisibility=default',
gyp info spawn args '-Dnode_root_dir=/Users/truongsa/.node-gyp/12.7.0',
gyp info spawn args '-Dnode_gyp_dir=/Volumes/Works/www/my-app/node_modules/node-gyp',
gyp info spawn args '-Dnode_lib_file=/Users/truongsa/.node-gyp/12.7.0/<(target_arch)/node.lib',
gyp info spawn args '-Dmodule_root_dir=/Volumes/Works/www/my-app/node_modules/grpc',
gyp info spawn args '-Dnode_engine=v8',
gyp info spawn args '--depth=.',
gyp info spawn args '--no-parallel',
gyp info spawn args '--generator-output',
gyp info spawn args 'build',
gyp info spawn args '-Goutput_dir=.'
gyp info spawn args ]
gyp info ok
gyp info it worked if it ends with ok
gyp info using node-gyp@3.8.0
gyp info using node@12.7.0 | darwin | x64
gyp info spawn make
gyp info spawn args [ 'BUILDTYPE=Release', '-C', 'build' ]
CXX(target) Release/obj.target/grpc/deps/grpc/src/core/lib/surface/init.o
CXX(target) Release/obj.target/grpc/deps/grpc/src/core/lib/avl/avl.o
CXX(target) Release/obj.target/grpc/deps/grpc/src/core/lib/backoff/backoff.o
CXX(target) Release/obj.target/grpc/deps/grpc/src/core/lib/channel/channel_args.o
CXX(target) Release/obj.target/grpc/deps/grpc/src/core/lib/channel/channel_stack.o
CXX(target) Release/obj.target/grpc/deps/grpc/src/core/lib/channel/channel_stack_builder.o
CXX(target) Release/obj.target/grpc/deps/grpc/src/core/lib/channel/channel_trace.o
CXX(target) Release/obj.target/grpc/deps/grpc/src/core/lib/channel/channelz.o
CXX(target) Release/obj.target/grpc/deps/grpc/src/core/lib/channel/channelz_registry.o
CXX(target) Release/obj.target/grpc/deps/grpc/src/core/lib/channel/connected_channel.o
CXX(target) Release/obj.target/grpc/deps/grpc/src/core/lib/channel/handshaker.o
CXX(target) Release/obj.target/grpc/deps/grpc/src/core/lib/channel/handshaker_factory.o
CXX(target) Release/obj.target/grpc/deps/grpc/src/core/lib/channel/handshaker_registry.o
CXX(target) Release/obj.target/grpc/deps/grpc/src/core/lib/channel/status_util.o
CXX(target) Release/obj.target/grpc/deps/grpc/src/core/lib/compression/compression.o
CXX(target) Release/obj.target/grpc/deps/grpc/src/core/lib/compression/compression_internal.o
CXX(target) Release/obj.target/grpc/deps/grpc/src/core/lib/compression/message_compress.o
CXX(target) Release/obj.target/grpc/deps/grpc/src/core/lib/compression/stream_compression.o
CXX(target) Release/obj.target/grpc/deps/grpc/src/core/lib/compression/stream_compression_gzip.o
CXX(target) Release/obj.target/grpc/deps/grpc/src/core/lib/compression/stream_compression_identity.o
CXX(target) Release/obj.target/grpc/deps/grpc/src/core/lib/debug/stats.o
CXX(target) Release/obj.target/grpc/deps/grpc/src/core/lib/debug/stats_data.o
CXX(target) Release/obj.target/grpc/deps/grpc/src/core/lib/http/format_request.o
CXX(target) Release/obj.target/grpc/deps/grpc/src/core/lib/http/httpcli.o
CXX(target) Release/obj.target/grpc/deps/grpc/src/core/lib/http/parser.o
CXX(target) Release/obj.target/grpc/deps/grpc/src/core/lib/iomgr/buffer_list.o
CXX(target) Release/obj.target/grpc/deps/grpc/src/core/lib/iomgr/call_combiner.o
CXX(target) Release/obj.target/grpc/deps/grpc/src/core/lib/iomgr/combiner.o
CXX(target) Release/obj.target/grpc/deps/grpc/src/core/lib/iomgr/endpoint.o
CXX(target) Release/obj.target/grpc/deps/grpc/src/core/lib/iomgr/endpoint_pair_posix.o
CXX(target) Release/obj.target/grpc/deps/grpc/src/core/lib/iomgr/endpoint_pair_uv.o
CXX(target) Release/obj.target/grpc/deps/grpc/src/core/lib/iomgr/endpoint_pair_windows.o
CXX(target) Release/obj.target/grpc/deps/grpc/src/core/lib/iomgr/error.o
CXX(target) Release/obj.target/grpc/deps/grpc/src/core/lib/iomgr/ev_epoll1_linux.o
CXX(target) Release/obj.target/grpc/deps/grpc/src/core/lib/iomgr/ev_epollex_linux.o
CXX(target) Release/obj.target/grpc/deps/grpc/src/core/lib/iomgr/ev_poll_posix.o
CXX(target) Release/obj.target/grpc/deps/grpc/src/core/lib/iomgr/ev_posix.o
CXX(target) Release/obj.target/grpc/deps/grpc/src/core/lib/iomgr/ev_windows.o
CXX(target) Release/obj.target/grpc/deps/grpc/src/core/lib/iomgr/exec_ctx.o
CXX(target) Release/obj.target/grpc/deps/grpc/src/core/lib/iomgr/executor.o
CXX(target) Release/obj.target/grpc/deps/grpc/src/core/lib/iomgr/fork_posix.o
CXX(target) Release/obj.target/grpc/deps/grpc/src/core/lib/iomgr/fork_windows.o
CXX(target) Release/obj.target/grpc/deps/grpc/src/core/lib/iomgr/gethostname_fallback.o
CXX(target) Release/obj.target/grpc/deps/grpc/src/core/lib/iomgr/gethostname_host_name_max.o
CXX(target) Release/obj.target/grpc/deps/grpc/src/core/lib/iomgr/gethostname_sysconf.o
CXX(target) Release/obj.target/grpc/deps/grpc/src/core/lib/iomgr/internal_errqueue.o
CXX(target) Release/obj.target/grpc/deps/grpc/src/core/lib/iomgr/iocp_windows.o
CXX(target) Release/obj.target/grpc/deps/grpc/src/core/lib/iomgr/iomgr.o
CXX(target) Release/obj.target/grpc/deps/grpc/src/core/lib/iomgr/iomgr_custom.o
CXX(target) Release/obj.target/grpc/deps/grpc/src/core/lib/iomgr/iomgr_internal.o
CXX(target) Release/obj.target/grpc/deps/grpc/src/core/lib/iomgr/iomgr_posix.o
CXX(target) Release/obj.target/grpc/deps/grpc/src/core/lib/iomgr/iomgr_uv.o
CXX(target) Release/obj.target/grpc/deps/grpc/src/core/lib/iomgr/iomgr_windows.o
CXX(target) Release/obj.target/grpc/deps/grpc/src/core/lib/iomgr/is_epollexclusive_available.o
CXX(target) Release/obj.target/grpc/deps/grpc/src/core/lib/iomgr/load_file.o
CXX(target) Release/obj.target/grpc/deps/grpc/src/core/lib/iomgr/lockfree_event.o
CXX(target) Release/obj.target/grpc/deps/grpc/src/core/lib/iomgr/network_status_tracker.o
CXX(target) Release/obj.target/grpc/deps/grpc/src/core/lib/iomgr/polling_entity.o
CXX(target) Release/obj.target/grpc/deps/grpc/src/core/lib/iomgr/pollset.o
CXX(target) Release/obj.target/grpc/deps/grpc/src/core/lib/iomgr/pollset_custom.o
CXX(target) Release/obj.target/grpc/deps/grpc/src/core/lib/iomgr/pollset_set.o
CXX(target) Release/obj.target/grpc/deps/grpc/src/core/lib/iomgr/pollset_set_custom.o
CXX(target) Release/obj.target/grpc/deps/grpc/src/core/lib/iomgr/pollset_set_windows.o
CXX(target) Release/obj.target/grpc/deps/grpc/src/core/lib/iomgr/pollset_uv.o
CXX(target) Release/obj.target/grpc/deps/grpc/src/core/lib/iomgr/pollset_windows.o
CXX(target) Release/obj.target/grpc/deps/grpc/src/core/lib/iomgr/resolve_address.o
CXX(target) Release/obj.target/grpc/deps/grpc/src/core/lib/iomgr/resolve_address_custom.o
CXX(target) Release/obj.target/grpc/deps/grpc/src/core/lib/iomgr/resolve_address_posix.o
CXX(target) Release/obj.target/grpc/deps/grpc/src/core/lib/iomgr/resolve_address_windows.o
CXX(target) Release/obj.target/grpc/deps/grpc/src/core/lib/iomgr/resource_quota.o
CXX(target) Release/obj.target/grpc/deps/grpc/src/core/lib/iomgr/sockaddr_utils.o
CXX(target) Release/obj.target/grpc/deps/grpc/src/core/lib/iomgr/socket_factory_posix.o
CXX(target) Release/obj.target/grpc/deps/grpc/src/core/lib/iomgr/socket_mutator.o
CXX(target) Release/obj.target/grpc/deps/grpc/src/core/lib/iomgr/socket_utils_common_posix.o
CXX(target) Release/obj.target/grpc/deps/grpc/src/core/lib/iomgr/socket_utils_linux.o
CXX(target) Release/obj.target/grpc/deps/grpc/src/core/lib/iomgr/socket_utils_posix.o
CXX(target) Release/obj.target/grpc/deps/grpc/src/core/lib/iomgr/socket_utils_uv.o
CXX(target) Release/obj.target/grpc/deps/grpc/src/core/lib/iomgr/socket_utils_windows.o
CXX(target) Release/obj.target/grpc/deps/grpc/src/core/lib/iomgr/socket_windows.o
CXX(target) Release/obj.target/grpc/deps/grpc/src/core/lib/iomgr/tcp_client.o
CXX(target) Release/obj.target/grpc/deps/grpc/src/core/lib/iomgr/tcp_client_custom.o
CXX(target) Release/obj.target/grpc/deps/grpc/src/core/lib/iomgr/tcp_client_posix.o
CXX(target) Release/obj.target/grpc/deps/grpc/src/core/lib/iomgr/tcp_client_windows.o
CXX(target) Release/obj.target/grpc/deps/grpc/src/core/lib/iomgr/tcp_custom.o
CXX(target) Release/obj.target/grpc/deps/grpc/src/core/lib/iomgr/tcp_posix.o
CXX(target) Release/obj.target/grpc/deps/grpc/src/core/lib/iomgr/tcp_server.o
CXX(target) Release/obj.target/grpc/deps/grpc/src/core/lib/iomgr/tcp_server_custom.o
CXX(target) Release/obj.target/grpc/deps/grpc/src/core/lib/iomgr/tcp_server_posix.o
CXX(target) Release/obj.target/grpc/deps/grpc/src/core/lib/iomgr/tcp_server_utils_posix_common.o
CXX(target) Release/obj.target/grpc/deps/grpc/src/core/lib/iomgr/tcp_server_utils_posix_ifaddrs.o
CXX(target) Release/obj.target/grpc/deps/grpc/src/core/lib/iomgr/tcp_server_utils_posix_noifaddrs.o
CXX(target) Release/obj.target/grpc/deps/grpc/src/core/lib/iomgr/tcp_server_windows.o
CXX(target) Release/obj.target/grpc/deps/grpc/src/core/lib/iomgr/tcp_uv.o
CXX(target) Release/obj.target/grpc/deps/grpc/src/core/lib/iomgr/tcp_windows.o
CXX(target) Release/obj.target/grpc/deps/grpc/src/core/lib/iomgr/time_averaged_stats.o
CXX(target) Release/obj.target/grpc/deps/grpc/src/core/lib/iomgr/timer.o
CXX(target) Release/obj.target/grpc/deps/grpc/src/core/lib/iomgr/timer_custom.o
CXX(target) Release/obj.target/grpc/deps/grpc/src/core/lib/iomgr/timer_generic.o
CXX(target) Release/obj.target/grpc/deps/grpc/src/core/lib/iomgr/timer_heap.o
CXX(target) Release/obj.target/grpc/deps/grpc/src/core/lib/iomgr/timer_manager.o
CXX(target) Release/obj.target/grpc/deps/grpc/src/core/lib/iomgr/timer_uv.o
CXX(target) Release/obj.target/grpc/deps/grpc/src/core/lib/iomgr/udp_server.o
CXX(target) Release/obj.target/grpc/deps/grpc/src/core/lib/iomgr/unix_sockets_posix.o
CXX(target) Release/obj.target/grpc/deps/grpc/src/core/lib/iomgr/unix_sockets_posix_noop.o
CXX(target) Release/obj.target/grpc/deps/grpc/src/core/lib/iomgr/wakeup_fd_cv.o
CXX(target) Release/obj.target/grpc/deps/grpc/src/core/lib/iomgr/wakeup_fd_eventfd.o
CXX(target) Release/obj.target/grpc/deps/grpc/src/core/lib/iomgr/wakeup_fd_nospecial.o
CXX(target) Release/obj.target/grpc/deps/grpc/src/core/lib/iomgr/wakeup_fd_pipe.o
CXX(target) Release/obj.target/grpc/deps/grpc/src/core/lib/iomgr/wakeup_fd_posix.o
CXX(target) Release/obj.target/grpc/deps/grpc/src/core/lib/json/json.o
CXX(target) Release/obj.target/grpc/deps/grpc/src/core/lib/json/json_reader.o
CXX(target) Release/obj.target/grpc/deps/grpc/src/core/lib/json/json_string.o
CXX(target) Release/obj.target/grpc/deps/grpc/src/core/lib/json/json_writer.o
CXX(target) Release/obj.target/grpc/deps/grpc/src/core/lib/slice/b64.o
CXX(target) Release/obj.target/grpc/deps/grpc/src/core/lib/slice/percent_encoding.o
CXX(target) Release/obj.target/grpc/deps/grpc/src/core/lib/slice/slice.o
CXX(target) Release/obj.target/grpc/deps/grpc/src/core/lib/slice/slice_buffer.o
CXX(target) Release/obj.target/grpc/deps/grpc/src/core/lib/slice/slice_intern.o
CXX(target) Release/obj.target/grpc/deps/grpc/src/core/lib/slice/slice_string_helpers.o
CXX(target) Release/obj.target/grpc/deps/grpc/src/core/lib/surface/api_trace.o
CXX(target) Release/obj.target/grpc/deps/grpc/src/core/lib/surface/byte_buffer.o
CXX(target) Release/obj.target/grpc/deps/grpc/src/core/lib/surface/byte_buffer_reader.o
CXX(target) Release/obj.target/grpc/deps/grpc/src/core/lib/surface/call.o
CXX(target) Release/obj.target/grpc/deps/grpc/src/core/lib/surface/call_details.o
CXX(target) Release/obj.target/grpc/deps/grpc/src/core/lib/surface/call_log_batch.o
CXX(target) Release/obj.target/grpc/deps/grpc/src/core/lib/surface/channel.o
CXX(target) Release/obj.target/grpc/deps/grpc/src/core/lib/surface/channel_init.o
CXX(target) Release/obj.target/grpc/deps/grpc/src/core/lib/surface/channel_ping.o
CXX(target) Release/obj.target/grpc/deps/grpc/src/core/lib/surface/channel_stack_type.o
CXX(target) Release/obj.target/grpc/deps/grpc/src/core/lib/surface/completion_queue.o
CXX(target) Release/obj.target/grpc/deps/grpc/src/core/lib/surface/completion_queue_factory.o
CXX(target) Release/obj.target/grpc/deps/grpc/src/core/lib/surface/event_string.o
CXX(target) Release/obj.target/grpc/deps/grpc/src/core/lib/surface/lame_client.o
CXX(target) Release/obj.target/grpc/deps/grpc/src/core/lib/surface/metadata_array.o
CXX(target) Release/obj.target/grpc/deps/grpc/src/core/lib/surface/server.o
CXX(target) Release/obj.target/grpc/deps/grpc/src/core/lib/surface/validate_metadata.o
CXX(target) Release/obj.target/grpc/deps/grpc/src/core/lib/surface/version.o
CXX(target) Release/obj.target/grpc/deps/grpc/src/core/lib/transport/bdp_estimator.o
CXX(target) Release/obj.target/grpc/deps/grpc/src/core/lib/transport/byte_stream.o
CXX(target) Release/obj.target/grpc/deps/grpc/src/core/lib/transport/connectivity_state.o
CXX(target) Release/obj.target/grpc/deps/grpc/src/core/lib/transport/error_utils.o
CXX(target) Release/obj.target/grpc/deps/grpc/src/core/lib/transport/metadata.o
CXX(target) Release/obj.target/grpc/deps/grpc/src/core/lib/transport/metadata_batch.o
CXX(target) Release/obj.target/grpc/deps/grpc/src/core/lib/transport/pid_controller.o
CXX(target) Release/obj.target/grpc/deps/grpc/src/core/lib/transport/service_config.o
CXX(target) Release/obj.target/grpc/deps/grpc/src/core/lib/transport/static_metadata.o
CXX(target) Release/obj.target/grpc/deps/grpc/src/core/lib/transport/status_conversion.o
CXX(target) Release/obj.target/grpc/deps/grpc/src/core/lib/transport/status_metadata.o
CXX(target) Release/obj.target/grpc/deps/grpc/src/core/lib/transport/timeout_encoding.o
CXX(target) Release/obj.target/grpc/deps/grpc/src/core/lib/transport/transport.o
CXX(target) Release/obj.target/grpc/deps/grpc/src/core/lib/transport/transport_op_string.o
CXX(target) Release/obj.target/grpc/deps/grpc/src/core/lib/debug/trace.o
CXX(target) Release/obj.target/grpc/deps/grpc/src/core/ext/transport/chttp2/server/secure/server_secure_chttp2.o
CXX(target) Release/obj.target/grpc/deps/grpc/src/core/ext/transport/chttp2/transport/bin_decoder.o
CXX(target) Release/obj.target/grpc/deps/grpc/src/core/ext/transport/chttp2/transport/bin_encoder.o
CXX(target) Release/obj.target/grpc/deps/grpc/src/core/ext/transport/chttp2/transport/chttp2_plugin.o
CXX(target) Release/obj.target/grpc/deps/grpc/src/core/ext/transport/chttp2/transport/chttp2_transport.o
CXX(target) Release/obj.target/grpc/deps/grpc/src/core/ext/transport/chttp2/transport/flow_control.o
CXX(target) Release/obj.target/grpc/deps/grpc/src/core/ext/transport/chttp2/transport/frame_data.o
CXX(target) Release/obj.target/grpc/deps/grpc/src/core/ext/transport/chttp2/transport/frame_goaway.o
CXX(target) Release/obj.target/grpc/deps/grpc/src/core/ext/transport/chttp2/transport/frame_ping.o
CXX(target) Release/obj.target/grpc/deps/grpc/src/core/ext/transport/chttp2/transport/frame_rst_stream.o
CXX(target) Release/obj.target/grpc/deps/grpc/src/core/ext/transport/chttp2/transport/frame_settings.o
CXX(target) Release/obj.target/grpc/deps/grpc/src/core/ext/transport/chttp2/transport/frame_window_update.o
CXX(target) Release/obj.target/grpc/deps/grpc/src/core/ext/transport/chttp2/transport/hpack_encoder.o
CXX(target) Release/obj.target/grpc/deps/grpc/src/core/ext/transport/chttp2/transport/hpack_parser.o
CXX(target) Release/obj.target/grpc/deps/grpc/src/core/ext/transport/chttp2/transport/hpack_table.o
CXX(target) Release/obj.target/grpc/deps/grpc/src/core/ext/transport/chttp2/transport/http2_settings.o
CXX(target) Release/obj.target/grpc/deps/grpc/src/core/ext/transport/chttp2/transport/huffsyms.o
CXX(target) Release/obj.target/grpc/deps/grpc/src/core/ext/transport/chttp2/transport/incoming_metadata.o
CXX(target) Release/obj.target/grpc/deps/grpc/src/core/ext/transport/chttp2/transport/parsing.o
CXX(target) Release/obj.target/grpc/deps/grpc/src/core/ext/transport/chttp2/transport/stream_lists.o
CXX(target) Release/obj.target/grpc/deps/grpc/src/core/ext/transport/chttp2/transport/stream_map.o
CXX(target) Release/obj.target/grpc/deps/grpc/src/core/ext/transport/chttp2/transport/varint.o
CXX(target) Release/obj.target/grpc/deps/grpc/src/core/ext/transport/chttp2/transport/writing.o
CXX(target) Release/obj.target/grpc/deps/grpc/src/core/ext/transport/chttp2/alpn/alpn.o
CXX(target) Release/obj.target/grpc/deps/grpc/src/core/ext/filters/http/client/http_client_filter.o
CXX(target) Release/obj.target/grpc/deps/grpc/src/core/ext/filters/http/http_filters_plugin.o
CXX(target) Release/obj.target/grpc/deps/grpc/src/core/ext/filters/http/message_compress/message_compress_filter.o
CXX(target) Release/obj.target/grpc/deps/grpc/src/core/ext/filters/http/server/http_server_filter.o
CXX(target) Release/obj.target/grpc/deps/grpc/src/core/lib/http/httpcli_security_connector.o
CXX(target) Release/obj.target/grpc/deps/grpc/src/core/lib/security/context/security_context.o
CXX(target) Release/obj.target/grpc/deps/grpc/src/core/lib/security/credentials/alts/alts_credentials.o
CXX(target) Release/obj.target/grpc/deps/grpc/src/core/lib/security/credentials/composite/composite_credentials.o
CXX(target) Release/obj.target/grpc/deps/grpc/src/core/lib/security/credentials/credentials.o
CXX(target) Release/obj.target/grpc/deps/grpc/src/core/lib/security/credentials/credentials_metadata.o
CXX(target) Release/obj.target/grpc/deps/grpc/src/core/lib/security/credentials/fake/fake_credentials.o
CXX(target) Release/obj.target/grpc/deps/grpc/src/core/lib/security/credentials/google_default/credentials_generic.o
CXX(target) Release/obj.target/grpc/deps/grpc/src/core/lib/security/credentials/google_default/google_default_credentials.o
CXX(target) Release/obj.target/grpc/deps/grpc/src/core/lib/security/credentials/iam/iam_credentials.o
CXX(target) Release/obj.target/grpc/deps/grpc/src/core/lib/security/credentials/jwt/json_token.o
CXX(target) Release/obj.target/grpc/deps/grpc/src/core/lib/security/credentials/jwt/jwt_credentials.o
CXX(target) Release/obj.target/grpc/deps/grpc/src/core/lib/security/credentials/jwt/jwt_verifier.o
CXX(target) Release/obj.target/grpc/deps/grpc/src/core/lib/security/credentials/local/local_credentials.o
CXX(target) Release/obj.target/grpc/deps/grpc/src/core/lib/security/credentials/oauth2/oauth2_credentials.o
CXX(target) Release/obj.target/grpc/deps/grpc/src/core/lib/security/credentials/plugin/plugin_credentials.o
CXX(target) Release/obj.target/grpc/deps/grpc/src/core/lib/security/credentials/ssl/ssl_credentials.o
CXX(target) Release/obj.target/grpc/deps/grpc/src/core/lib/security/security_connector/alts_security_connector.o
CXX(target) Release/obj.target/grpc/deps/grpc/src/core/lib/security/security_connector/load_system_roots_fallback.o
CXX(target) Release/obj.target/grpc/deps/grpc/src/core/lib/security/security_connector/load_system_roots_linux.o
CXX(target) Release/obj.target/grpc/deps/grpc/src/core/lib/security/security_connector/local_security_connector.o
CXX(target) Release/obj.target/grpc/deps/grpc/src/core/lib/security/security_connector/security_connector.o
CXX(target) Release/obj.target/grpc/deps/grpc/src/core/lib/security/transport/client_auth_filter.o
CXX(target) Release/obj.target/grpc/deps/grpc/src/core/lib/security/transport/secure_endpoint.o
CXX(target) Release/obj.target/grpc/deps/grpc/src/core/lib/security/transport/security_handshaker.o
CXX(target) Release/obj.target/grpc/deps/grpc/src/core/lib/security/transport/server_auth_filter.o
CXX(target) Release/obj.target/grpc/deps/grpc/src/core/lib/security/transport/target_authority_table.o
CXX(target) Release/obj.target/grpc/deps/grpc/src/core/lib/security/transport/tsi_error.o
CXX(target) Release/obj.target/grpc/deps/grpc/src/core/lib/security/util/json_util.o
CXX(target) Release/obj.target/grpc/deps/grpc/src/core/lib/surface/init_secure.o
CXX(target) Release/obj.target/grpc/deps/grpc/src/core/tsi/alts/crypt/aes_gcm.o
CXX(target) Release/obj.target/grpc/deps/grpc/src/core/tsi/alts/crypt/gsec.o
CXX(target) Release/obj.target/grpc/deps/grpc/src/core/tsi/alts/frame_protector/alts_counter.o
CXX(target) Release/obj.target/grpc/deps/grpc/src/core/tsi/alts/frame_protector/alts_crypter.o
CXX(target) Release/obj.target/grpc/deps/grpc/src/core/tsi/alts/frame_protector/alts_frame_protector.o
CXX(target) Release/obj.target/grpc/deps/grpc/src/core/tsi/alts/frame_protector/alts_record_protocol_crypter_common.o
CXX(target) Release/obj.target/grpc/deps/grpc/src/core/tsi/alts/frame_protector/alts_seal_privacy_integrity_crypter.o
CXX(target) Release/obj.target/grpc/deps/grpc/src/core/tsi/alts/frame_protector/alts_unseal_privacy_integrity_crypter.o
CXX(target) Release/obj.target/grpc/deps/grpc/src/core/tsi/alts/frame_protector/frame_handler.o
CXX(target) Release/obj.target/grpc/deps/grpc/src/core/tsi/alts/handshaker/alts_handshaker_client.o
CXX(target) Release/obj.target/grpc/deps/grpc/src/core/tsi/alts/handshaker/alts_tsi_event.o
CXX(target) Release/obj.target/grpc/deps/grpc/src/core/tsi/alts/handshaker/alts_tsi_handshaker.o
CXX(target) Release/obj.target/grpc/deps/grpc/src/core/tsi/alts/zero_copy_frame_protector/alts_grpc_integrity_only_record_protocol.o
CXX(target) Release/obj.target/grpc/deps/grpc/src/core/tsi/alts/zero_copy_frame_protector/alts_grpc_privacy_integrity_record_protocol.o
CXX(target) Release/obj.target/grpc/deps/grpc/src/core/tsi/alts/zero_copy_frame_protector/alts_grpc_record_protocol_common.o
CXX(target) Release/obj.target/grpc/deps/grpc/src/core/tsi/alts/zero_copy_frame_protector/alts_iovec_record_protocol.o
CXX(target) Release/obj.target/grpc/deps/grpc/src/core/tsi/alts/zero_copy_frame_protector/alts_zero_copy_grpc_protector.o
CXX(target) Release/obj.target/grpc/deps/grpc/src/core/lib/security/credentials/alts/check_gcp_environment.o
CXX(target) Release/obj.target/grpc/deps/grpc/src/core/lib/security/credentials/alts/check_gcp_environment_linux.o
CXX(target) Release/obj.target/grpc/deps/grpc/src/core/lib/security/credentials/alts/check_gcp_environment_no_op.o
CXX(target) Release/obj.target/grpc/deps/grpc/src/core/lib/security/credentials/alts/check_gcp_environment_windows.o
CXX(target) Release/obj.target/grpc/deps/grpc/src/core/lib/security/credentials/alts/grpc_alts_credentials_client_options.o
CXX(target) Release/obj.target/grpc/deps/grpc/src/core/lib/security/credentials/alts/grpc_alts_credentials_options.o
CXX(target) Release/obj.target/grpc/deps/grpc/src/core/lib/security/credentials/alts/grpc_alts_credentials_server_options.o
CXX(target) Release/obj.target/grpc/deps/grpc/src/core/tsi/alts/handshaker/alts_handshaker_service_api.o
CXX(target) Release/obj.target/grpc/deps/grpc/src/core/tsi/alts/handshaker/alts_handshaker_service_api_util.o
CXX(target) Release/obj.target/grpc/deps/grpc/src/core/tsi/alts/handshaker/alts_tsi_utils.o
CXX(target) Release/obj.target/grpc/deps/grpc/src/core/tsi/alts/handshaker/transport_security_common_api.o
CC(target) Release/obj.target/grpc/deps/grpc/src/core/tsi/alts/handshaker/altscontext.pb.o
CC(target) Release/obj.target/grpc/deps/grpc/src/core/tsi/alts/handshaker/handshaker.pb.o
CC(target) Release/obj.target/grpc/deps/grpc/src/core/tsi/alts/handshaker/transport_security_common.pb.o
CC(target) Release/obj.target/grpc/deps/grpc/third_party/nanopb/pb_common.o
CC(target) Release/obj.target/grpc/deps/grpc/third_party/nanopb/pb_decode.o
CC(target) Release/obj.target/grpc/deps/grpc/third_party/nanopb/pb_encode.o
CXX(target) Release/obj.target/grpc/deps/grpc/src/core/tsi/transport_security.o
CXX(target) Release/obj.target/grpc/deps/grpc/src/core/ext/transport/chttp2/client/insecure/channel_create.o
CXX(target) Release/obj.target/grpc/deps/grpc/src/core/ext/transport/chttp2/client/insecure/channel_create_posix.o
CXX(target) Release/obj.target/grpc/deps/grpc/src/core/ext/transport/chttp2/client/authority.o
CXX(target) Release/obj.target/grpc/deps/grpc/src/core/ext/transport/chttp2/client/chttp2_connector.o
CXX(target) Release/obj.target/grpc/deps/grpc/src/core/ext/filters/client_channel/backup_poller.o
CXX(target) Release/obj.target/grpc/deps/grpc/src/core/ext/filters/client_channel/channel_connectivity.o
CXX(target) Release/obj.target/grpc/deps/grpc/src/core/ext/filters/client_channel/client_channel.o
CXX(target) Release/obj.target/grpc/deps/grpc/src/core/ext/filters/client_channel/client_channel_channelz.o
CXX(target) Release/obj.target/grpc/deps/grpc/src/core/ext/filters/client_channel/client_channel_factory.o
CXX(target) Release/obj.target/grpc/deps/grpc/src/core/ext/filters/client_channel/client_channel_plugin.o
CXX(target) Release/obj.target/grpc/deps/grpc/src/core/ext/filters/client_channel/connector.o
CXX(target) Release/obj.target/grpc/deps/grpc/src/core/ext/filters/client_channel/http_connect_handshaker.o
CXX(target) Release/obj.target/grpc/deps/grpc/src/core/ext/filters/client_channel/http_proxy.o
CXX(target) Release/obj.target/grpc/deps/grpc/src/core/ext/filters/client_channel/lb_policy.o
CXX(target) Release/obj.target/grpc/deps/grpc/src/core/ext/filters/client_channel/lb_policy_factory.o
CXX(target) Release/obj.target/grpc/deps/grpc/src/core/ext/filters/client_channel/lb_policy_registry.o
CXX(target) Release/obj.target/grpc/deps/grpc/src/core/ext/filters/client_channel/method_params.o
CXX(target) Release/obj.target/grpc/deps/grpc/src/core/ext/filters/client_channel/parse_address.o
CXX(target) Release/obj.target/grpc/deps/grpc/src/core/ext/filters/client_channel/proxy_mapper.o
CXX(target) Release/obj.target/grpc/deps/grpc/src/core/ext/filters/client_channel/proxy_mapper_registry.o
CXX(target) Release/obj.target/grpc/deps/grpc/src/core/ext/filters/client_channel/resolver.o
CXX(target) Release/obj.target/grpc/deps/grpc/src/core/ext/filters/client_channel/resolver_registry.o
CXX(target) Release/obj.target/grpc/deps/grpc/src/core/ext/filters/client_channel/retry_throttle.o
CXX(target) Release/obj.target/grpc/deps/grpc/src/core/ext/filters/client_channel/subchannel.o
CXX(target) Release/obj.target/grpc/deps/grpc/src/core/ext/filters/client_channel/subchannel_index.o
CXX(target) Release/obj.target/grpc/deps/grpc/src/core/ext/filters/client_channel/uri_parser.o
CXX(target) Release/obj.target/grpc/deps/grpc/src/core/ext/filters/deadline/deadline_filter.o
CXX(target) Release/obj.target/grpc/deps/grpc/src/core/tsi/alts_transport_security.o
CXX(target) Release/obj.target/grpc/deps/grpc/src/core/tsi/fake_transport_security.o
CXX(target) Release/obj.target/grpc/deps/grpc/src/core/tsi/local_transport_security.o
CXX(target) Release/obj.target/grpc/deps/grpc/src/core/tsi/ssl/session_cache/ssl_session_boringssl.o
CXX(target) Release/obj.target/grpc/deps/grpc/src/core/tsi/ssl/session_cache/ssl_session_cache.o
CXX(target) Release/obj.target/grpc/deps/grpc/src/core/tsi/ssl/session_cache/ssl_session_openssl.o
CXX(target) Release/obj.target/grpc/deps/grpc/src/core/tsi/ssl_transport_security.o
CXX(target) Release/obj.target/grpc/deps/grpc/src/core/tsi/transport_security_grpc.o
CXX(target) Release/obj.target/grpc/deps/grpc/src/core/ext/transport/chttp2/server/chttp2_server.o
CXX(target) Release/obj.target/grpc/deps/grpc/src/core/ext/transport/chttp2/client/secure/secure_channel_create.o
CXX(target) Release/obj.target/grpc/deps/grpc/src/core/ext/transport/chttp2/server/insecure/server_chttp2.o
CXX(target) Release/obj.target/grpc/deps/grpc/src/core/ext/transport/chttp2/server/insecure/server_chttp2_posix.o
CXX(target) Release/obj.target/grpc/deps/grpc/src/core/ext/transport/inproc/inproc_plugin.o
CXX(target) Release/obj.target/grpc/deps/grpc/src/core/ext/transport/inproc/inproc_transport.o
CXX(target) Release/obj.target/grpc/deps/grpc/src/core/ext/filters/client_channel/lb_policy/grpclb/client_load_reporting_filter.o
CXX(target) Release/obj.target/grpc/deps/grpc/src/core/ext/filters/client_channel/lb_policy/grpclb/grpclb.o
CXX(target) Release/obj.target/grpc/deps/grpc/src/core/ext/filters/client_channel/lb_policy/grpclb/grpclb_channel_secure.o
CXX(target) Release/obj.target/grpc/deps/grpc/src/core/ext/filters/client_channel/lb_policy/grpclb/grpclb_client_stats.o
CXX(target) Release/obj.target/grpc/deps/grpc/src/core/ext/filters/client_channel/lb_policy/grpclb/load_balancer_api.o
CC(target) Release/obj.target/grpc/deps/grpc/src/core/ext/filters/client_channel/lb_policy/grpclb/proto/grpc/lb/v1/google/protobuf/duration.pb.o
CC(target) Release/obj.target/grpc/deps/grpc/src/core/ext/filters/client_channel/lb_policy/grpclb/proto/grpc/lb/v1/google/protobuf/timestamp.pb.o
CC(target) Release/obj.target/grpc/deps/grpc/src/core/ext/filters/client_channel/lb_policy/grpclb/proto/grpc/lb/v1/load_balancer.pb.o
CXX(target) Release/obj.target/grpc/deps/grpc/src/core/ext/filters/client_channel/resolver/fake/fake_resolver.o
CXX(target) Release/obj.target/grpc/deps/grpc/src/core/ext/filters/client_channel/lb_policy/pick_first/pick_first.o
CXX(target) Release/obj.target/grpc/deps/grpc/src/core/ext/filters/client_channel/lb_policy/round_robin/round_robin.o
CXX(target) Release/obj.target/grpc/deps/grpc/src/core/ext/filters/client_channel/resolver/dns/c_ares/dns_resolver_ares.o
CXX(target) Release/obj.target/grpc/deps/grpc/src/core/ext/filters/client_channel/resolver/dns/c_ares/grpc_ares_ev_driver.o
CXX(target) Release/obj.target/grpc/deps/grpc/src/core/ext/filters/client_channel/resolver/dns/c_ares/grpc_ares_ev_driver_posix.o
CXX(target) Release/obj.target/grpc/deps/grpc/src/core/ext/filters/client_channel/resolver/dns/c_ares/grpc_ares_ev_driver_windows.o
CXX(target) Release/obj.target/grpc/deps/grpc/src/core/ext/filters/client_channel/resolver/dns/c_ares/grpc_ares_wrapper.o
CXX(target) Release/obj.target/grpc/deps/grpc/src/core/ext/filters/client_channel/resolver/dns/c_ares/grpc_ares_wrapper_fallback.o
CXX(target) Release/obj.target/grpc/deps/grpc/src/core/ext/filters/client_channel/resolver/dns/c_ares/grpc_ares_wrapper_posix.o
CXX(target) Release/obj.target/grpc/deps/grpc/src/core/ext/filters/client_channel/resolver/dns/c_ares/grpc_ares_wrapper_windows.o
CXX(target) Release/obj.target/grpc/deps/grpc/src/core/ext/filters/client_channel/resolver/dns/native/dns_resolver.o
CXX(target) Release/obj.target/grpc/deps/grpc/src/core/ext/filters/client_channel/resolver/sockaddr/sockaddr_resolver.o
CXX(target) Release/obj.target/grpc/deps/grpc/src/core/ext/filters/census/grpc_context.o
CXX(target) Release/obj.target/grpc/deps/grpc/src/core/ext/filters/max_age/max_age_filter.o
CXX(target) Release/obj.target/grpc/deps/grpc/src/core/ext/filters/message_size/message_size_filter.o
CXX(target) Release/obj.target/grpc/deps/grpc/src/core/ext/filters/http/client_authority_filter.o
CXX(target) Release/obj.target/grpc/deps/grpc/src/core/ext/filters/workarounds/workaround_cronet_compression_filter.o
CXX(target) Release/obj.target/grpc/deps/grpc/src/core/ext/filters/workarounds/workaround_utils.o
CXX(target) Release/obj.target/grpc/deps/grpc/src/core/plugin_registry/grpc_plugin_registry.o
LIBTOOL-STATIC Release/libgrpc.a
CXX(target) Release/obj.target/gpr/deps/grpc/src/core/lib/gpr/alloc.o
CXX(target) Release/obj.target/gpr/deps/grpc/src/core/lib/gpr/arena.o
CXX(target) Release/obj.target/gpr/deps/grpc/src/core/lib/gpr/atm.o
CXX(target) Release/obj.target/gpr/deps/grpc/src/core/lib/gpr/cpu_iphone.o
CXX(target) Release/obj.target/gpr/deps/grpc/src/core/lib/gpr/cpu_linux.o
CXX(target) Release/obj.target/gpr/deps/grpc/src/core/lib/gpr/cpu_posix.o
CXX(target) Release/obj.target/gpr/deps/grpc/src/core/lib/gpr/cpu_windows.o
CXX(target) Release/obj.target/gpr/deps/grpc/src/core/lib/gpr/env_linux.o
CXX(target) Release/obj.target/gpr/deps/grpc/src/core/lib/gpr/env_posix.o
CXX(target) Release/obj.target/gpr/deps/grpc/src/core/lib/gpr/env_windows.o
CXX(target) Release/obj.target/gpr/deps/grpc/src/core/lib/gpr/host_port.o
CXX(target) Release/obj.target/gpr/deps/grpc/src/core/lib/gpr/log.o
CXX(target) Release/obj.target/gpr/deps/grpc/src/core/lib/gpr/log_android.o
CXX(target) Release/obj.target/gpr/deps/grpc/src/core/lib/gpr/log_linux.o
CXX(target) Release/obj.target/gpr/deps/grpc/src/core/lib/gpr/log_posix.o
CXX(target) Release/obj.target/gpr/deps/grpc/src/core/lib/gpr/log_windows.o
CXX(target) Release/obj.target/gpr/deps/grpc/src/core/lib/gpr/mpscq.o
CXX(target) Release/obj.target/gpr/deps/grpc/src/core/lib/gpr/murmur_hash.o
CXX(target) Release/obj.target/gpr/deps/grpc/src/core/lib/gpr/string.o
CXX(target) Release/obj.target/gpr/deps/grpc/src/core/lib/gpr/string_posix.o
CXX(target) Release/obj.target/gpr/deps/grpc/src/core/lib/gpr/string_util_windows.o
CXX(target) Release/obj.target/gpr/deps/grpc/src/core/lib/gpr/string_windows.o
CXX(target) Release/obj.target/gpr/deps/grpc/src/core/lib/gpr/sync.o
CXX(target) Release/obj.target/gpr/deps/grpc/src/core/lib/gpr/sync_posix.o
CXX(target) Release/obj.target/gpr/deps/grpc/src/core/lib/gpr/sync_windows.o
CXX(target) Release/obj.target/gpr/deps/grpc/src/core/lib/gpr/time.o
CXX(target) Release/obj.target/gpr/deps/grpc/src/core/lib/gpr/time_posix.o
CXX(target) Release/obj.target/gpr/deps/grpc/src/core/lib/gpr/time_precise.o
CXX(target) Release/obj.target/gpr/deps/grpc/src/core/lib/gpr/time_windows.o
CXX(target) Release/obj.target/gpr/deps/grpc/src/core/lib/gpr/tls_pthread.o
CXX(target) Release/obj.target/gpr/deps/grpc/src/core/lib/gpr/tmpfile_msys.o
CXX(target) Release/obj.target/gpr/deps/grpc/src/core/lib/gpr/tmpfile_posix.o
CXX(target) Release/obj.target/gpr/deps/grpc/src/core/lib/gpr/tmpfile_windows.o
CXX(target) Release/obj.target/gpr/deps/grpc/src/core/lib/gpr/wrap_memcpy.o
CXX(target) Release/obj.target/gpr/deps/grpc/src/core/lib/gprpp/fork.o
CXX(target) Release/obj.target/gpr/deps/grpc/src/core/lib/gprpp/thd_posix.o
CXX(target) Release/obj.target/gpr/deps/grpc/src/core/lib/gprpp/thd_windows.o
CXX(target) Release/obj.target/gpr/deps/grpc/src/core/lib/profiling/basic_timers.o
CXX(target) Release/obj.target/gpr/deps/grpc/src/core/lib/profiling/stap_timers.o
LIBTOOL-STATIC Release/libgpr.a
CXX(target) Release/obj.target/grpc_node/ext/byte_buffer.o
In file included from ../ext/byte_buffer.cc:21:
In file included from ../../nan/nan.h:222:
In file included from ../../nan/nan_new.h:189:
../../nan/nan_implementation_12_inl.h:103:42: error: no viable conversion from 'v8::Isolate *' to 'Local<v8::Context>'
return scope.Escape(v8::Function::New( isolate
^~~~~~~
/Users/truongsa/.node-gyp/12.7.0/include/node/v8.h:183:7: note: candidate constructor (the implicit copy constructor) not viable: no known conversion from 'v8::Isolate *' to 'const v8::Local<v8::Context> &' for 1st argument
class Local {
^
/Users/truongsa/.node-gyp/12.7.0/include/node/v8.h:183:7: note: candidate constructor (the implicit move constructor) not viable: no known conversion from 'v8::Isolate *' to 'v8::Local<v8::Context> &&' for 1st argument
/Users/truongsa/.node-gyp/12.7.0/include/node/v8.h:187:13: note: candidate template ignored: could not match 'Local<type-parameter-0-0>' against 'v8::Isolate *'
V8_INLINE Local(Local<S> that)
^
/Users/truongsa/.node-gyp/12.7.0/include/node/v8.h:4133:22: note: passing argument to parameter 'context' here
Local<Context> context, FunctionCallback callback,
^
1 error generated.
make: *** [Release/obj.target/grpc_node/ext/byte_buffer.o] Error 1
gyp ERR! build error
gyp ERR! stack Error: `make` failed with exit code: 2
gyp ERR! stack at ChildProcess.onExit (/Volumes/Works/www/my-app/node_modules/node-gyp/lib/build.js:262:23)
gyp ERR! stack at ChildProcess.emit (events.js:203:13)
gyp ERR! stack at Process.ChildProcess._handle.onexit (internal/child_process.js:272:12)
gyp ERR! System Darwin 18.6.0
gyp ERR! command "/usr/local/lib/node_modules/node/bin/node" "/Volumes/Works/www/my-app/node_modules/node-gyp/bin/node-gyp.js" "build" "--fallback-to-build" "--library=static_library" "--module=/Volumes/Works/www/my-app/node_modules/grpc/src/node/extension_binary/node-v72-darwin-x64-unknown/grpc_node.node" "--module_name=grpc_node" "--module_path=/Volumes/Works/www/my-app/node_modules/grpc/src/node/extension_binary/node-v72-darwin-x64-unknown" "--napi_version=4" "--node_abi_napi=napi" "--napi_build_version=0" "--node_napi_label=node-v72"
gyp ERR! cwd /Volumes/Works/www/my-app/node_modules/grpc
gyp ERR! node -v v12.7.0
gyp ERR! node-gyp -v v3.8.0
gyp ERR! not ok
node-pre-gyp ERR! build error
node-pre-gyp ERR! stack Error: Failed to execute '/usr/local/lib/node_modules/node/bin/node /Volumes/Works/www/my-app/node_modules/node-gyp/bin/node-gyp.js build --fallback-to-build --library=static_library --module=/Volumes/Works/www/my-app/node_modules/grpc/src/node/extension_binary/node-v72-darwin-x64-unknown/grpc_node.node --module_name=grpc_node --module_path=/Volumes/Works/www/my-app/node_modules/grpc/src/node/extension_binary/node-v72-darwin-x64-unknown --napi_version=4 --node_abi_napi=napi --napi_build_version=0 --node_napi_label=node-v72' (1)
node-pre-gyp ERR! stack at ChildProcess.<anonymous> (/Volumes/Works/www/my-app/node_modules/grpc/node_modules/node-pre-gyp/lib/util/compile.js:83:29)
node-pre-gyp ERR! stack at ChildProcess.emit (events.js:203:13)
node-pre-gyp ERR! stack at maybeClose (internal/child_process.js:1021:16)
node-pre-gyp ERR! stack at Process.ChildProcess._handle.onexit (internal/child_process.js:283:5)
node-pre-gyp ERR! System Darwin 18.6.0
node-pre-gyp ERR! command "/usr/local/lib/node_modules/node/bin/node" "/Volumes/Works/www/my-app/node_modules/grpc/node_modules/.bin/node-pre-gyp" "install" "--fallback-to-build" "--library=static_library"
node-pre-gyp ERR! cwd /Volumes/Works/www/my-app/node_modules/grpc
node-pre-gyp ERR! node -v v12.7.0
node-pre-gyp ERR! node-pre-gyp -v v0.12.0
node-pre-gyp ERR! not ok
Failed to execute '/usr/local/lib/node_modules/node/bin/node /Volumes/Works/www/my-app/node_modules/node-gyp/bin/node-gyp.js build --fallback-to-build --library=static_library --module=/Volumes/Works/www/my-app/node_modules/grpc/src/node/extension_binary/node-v72-darwin-x64-unknown/grpc_node.node --module_name=grpc_no
Sign up for free to join this conversation on GitHub. Already have an account? Sign in to comment