Skip to content

Instantly share code, notes, and snippets.

Embed
What would you like to do?
➜ team-unknown git:(master) jitsu deploy
info: Welcome to Nodejitsu nko3-team-unknown
info: jitsu v0.11.3, node v0.8.14
info: It worked if it ends with Nodejitsu ok
info: Executing command deploy
info: Analyzing application dependencies in node server.js
info: Creating snapshot 0.0.4
info Uploading: [=============================] 100%
error: Error running command deploy
error: Nodejitsu Error (500): Internal Server Error
error: npm http GET http://nj-npm.irisnpm.com/express/3.0.0rc4
npm http GET http://nj-npm.irisnpm.com/http-proxy
npm http GET http://nj-npm.irisnpm.com/mongolian
npm http GET http://nj-npm.irisnpm.com/optimist
npm http GET http://nj-npm.irisnpm.com/hashlib
npm http GET http://nj-npm.irisnpm.com/redis
npm http GET http://nj-npm.irisnpm.com/jade
npm http GET http://nj-npm.irisnpm.com/axon
npm http GET http://nj-npm.irisnpm.com/ws
npm http 200 http://nj-npm.irisnpm.com/mongolian
npm http 200 http://nj-npm.irisnpm.com/hashlib
npm http 200 http://nj-npm.irisnpm.com/optimist
npm http GET http://nj-npm.irisnpm.com/mongolian/-/mongolian-0.1.18.tgz
npm http GET http://nj-npm.irisnpm.com/hashlib/-/hashlib-1.0.1.tgz
npm http GET http://nj-npm.irisnpm.com/optimist/-/optimist-0.3.5.tgz
npm http 200 http://nj-npm.irisnpm.com/http-proxy
npm http 200 http://nj-npm.irisnpm.com/express/3.0.0rc4
npm http GET http://nj-npm.irisnpm.com/http-proxy/-/http-proxy-0.8.4.tgz
npm http GET http://nj-npm.irisnpm.com/express/-/express-3.0.0rc4.tgz
npm http 200 http://nj-npm.irisnpm.com/redis
npm http 200 http://nj-npm.irisnpm.com/axon
npm http 200 http://nj-npm.irisnpm.com/jade
npm http GET http://nj-npm.irisnpm.com/axon/-/axon-0.4.5.tgz
npm http GET http://nj-npm.irisnpm.com/redis/-/redis-0.8.2.tgz
npm http GET http://nj-npm.irisnpm.com/jade/-/jade-0.27.7.tgz
npm http 200 http://nj-npm.irisnpm.com/mongolian/-/mongolian-0.1.18.tgz
npm http 200 http://nj-npm.irisnpm.com/hashlib/-/hashlib-1.0.1.tgz
npm http 200 http://nj-npm.irisnpm.com/ws
npm http GET http://nj-npm.irisnpm.com/ws/-/ws-0.4.22.tgz
npm http 200 http://nj-npm.irisnpm.com/http-proxy/-/http-proxy-0.8.4.tgz
npm http 200 http://nj-npm.irisnpm.com/optimist/-/optimist-0.3.5.tgz
npm http 200 http://nj-npm.irisnpm.com/express/-/express-3.0.0rc4.tgz
npm http 200 http://nj-npm.irisnpm.com/axon/-/axon-0.4.5.tgz
npm http 200 http://nj-npm.irisnpm.com/redis/-/redis-0.8.2.tgz
npm http 200 http://nj-npm.irisnpm.com/jade/-/jade-0.27.7.tgz
npm http 200 http://nj-npm.irisnpm.com/ws/-/ws-0.4.22.tgz
npm http GET http://nj-npm.irisnpm.com/debug
npm http GET http://nj-npm.irisnpm.com/configurable/0.0.1
npm http GET http://nj-npm.irisnpm.com/wordwrap
npm http GET http://nj-npm.irisnpm.com/connect/2.4.4
npm http GET http://nj-npm.irisnpm.com/commander/0.6.1
npm http GET http://nj-npm.irisnpm.com/buffalo/0.1.3
npm http GET http://nj-npm.irisnpm.com/waiter/0.1.1
npm http GET http://nj-npm.irisnpm.com/escape-regexp/0.0.1
npm http GET http://nj-npm.irisnpm.com/range-parser/0.0.4
npm http GET http://nj-npm.irisnpm.com/taxman/0.1.1
npm http GET http://nj-npm.irisnpm.com/mkdirp/0.3.3
npm http GET http://nj-npm.irisnpm.com/cookie/0.0.4
npm http GET http://nj-npm.irisnpm.com/crc/0.2.0
npm http GET http://nj-npm.irisnpm.com/fresh/0.1.0
npm http GET http://nj-npm.irisnpm.com/methods/0.0.1
npm http GET http://nj-npm.irisnpm.com/send/0.0.4
npm http GET http://nj-npm.irisnpm.com/mkdirp
npm http GET http://nj-npm.irisnpm.com/coffee-script
npm http GET http://nj-npm.irisnpm.com/commander
npm http GET http://nj-npm.irisnpm.com/tinycolor
npm http GET http://nj-npm.irisnpm.com/options
npm http GET http://nj-npm.irisnpm.com/colors
npm http GET http://nj-npm.irisnpm.com/pkginfo
> hashlib@1.0.1 install /root/tmp/tmp-9009mw3zpls/build/package/node_modules/hashlib
> node-waf clean ; node-waf configure build
npm http 200 http://nj-npm.irisnpm.com/commander/0.6.1
npm http GET http://nj-npm.irisnpm.com/commander/-/commander-0.6.1.tgz
npm http 200 http://nj-npm.irisnpm.com/configurable/0.0.1
npm http GET http://nj-npm.irisnpm.com/configurable/-/configurable-0.0.1.tgz
npm http 200 http://nj-npm.irisnpm.com/wordwrap
npm http GET http://nj-npm.irisnpm.com/wordwrap/-/wordwrap-0.0.2.tgz
npm http 200 http://nj-npm.irisnpm.com/debug
npm http GET http://nj-npm.irisnpm.com/debug/-/debug-0.7.0.tgz
npm http 200 http://nj-npm.irisnpm.com/connect/2.4.4
npm http GET http://nj-npm.irisnpm.com/connect/-/connect-2.4.4.tgz
npm http 200 http://nj-npm.irisnpm.com/buffalo/0.1.3
Nothing to clean (project not configured)
npm http GET http://nj-npm.irisnpm.com/buffalo/-/buffalo-0.1.3.tgz
npm http 200 http://nj-npm.irisnpm.com/waiter/0.1.1
npm http GET http://nj-npm.irisnpm.com/waiter/-/waiter-0.1.1.tgz
npm http 200 http://nj-npm.irisnpm.com/escape-regexp/0.0.1
npm http GET http://nj-npm.irisnpm.com/escape-regexp/-/escape-regexp-0.0.1.tgz
npm http 200 http://nj-npm.irisnpm.com/range-parser/0.0.4
npm http GET http://nj-npm.irisnpm.com/range-parser/-/range-parser-0.0.4.tgz
npm http 200 http://nj-npm.irisnpm.com/taxman/0.1.1
npm http GET http://nj-npm.irisnpm.com/taxman/-/taxman-0.1.1.tgz
npm http 200 http://nj-npm.irisnpm.com/mkdirp/0.3.3
npm http GET http://nj-npm.irisnpm.com/mkdirp/-/mkdirp-0.3.3.tgz
Checking for program g++ or c++ : /opt/local/bin/g++
npm http 200 http://nj-npm.irisnpm.com/cookie/0.0.4
npm http GET http://nj-npm.irisnpm.com/cookie/-/cookie-0.0.4.tgz
Checking for program cpp : /opt/local/bin/cpp
Checking for program ar : /opt/local/bin/ar
Checking for program ranlib : /opt/local/bin/ranlib
Checking for g++ : ok
Checking for program gcc or cc : /opt/local/bin/gcc
npm http 200 http://nj-npm.irisnpm.com/crc/0.2.0
npm http GET http://nj-npm.irisnpm.com/crc/-/crc-0.2.0.tgz
Checking for gcc : ok
Checking for node path : not found
Checking for node prefix : ok /opt/local
'configure' finished successfully (0.095s)
Waf: Entering directory `/root/tmp/tmp-9009mw3zpls/build/package/node_modules/hashlib/build'
[1/6] cc: libhash/md4c.c -> build/Release/libhash/md4c_1.o
[2/6] cc: libhash/md5c.c -> build/Release/libhash/md5c_1.o
npm http 200 http://nj-npm.irisnpm.com/fresh/0.1.0
npm http GET http://nj-npm.irisnpm.com/fresh/-/fresh-0.1.0.tgz
[3/6] cc: libhash/sha0c.c -> build/Release/libhash/sha0c_1.o
npm http 200 http://nj-npm.irisnpm.com/methods/0.0.1
npm http GET http://nj-npm.irisnpm.com/methods/-/methods-0.0.1.tgz
[4/6] cxx: hashlib.cc -> build/Release/hashlib_2.o
npm http 200 http://nj-npm.irisnpm.com/send/0.0.4
../libhash/sha0c.c: In function 'SHA_Update':
../libhash/sha0c.c:189:8: warning: cast from pointer to integer of different size [-Wpointer-to-int-cast]
npm http GET http://nj-npm.irisnpm.com/send/-/send-0.0.4.tgz
../hashlib.cc:14:16: fatal error: ev.h: No such file or directory
compilation terminated.
npm http 200 http://nj-npm.irisnpm.com/mkdirp
npm http 200 http://nj-npm.irisnpm.com/coffee-script
npm http GET http://nj-npm.irisnpm.com/mkdirp/-/mkdirp-0.3.4.tgz
npm http GET http://nj-npm.irisnpm.com/coffee-script/-/coffee-script-1.4.0.tgz
npm http 200 http://nj-npm.irisnpm.com/pkginfo
npm http 200 http://nj-npm.irisnpm.com/tinycolor
npm http 200 http://nj-npm.irisnpm.com/options
npm http GET http://nj-npm.irisnpm.com/pkginfo/-/pkginfo-0.2.3.tgz
npm http GET http://nj-npm.irisnpm.com/tinycolor/-/tinycolor-0.0.1.tgz
npm http 200 http://nj-npm.irisnpm.com/colors
npm http 200 http://nj-npm.irisnpm.com/wordwrap/-/wordwrap-0.0.2.tgz
npm http 200 http://nj-npm.irisnpm.com/commander
npm http 200 http://nj-npm.irisnpm.com/configurable/-/configurable-0.0.1.tgz
npm http 200 http://nj-npm.irisnpm.com/commander/-/commander-0.6.1.tgz
npm http GET http://nj-npm.irisnpm.com/options/-/options-0.0.3.tgz
npm http GET http://nj-npm.irisnpm.com/colors/-/colors-0.6.0-1.tgz
npm http 200 http://nj-npm.irisnpm.com/debug/-/debug-0.7.0.tgz
npm http 200 http://nj-npm.irisnpm.com/connect/-/connect-2.4.4.tgz
npm http 200 http://nj-npm.irisnpm.com/waiter/-/waiter-0.1.1.tgz
npm http 200 http://nj-npm.irisnpm.com/buffalo/-/buffalo-0.1.3.tgz
npm http 200 http://nj-npm.irisnpm.com/escape-regexp/-/escape-regexp-0.0.1.tgz
Waf: Leaving directory `/root/tmp/tmp-9009mw3zpls/build/package/node_modules/hashlib/build'
Build failed: -> task failed (err #1):
{task: cxx hashlib.cc -> hashlib_2.o}
npm http 200 http://nj-npm.irisnpm.com/mkdirp/-/mkdirp-0.3.3.tgz
npm http 200 http://nj-npm.irisnpm.com/taxman/-/taxman-0.1.1.tgz
npm http 200 http://nj-npm.irisnpm.com/range-parser/-/range-parser-0.0.4.tgz
npm ERR! hashlib@1.0.1 install: `node-waf clean ; node-waf configure build`
npm ERR! `sh "-c" "node-waf clean ; node-waf configure build"` failed with 1
npm ERR!
npm ERR! Failed at the hashlib@1.0.1 install script.
npm ERR! This is most likely a problem with the hashlib package,
npm ERR! not with npm itself.
npm ERR! Tell the author that this fails on your system:
npm ERR! node-waf clean ; node-waf configure build
npm ERR! You can get their info via:
npm ERR! npm owner ls hashlib
npm ERR! There is likely additional logging output above.
npm ERR! System SunOS 5.11
npm ERR! command "/opt/local/bin/node" "/opt/local/bin/npm" "install"
npm ERR! cwd /root/tmp/tmp-9009mw3zpls/build/package
npm ERR! node -v v0.8.8
npm ERR! npm -v 1.1.59
npm ERR! code ELIFECYCLE
npm http 200 http://nj-npm.irisnpm.com/cookie/-/cookie-0.0.4.tgz
npm http 200 http://nj-npm.irisnpm.com/send/-/send-0.0.4.tgz
npm http 200 http://nj-npm.irisnpm.com/fresh/-/fresh-0.1.0.tgz
npm http 200 http://nj-npm.irisnpm.com/crc/-/crc-0.2.0.tgz
npm http 200 http://nj-npm.irisnpm.com/methods/-/methods-0.0.1.tgz
npm WARN package.json methods@0.0.1 No README.md file found!
npm http 200 http://nj-npm.irisnpm.com/pkginfo/-/pkginfo-0.2.3.tgz
npm http 200 http://nj-npm.irisnpm.com/tinycolor/-/tinycolor-0.0.1.tgz
npm http 200 http://nj-npm.irisnpm.com/mkdirp/-/mkdirp-0.3.4.tgz
npm http 200 http://nj-npm.irisnpm.com/options/-/options-0.0.3.tgz
npm http 200 http://nj-npm.irisnpm.com/coffee-script/-/coffee-script-1.4.0.tgz
npm http 200 http://nj-npm.irisnpm.com/colors/-/colors-0.6.0-1.tgz
> ws@0.4.22 install /root/tmp/tmp-9009mw3zpls/build/package/node_modules/ws
> node install.js
[ws v0.4.22] Attempting to compile blazing fast native extensions.
npm http GET http://nj-npm.irisnpm.com/tosource/0.1.1
npm http 200 http://nj-npm.irisnpm.com/tosource/0.1.1
npm http GET http://nj-npm.irisnpm.com/tosource/-/tosource-0.1.1.tgz
npm http 200 http://nj-npm.irisnpm.com/tosource/-/tosource-0.1.1.tgz
npm http GET http://nj-npm.irisnpm.com/mime/1.2.6
npm http 200 http://nj-npm.irisnpm.com/mime/1.2.6
npm http GET http://nj-npm.irisnpm.com/mime/-/mime-1.2.6.tgz
npm http 200 http://nj-npm.irisnpm.com/mime/-/mime-1.2.6.tgz
npm http GET http://nj-npm.irisnpm.com/qs/0.4.2
npm http GET http://nj-npm.irisnpm.com/formidable/1.0.11
npm http GET http://nj-npm.irisnpm.com/bytes/0.1.0
npm http GET http://nj-npm.irisnpm.com/pause/0.0.1
npm http 200 http://nj-npm.irisnpm.com/formidable/1.0.11
npm http GET http://nj-npm.irisnpm.com/formidable/-/formidable-1.0.11.tgz
npm http 200 http://nj-npm.irisnpm.com/pause/0.0.1
npm http GET http://nj-npm.irisnpm.com/pause/-/pause-0.0.1.tgz
npm http 200 http://nj-npm.irisnpm.com/qs/0.4.2
npm http 200 http://nj-npm.irisnpm.com/formidable/-/formidable-1.0.11.tgz
npm http GET http://nj-npm.irisnpm.com/qs/-/qs-0.4.2.tgz
npm http 200 http://nj-npm.irisnpm.com/pause/-/pause-0.0.1.tgz
npm http 200 http://nj-npm.irisnpm.com/qs/-/qs-0.4.2.tgz
npm http 200 http://nj-npm.irisnpm.com/bytes/0.1.0
npm http GET http://nj-npm.irisnpm.com/bytes/-/bytes-0.1.0.tgz
npm http 200 http://nj-npm.irisnpm.com/bytes/-/bytes-0.1.0.tgz
[ws v0.4.22] Native extension compilation successful!
npm ERR!
npm ERR! Additional logging details can be found in:
npm ERR! /root/tmp/tmp-9009mw3zpls/build/package/npm-debug.log
npm ERR! not ok code 0
help: For help with this error contact Nodejitsu Support:
help: webchat: <http://webchat.nodejitsu.com/>
help: irc: <irc://chat.freenode.net/#nodejitsu>
help: email: <support@nodejitsu.com>
help:
help: Copy and paste this output to a gist (http://gist.github.com/)
info: Nodejitsu not ok
Sign up for free to join this conversation on GitHub. Already have an account? Sign in to comment
You can’t perform that action at this time.