Skip to content

Instantly share code, notes, and snippets.

Embed
What would you like to do?
% git clone git@github.com:joshuaclayton/elm-ports-example.git
Cloning into 'elm-ports-example'...
remote: Enumerating objects: 251, done.
remote: Total 251 (delta 0), reused 0 (delta 0), pack-reused 251
Receiving objects: 100% (251/251), 126.73 KiB | 1.62 MiB/s, done.
Resolving deltas: 100% (87/87), done.
apps % cd elm-ports-example
elm-ports-example master % atom .
elm-ports-example master % yarn
yarn install v1.15.2
[1/4] 🔍 Resolving packages...
[2/4] 🚚 Fetching packages...
[3/4] 🔗 Linking dependencies...
warning " > extract-text-webpack-plugin@2.1.2" has incorrect peer dependency "webpack@^2.2.0".
[4/4] 🔨 Building fresh packages...
[-/4] ⠐ waiting...
[2/4] ⠐ fsevents
[-/4] ⠐ waiting...
warning Error running install script for optional dependency: "/Users/stephen/dev/elm/apps/elm-ports-example/node_modules/fsevents: Command failed.
Exit code: 1
Command: node install
Arguments:
Directory: /Users/stephen/dev/elm/apps/elm-ports-example/node_modules/fsevents
Output:
node-pre-gyp info it worked if it ends with ok
node-pre-gyp info using node-pre-gyp@0.6.38
node-pre-gyp info using node@11.13.0 | darwin | x64
node-pre-gyp info check checked for \"/Users/stephen/dev/elm/apps/elm-ports-example/node_modules/fsevents/lib/binding/Release/node-v67-darwin-x64/fse.node\" (not found)
node-pre-gyp http GET https://fsevents-binaries.s3-us-west-2.amazonaws.com/v1.1.2/fse-v1.1.2-node-v67-darwin-x64.tar.gz
node-pre-gyp http 404 https://fsevents-binaries.s3-us-west-2.amazonaws.com/v1.1.2/fse-v1.1.2-node-v67-darwin-x64.tar.gz
node-pre-gyp ERR! Tried to download(404): https://fsevents-binaries.s3-us-west-2.amazonaws.com/v1.1.2/fse-v1.1.2-node-v67-darwin-x64.tar.gz
node-pre-gyp ERR! Pre-built binaries not found for fsevents@1.1.2 and node@11.13.0 (node-v67 ABI) (falling back to source compile with node-gyp)
node-pre-gyp http 404 status code downloading tarball https://fsevents-binaries.s3-us-west-2.amazonaws.com/v1.1.2/fse-v1.1.2-node-v67-darwin-x64.tar.gz
node-pre-gyp ERR! Tried to download(undefined): https://fsevents-binaries.s3-us-west-2.amazonaws.com/v1.1.2/fse-v1.1.2-node-v67-darwin-x64.tar.gz
node-pre-gyp ERR! Pre-built binaries not found for fsevents@1.1.2 and node@11.13.0 (node-v67 ABI) (falling back to source compile with node-gyp)
node-pre-gyp http Connection closed while downloading tarball file
gyp info it worked if it ends with ok
gyp info using node-gyp@3.6.2
gyp info using node@11.13.0 | darwin | x64
gyp info it worked if it ends with ok
gyp info using node-gyp@3.6.2
gyp info using node@11.13.0 | darwin | x64
gyp info ok
gyp info ok
gyp info it worked if it ends with ok
gyp info it worked if it ends with ok
gyp info using node-gyp@3.6.2
gyp info using node@11.13.0 | darwin | x64
gyp info using node-gyp@3.6.2
gyp info using node@11.13.0 | darwin | x64
gyp info spawn /usr/bin/python
gyp info spawn /usr/bin/python
gyp info spawn args [ '/Users/stephen/dev/elm/apps/elm-ports-example/node_modules/node-gyp/gyp/gyp_main.py',
gyp info spawn args 'binding.gyp',
gypgyp infoinfo spawn argsspawn args '-f',
[ '/Users/stephen/dev/elm/apps/elm-ports-example/node_modules/node-gyp/gyp/gyp_main.py',
gypgyp infoinfo spawn args 'binding.gyp',
gyp spawn argsinfo 'make',
gypspawn args '-f',
infogyp spawn argsinfo '-I',
gypspawn args 'make',
infogyp spawn argsinfo '/Users/stephen/dev/elm/apps/elm-ports-example/node_modules/fsevents/build/config.gypi',
gypspawn args '-I',
infogyp spawn argsinfo '-I',
gypspawn args info '/Users/stephen/dev/elm/apps/elm-ports-example/node_modules/fsevents/build/config.gypi',
gypspawn args '/Users/stephen/dev/elm/apps/elm-ports-example/node_modules/node-gyp/addon.gypi',
infogyp spawn argsinfo '-I',
gypspawn args '-I',
infogyp spawn argsinfo '/Users/stephen/dev/elm/apps/elm-ports-example/node_modules/node-gyp/addon.gypi',
gypspawn args '/Users/stephen/.node-gyp/11.13.0/include/node/common.gypi',
infogyp spawn argsinfo '-I',
gypspawn args '-Dlibrary=shared_library',
infogyp spawn argsinfo '/Users/stephen/.node-gyp/11.13.0/include/node/common.gypi',
gypspawn args '-Dvisibility=default',
infogyp spawn argsinfo '-Dlibrary=shared_library',
gypspawn args '-Dnode_root_dir=/Users/stephen/.node-gyp/11.13.0',
infogyp spawn argsinfo '-Dvisibility=default',
gypspawn args '-Dnode_gyp_dir=/Users/stephen/dev/elm/apps/elm-ports-example/node_modules/node-gyp',
infogyp spawn argsinfo '-Dnode_root_dir=/Users/stephen/.node-gyp/11.13.0',
gypspawn args '-Dnode_lib_file=/Users/stephen/.node-gyp/11.13.0/<(target_arch)/node.lib',
infogyp spawn argsinfo '-Dnode_gyp_dir=/Users/stephen/dev/elm/apps/elm-ports-example/node_modules/node-gyp',
gypspawn args '-Dmodule_root_dir=/Users/stephen/dev/elm/apps/elm-ports-example/node_modules/fsevents',
infogyp spawn argsinfo '-Dnode_lib_file=/Users/stephen/.node-gyp/11.13.0/<(target_arch)/node.lib',
gypspawn args '-Dnode_engine=v8',
infogyp spawn argsinfo '-Dmodule_root_dir=/Users/stephen/dev/elm/apps/elm-ports-example/node_modules/fsevents',
gypspawn args '--depth=.',
infogyp spawn argsinfo '-Dnode_engine=v8',
gypspawn args '--no-parallel',
infogyp spawn argsinfo '--depth=.',
gypspawn args '--generator-output',
infogyp spawn argsinfo '--no-parallel',
gypspawn args 'build',
infogyp spawn argsinfo '--generator-output',
gypspawn args '-Goutput_dir=.' ]
info spawn args 'build',
gyp info spawn args '-Goutput_dir=.' ]
gypgyp infoinfo okok
gyp info it worked if it ends with ok
gyp info using node-gyp@3.6.2
gypgyp info using node@11.13.0 | darwin | x64
info it worked if it ends with ok
gyp info using node-gyp@3.6.2
gyp info using node@11.13.0 | darwin | x64
gyp info spawn make
gyp info spawn args [ 'BUILDTYPE=Release', '-C', 'build' ]
gyp info spawn make
gyp info spawn args [ 'BUILDTYPE=Release', '-C', 'build' ]
SOLINK_MODULE(target) Release/.node
SOLINK_MODULE(target) Release/.node
CXX(target) Release/obj.target/fse/fsevents.o
CXX(target) Release/obj.target/fse/fsevents.o
In file included from ../fsevents.cc:6:
In file included from ../../nan/nan.h:192:
In file included from ../fsevents.cc:6:
In file included from ../../nan/nan.h:192:
../../nan/nan_maybe_43_inl.h../../nan/nan_maybe_43_inl.h:112:112::15:15 :error : errorno member named 'ForceSet' in 'v8::Object':
no member named 'ForceSet' in 'v8::Object'
return obj->ForceSet(isolate->GetCurrentContext(), key, value, attribs);
~~~ ^
return obj->ForceSet(isolate->GetCurrentContext(), key, value, attribs);
~~~ ^
In file included from ../fsevents.cc:6:
In file included from ../fsevents.ccIn file included from ../../nan/nan.h::6:
In file included from 198:
../../nan/nan.h:In file included from 198:
In file included from ../../nan/nan_new.h../../nan/nan_new.h::189:
189../../nan/nan_implementation_12_inl.h:
:../../nan/nan_implementation_12_inl.h:337:33728::28: warningwarning: : 'New' is deprecated: Use Isolate* version [-Wdeprecated-declarations]
'New' is deprecated: Use Isolate* version [-Wdeprecated-declarations]
return v8::StringObject::New(value).As<v8::StringObject>(); return v8::StringObject::New(value).As<v8::StringObject>();
^ ^
/Users/stephen/.node-gyp/11.13.0/include/node/v8.h:5241:3: /Users/stephen/.node-gyp/11.13.0/include/node/v8.h:5241:3: note: 'New' has been explicitly marked deprecated here
note: 'New' has been explicitly marked deprecated here
V8_DEPRECATED(\"Use Isolate* version\",
^
V8_DEPRECATED(\"Use Isolate* version\",
^
/Users/stephen/.node-gyp/11.13.0/include/node/v8config.h:326:29: note: /Users/stephen/.node-gyp/11.13.0/include/node/v8config.h:326:expanded from macro 'V8_DEPRECATED'29
: note: expanded from macro 'V8_DEPRECATED'
declarator __attribute__((deprecated(message)))
^
declarator __attribute__((deprecated(message)))
^
In file included from ../fsevents.cc:6:
../../nan/nan.h:834:18: warning: 'MakeCallback' is deprecated: Use MakeCallback(..., async_context) [-Wdeprecated-declarations]
return node::MakeCallback(
^
/Users/stephen/.node-gyp/11.13.0/include/node/node.h:171:1: note: 'MakeCallback' has been explicitly marked deprecated here
NODE_DEPRECATED(\"Use MakeCallback(..., async_context)\",
^
/Users/stephen/.node-gyp/11.13.0/include/node/node.h:91:20: note: expanded from macro 'NODE_DEPRECATED'
__attribute__((deprecated(message))) declarator
^
In file included from ../fsevents.cc:6In file included from ../fsevents.cc::
6../../nan/nan.h:849::
../../nan/nan.h:18:834 :warning18: : warning: 'MakeCallback' is deprecated: Use MakeCallback(..., async_context) [-Wdeprecated-declarations]
'MakeCallback' is deprecated: Use MakeCallback(..., async_context) [-Wdeprecated-declarations]
return node::MakeCallback(
^ return node::MakeCallback(
^
/Users/stephen/.node-gyp/11.13.0/include/node/node.h:164:1: note: 'MakeCallback' has been explicitly marked deprecated here
/Users/stephen/.node-gyp/11.13.0/include/node/node.h:171:1: note: 'MakeCallback' has been explicitly marked deprecated here
NODE_DEPRECATED(\"Use MakeCallback(..., async_context)\",
^
/Users/stephen/.node-gyp/11.13.0/include/node/node.h:91:NODE_DEPRECATED(\"Use MakeCallback(..., async_context)\",20
:^
note: /Users/stephen/.node-gyp/11.13.0/include/node/node.h:expanded from macro 'NODE_DEPRECATED'91
:20: note: expanded from macro 'NODE_DEPRECATED'
__attribute__((deprecated(message))) declarator
^
__attribute__((deprecated(message))) declarator
^
In file included from ../fsevents.cc:6:
../../nan/nan.h:864In file included from ../fsevents.cc:6:
../../nan/nan.h:849:18:: 18: warning: warning'MakeCallback' is deprecated: Use MakeCallback(..., async_context) [-Wdeprecated-declarations]:
'MakeCallback' is deprecated: Use MakeCallback(..., async_context) [-Wdeprecated-declarations]
return node::MakeCallback(
^ return node::MakeCallback(
^
/Users/stephen/.node-gyp/11.13.0/include/node/node.h:/Users/stephen/.node-gyp/11.13.0/include/node/node.h164::1571::1 :note : note'MakeCallback' has been explicitly marked deprecated here:
'MakeCallback' has been explicitly marked deprecated here
NODE_DEPRECATED(\"Use MakeCallback(..., async_context)\",
NODE_DEPRECATED(\"Use MakeCallback(..., async_context)\",
^^
/Users/stephen/.node-gyp/11.13.0/include/node/node.h:/Users/stephen/.node-gyp/11.13.0/include/node/node.h91::91:2020:: notenote: : expanded from macro 'NODE_DEPRECATED'expanded from macro 'NODE_DEPRECATED'
__attribute__((deprecated(message))) declarator __attribute__((deprecated(message))) declarator
^ ^
In file included from ../fsevents.cc:6:
../../nan/nan.h:864:18: warning: 'MakeCallback' is deprecated: Use MakeCallback(..., async_context) [-Wdeprecated-declarations]
return node::MakeCallback(
^
/Users/stephen/.node-gyp/11.13.0/include/node/node.h:157:1: note: 'MakeCallback' has been explicitly marked deprecated here
NODE_DEPRECATED(\"Use MakeCallback(..., async_context)\",
^
/Users/stephen/.node-gyp/11.13.0/include/node/node.h:91:20: note: expanded from macro 'NODE_DEPRECATED'
__attribute__((deprecated(message))) declarator
^
In file included from ../fsevents.cc:6:
../../nan/nan.h:911:44: warning: 'ToString' is deprecated: Use maybe version [-Wdeprecated-declarations]
v8::Local<v8::String> string = from->ToString();
^
/Users/stephen/.node-gyp/11.13.0/include/node/v8.h:2548:10: note: 'ToString' has been explicitly marked deprecated here
inline V8_DEPRECATED(\"Use maybe version\", Local<String> ToString() const);
^
/Users/stephen/.node-gyp/11.13.0/include/node/v8config.h:326:29: note: expanded from macro 'V8_DEPRECATED'
declarator __attribute__((deprecated(message)))
^
In file included from ../fsevents.cc:6:
../../nan/nan.h:911:44: warning: 'ToString' is deprecated: Use maybe version [-Wdeprecated-declarations]
v8::Local<v8::String> string = from->ToString();
^
/Users/stephen/.node-gyp/11.13.0/include/node/v8.h:2548:10: note: 'ToString' has been explicitly marked deprecated here
inline V8_DEPRECATED(\"Use maybe version\", Local<String> ToString() const);
^
/Users/stephen/.node-gyp/11.13.0/include/node/v8config.h:326:29: note: expanded from macro 'V8_DEPRECATED'
declarator __attribute__((deprecated(message)))
^
In file included from ../fsevents.cc:6:
../../nan/nan.h:921:27: warning: 'WriteUtf8' is deprecated: Use Isolate* version [-Wdeprecated-declarations]
length_ = string->WriteUtf8(str_, static_cast<int>(len), 0, flags);
^
/Users/stephen/.node-gyp/11.13.0/include/node/v8.h:2753:3: note: 'WriteUtf8' has been explicitly marked deprecated here
V8_DEPRECATED(\"Use Isolate* version\",
^
/Users/stephen/.node-gyp/11.13.0/include/node/v8config.h:326:29: note: expanded from macro 'V8_DEPRECATED'
declarator __attribute__((deprecated(message)))
^
In file included from ../fsevents.cc:6:
../../nan/nan.h:921:27: warning: 'WriteUtf8' is deprecated: Use Isolate* version [-Wdeprecated-declarations]
length_ = string->WriteUtf8(str_, static_cast<int>(len), 0, flags);
^
/Users/stephen/.node-gyp/11.13.0/include/node/v8.h:2753:3: note: 'WriteUtf8' has been explicitly marked deprecated here
V8_DEPRECATED(\"Use Isolate* version\",
^
/Users/stephen/.node-gyp/11.13.0/include/node/v8config.h:326:29: note: expanded from macro 'V8_DEPRECATED'
declarator __attribute__((deprecated(message)))
^
In file included from ../fsevents.cc:6:
../../nan/nan.h:1473:31: warning: 'MakeCallback' is deprecated: Use MakeCallback(..., async_context) [-Wdeprecated-declarations]
return scope.Escape(node::MakeCallback(
^
/Users/stephen/.node-gyp/11.13.0/include/node/node.h:171:1: note: 'MakeCallback' has been explicitly marked deprecated here
NODE_DEPRECATED(\"Use MakeCallback(..., async_context)\",
^
/Users/stephen/.node-gyp/11.13.0/include/node/node.h:91:20: note: expanded from macro 'NODE_DEPRECATED'
__attribute__((deprecated(message))) declarator
^
In file included from ../fsevents.cc:6:
../../nan/nan.h:1473:31: warning: 'MakeCallback' is deprecated: Use MakeCallback(..., async_context) [-Wdeprecated-declarations]
return scope.Escape(node::MakeCallback(
^
/Users/stephen/.node-gyp/11.13.0/include/node/node.h:171:1: note: 'MakeCallback' has been explicitly marked deprecated here
NODE_DEPRECATED(\"Use MakeCallback(..., async_context)\",
^
/Users/stephen/.node-gyp/11.13.0/include/node/node.h:91:20: note: expanded from macro 'NODE_DEPRECATED'
__attribute__((deprecated(message))) declarator
^
7 warnings and 1 error generated.
7 warnings and 1 error generated.
make: *** [Release/obj.target/fse/fsevents.o] Error 1
make: *** [Release/obj.target/fse/fsevents.o] Error 1
gyp gypERR! build error
ERR! build error
gyp ERR! stack Error: `make` failed with exit code: 2
gyp gypERR! stackERR! at ChildProcess.onExit (/Users/stephen/dev/elm/apps/elm-ports-example/node_modules/node-gyp/lib/build.js:258:23)
gypstack Error: `make` failed with exit code: 2
ERR!gyp stackERR! at ChildProcess.emit (events.js:193:13)
gypstack at ChildProcess.onExit (/Users/stephen/dev/elm/apps/elm-ports-example/node_modules/node-gyp/lib/build.js:258:23)
ERR!gyp stackERR! at Process.ChildProcess._handle.onexit (internal/child_process.js:255:12)
stack at ChildProcess.emit (events.js:193:13)
gyp ERR! stack at Process.ChildProcess._handle.onexit (internal/child_process.js:255:12)
gyp ERR! System Darwin 18.5.0
gyp ERR! System Darwin 18.5.0
gyp gypERR! command ERR! \"/Users/stephen/.asdf/installs/nodejs/11.13.0/bin/node\" \"/Users/stephen/dev/elm/apps/elm-ports-example/node_modules/node-gyp/bin/node-gyp.js\" \"build\" \"--fallback-to-build\" \"--module=/Users/stephen/dev/elm/apps/elm-ports-example/node_modules/fsevents/lib/binding/Release/node-v67-darwin-x64/fse.node\" \"--module_name=fse\" \"--module_path=/Users/stephen/dev/elm/apps/elm-ports-example/node_modules/fsevents/lib/binding/Release/node-v67-darwin-x64\"
commandgyp \"/Users/stephen/.asdf/installs/nodejs/11.13.0/bin/node\" \"/Users/stephen/dev/elm/apps/elm-ports-example/node_modules/node-gyp/bin/node-gyp.js\" \"build\" \"--fallback-to-build\" \"--module=/Users/stephen/dev/elm/apps/elm-ports-example/node_modules/fsevents/lib/binding/Release/node-v67-darwin-x64/fse.node\" \"--module_name=fse\" \"--module_path=/Users/stephen/dev/elm/apps/elm-ports-example/node_modules/fsevents/lib/binding/Release/node-v67-darwin-x64\"
ERR! gypcwd /Users/stephen/dev/elm/apps/elm-ports-example/node_modules/fsevents
ERR! gyp cwdERR! /Users/stephen/dev/elm/apps/elm-ports-example/node_modules/fsevents
gypnode -v v11.13.0
ERR! gyp node -vERR! v11.13.0
node-gyp -vgyp v3.6.2
ERR!gyp node-gyp -vERR! v3.6.2
gypnot ok
ERR! not ok
node-pre-gyp ERR! build error
node-pre-gyp ERR! stack Error: Failed to execute '/Users/stephen/.asdf/installs/nodejs/11.13.0/bin/node /Users/stephen/dev/elm/apps/elm-ports-example/node_modules/node-gyp/bin/node-gyp.js build --fallback-to-build --module=/Users/stephen/dev/elm/apps/elm-ports-example/node_modules/fsevents/lib/binding/Release/node-v67-darwin-x64/fse.node --module_name=fse --module_path=/Users/stephen/dev/elm/apps/elm-ports-example/node_modules/fsevents/lib/binding/Release/node-v67-darwin-x64' (1)
node-pre-gyp ERR! stack at ChildProcess.<anonymous> (/Users/stephen/dev/elm/apps/elm-ports-example/node_modules/node-pre-gyp/lib/util/compile.js:83:29)
node-pre-gyp ERR! stack at ChildProcess.emit (events.js:193:13)
node-pre-gyp ERR! stack at maybeClose (internal/child_process.js:1001:16)
node-pre-gyp ERR! stack at Process.ChildProcess._handle.onexit (internal/child_process.js:266:5)
node-pre-gyp ERR! System Darwin 18.5.0
node-pre-gyp ERR! command \"/Users/stephen/.asdf/installs/nodejs/11.13.0/bin/node\" \"/Users/stephen/dev/elm/apps/elm-ports-example/node_modules/fsevents/node_modules/.bin/node-pre-gyp\" \"install\" \"--fallback-to-build\"
node-pre-gyp ERR! cwd /Users/stephen/dev/elm/apps/elm-ports-example/node_modules/fsevents
node-pre-gyp ERR! node -v v11.13.0
node-pre-gyp ERR! node-pre-gyp -v v0.6.38
node-pre-gyp ERR! not ok
Failed to execute '/Users/stephen/.asdf/installs/nodejs/11.13.0/bin/node /Users/stephen/dev/elm/apps/elm-ports-example/node_modules/node-gyp/bin/node-gyp.js build --fallback-to-build --module=/Users/stephen/dev/elm/apps/elm-ports-example/node_modules/fsevents/lib/binding/[-/4] ⠈ waiting...
[-/4] ⠈ waiting...
[-/4] ⠈ waiting...
error /Users/stephen/dev/elm/apps/elm-ports-example/node_modules/node-sass: Command failed.
Exit code: 1
Command: node scripts/build.js
Arguments:
Directory: /Users/stephen/dev/elm/apps/elm-ports-example/node_modules/node-sass
Output:
Building: /Users/stephen/.asdf/installs/nodejs/11.13.0/bin/node /Users/stephen/dev/elm/apps/elm-ports-example/node_modules/node-gyp/bin/node-gyp.js rebuild --verbose --libsass_ext= --libsass_cflags= --libsass_ldflags= --libsass_library=
gyp info it worked if it ends with ok
gyp verb cli [ '/Users/stephen/.asdf/installs/nodejs/11.13.0/bin/node',
gyp verb cli '/Users/stephen/dev/elm/apps/elm-ports-example/node_modules/node-gyp/bin/node-gyp.js',
gyp verb cli 'rebuild',
gyp verb cli '--verbose',
gyp verb cli '--libsass_ext=',
gyp verb cli '--libsass_cflags=',
gyp verb cli '--libsass_ldflags=',
gyp verb cli '--libsass_library=' ]
gyp info using node-gyp@3.6.2
gyp info using node@11.13.0 | darwin | x64
gyp verb command rebuild []
gyp verb command clean []
gyp verb clean removing "build" directory
gyp verb command configure []
gyp verb check python checking for Python executable "/usr/bin/python" in the PATH
gyp verb `which` succeeded /usr/bin/python /usr/bin/python
gyp verb check python version `/usr/bin/python -c "import platform; print(platform.python_version());"` returned: "2.7.10\n"
gyp verb get node dir no --target version specified, falling back to host node version: 11.13.0
gyp verb command install [ '11.13.0' ]
gyp verb install input version string "11.13.0"
gyp verb install installing version: 11.13.0
gyp verb install --ensure was passed, so won't reinstall if already installed
gyp verb install version is already installed, need to check "installVersion"
gyp verb got "installVersion" 9
gyp verb needs "installVersion" 9
gyp verb install version is good
gyp verb get node dir target node version installed: 11.13.0
gyp verb build dir attempting to create "build" dir: /Users/stephen/dev/elm/apps/elm-ports-example/node_modules/node-sass/build
gyp verb build dir "build" dir needed to be created? /Users/stephen/dev/elm/apps/elm-ports-example/node_modules/node-sass/build
gyp verb build/config.gypi creating config file
gyp verb build/config.gypi writing out config file: /Users/stephen/dev/elm/apps/elm-ports-example/node_modules/node-sass/build/config.gypi
gyp verb config.gypi checking for gypi file: /Users/stephen/dev/elm/apps/elm-ports-example/node_modules/node-sass/config.gypi
gyp verb common.gypi checking for gypi file: /Users/stephen/dev/elm/apps/elm-ports-example/node_modules/node-sass/common.gypi
gyp verb gyp gyp format was not specified; forcing "make"
gyp info spawn /usr/bin/python
gyp info spawn args [ '/Users/stephen/dev/elm/apps/elm-ports-example/node_modules/node-gyp/gyp/gyp_main.py',
gyp info spawn args 'binding.gyp',
gyp info spawn args '-f',
gyp info spawn args 'make',
gyp info spawn args '-I',
gyp info spawn args '/Users/stephen/dev/elm/apps/elm-ports-example/node_modules/node-sass/build/config.gypi',
gyp info spawn args '-I',
gyp info spawn args '/Users/stephen/dev/elm/apps/elm-ports-example/node_modules/node-gyp/addon.gypi',
gyp info spawn args '-I',
gyp info spawn args '/Users/stephen/.node-gyp/11.13.0/include/node/common.gypi',
gyp info spawn args '-Dlibrary=shared_library',
gyp info spawn args '-Dvisibility=default',
gyp info spawn args '-Dnode_root_dir=/Users/stephen/.node-gyp/11.13.0',
gyp info spawn args '-Dnode_gyp_dir=/Users/stephen/dev/elm/apps/elm-ports-example/node_modules/node-gyp',
gyp info spawn args '-Dnode_lib_file=/Users/stephen/.node-gyp/11.13.0/<(target_arch)/node.lib',
gyp info spawn args '-Dmodule_root_dir=/Users/stephen/dev/elm/apps/elm-ports-example/node_modules/node-sass',
gyp info spawn args '-Dnode_engine=v8',
gyp info spawn args '--depth=.',
gyp info spawn args '--no-parallel',
gyp info spawn args '--generator-output',
gyp info spawn args 'build',
gyp info spawn args '-Goutput_dir=.' ]
gyp verb command build []
gyp verb build type Release
gyp verb architecture x64
gyp verb node dev dir /Users/stephen/.node-gyp/11.13.0
gyp verb `which` succeeded for `make` /usr/bin/make
gyp info spawn make
gyp info spawn args [ 'V=1', 'BUILDTYPE=Release', '-C', 'build' ]
c++ '-DNODE_GYP_MODULE_NAME=libsass' '-DUSING_UV_SHARED=1' '-DUSING_V8_SHARED=1' '-DV8_DEPRECATION_WARNINGS=1' '-D_DARWIN_USE_64_BIT_INODE=1' '-D_LARGEFILE_SOURCE' '-D_FILE_OFFSET_BITS=64' '-DLIBSASS_VERSION="3.5.0.beta.2"' -I/Users/stephen/.node-gyp/11.13.0/include/node -I/Users/stephen/.node-gyp/11.13.0/src -I/Users/stephen/.node-gyp/11.13.0/deps/uv/include -I/Users/stephen/.node-gyp/11.13.0/deps/v8/include -I../src/libsass/include -Os -gdwarf-2 -mmacosx-version-min=10.7 -arch x86_64 -Wall -Wendif-labels -W -Wno-unused-parameter -std=c++11 -stdlib=libc++ -fno-strict-aliasing -MMD -MF ./Release/.deps/Release/obj.target/libsass/src/libsass/src/ast.o.d.raw -c -o Release/obj.target/libsass/src/libsass/src/ast.o ../src/libsass/src/ast.cpp
c++ '-DNODE_GYP_MODULE_NAME=libsass' '-DUSING_UV_SHARED=1' '-DUSING_V8_SHARED=1' '-DV8_DEPRECATION_WARNINGS=1' '-D_DARWIN_USE_64_BIT_INODE=1' '-D_LARGEFILE_SOURCE' '-D_FILE_OFFSET_BITS=64' '-DLIBSASS_VERSION="3.5.0.beta.2"' -I/Users/stephen/.node-gyp/11.13.0/include/node -I/Users/stephen/.node-gyp/11.13.0/src -I/Users/stephen/.node-gyp/11.13.0/deps/uv/include -I/Users/stephen/.node-gyp/11.13.0/deps/v8/include -I../src/libsass/include -Os -gdwarf-2 -mmacosx-version-min=10.7 -arch x86_64 -Wall -Wendif-labels -W -Wno-unused-parameter -std=c++11 -stdlib=libc++ -fno-strict-aliasing -MMD -MF ./Release/.deps/Release/obj.target/libsass/src/libsass/src/ast_fwd_decl.o.d.raw -c -o Release/obj.target/libsass/src/libsass/src/ast_fwd_decl.o ../src/libsass/src/ast_fwd_decl.cpp
c++ '-DNODE_GYP_MODULE_NAME=libsass' '-DUSING_UV_SHARED=1' '-DUSING_V8_SHARED=1' '-DV8_DEPRECATION_WARNINGS=1' '-D_DARWIN_USE_64_BIT_INODE=1' '-D_LARGEFILE_SOURCE' '-D_FILE_OFFSET_BITS=64' '-DLIBSASS_VERSION="3.5.0.beta.2"' -I/Users/stephen/.node-gyp/11.13.0/include/node -I/Users/stephen/.node-gyp/11.13.0/src -I/Users/stephen/.node-gyp/11.13.0/deps/uv/include -I/Users/stephen/.node-gyp/11.13.0/deps/v8/include -I../src/libsass/include -Os -gdwarf-2 -mmacosx-version-min=10.7 -arch x86_64 -Wall -Wendif-labels -W -Wno-unused-parameter -std=c++11 -stdlib=libc++ -fno-strict-aliasing -MMD -MF ./Release/.deps/Release/obj.target/libsass/src/libsass/src/base64vlq.o.d.raw -c -o Release/obj.target/libsass/src/libsass/src/base64vlq.o ../src/libsass/src/base64vlq.cpp
c++ '-DNODE_GYP_MODULE_NAME=libsass' '-DUSING_UV_SHARED=1' '-DUSING_V8_SHARED=1' '-DV8_DEPRECATION_WARNINGS=1' '-D_DARWIN_USE_64_BIT_INODE=1' '-D_LARGEFILE_SOURCE' '-D_FILE_OFFSET_BITS=64' '-DLIBSASS_VERSION="3.5.0.beta.2"' -I/Users/stephen/.node-gyp/11.13.0/include/node -I/Users/stephen/.node-gyp/11.13.0/src -I/Users/stephen/.node-gyp/11.13.0/deps/uv/include -I/Users/stephen/.node-gyp/11.13.0/deps/v8/include -I../src/libsass/include -Os -gdwarf-2 -mmacosx-version-min=10.7 -arch x86_64 -Wall -Wendif-labels -W -Wno-unused-parameter -std=c++11 -stdlib=libc++ -fno-strict-aliasing -MMD -MF ./Release/.deps/Release/obj.target/libsass/src/libsass/src/bind.o.d.raw -c -o Release/obj.target/libsass/src/libsass/src/bind.o ../src/libsass/src/bind.cpp
cc '-DNODE_GYP_MODULE_NAME=libsass' '-DUSING_UV_SHARED=1' '-DUSING_V8_SHARED=1' '-DV8_DEPRECATION_WARNINGS=1' '-D_DARWIN_USE_64_BIT_INODE=1' '-D_LARGEFILE_SOURCE' '-D_FILE_OFFSET_BITS=64' '-DLIBSASS_VERSION="3.5.0.beta.2"' -I/Users/stephen/.node-gyp/11.13.0/include/node -I/Users/stephen/.node-gyp/11.13.0/src -I/Users/stephen/.node-gyp/11.13.0/deps/uv/include -I/Users/stephen/.node-gyp/11.13.0/deps/v8/include -I../src/libsass/include -Os -gdwarf-2 -mmacosx-version-min=10.7 -arch x86_64 -Wall -Wendif-labels -W -Wno-unused-parameter -fno-strict-aliasing -MMD -MF ./Release/.deps/Release/obj.target/libsass/src/libsass/src/cencode.o.d.raw -c -o Release/obj.target/libsass/src/libsass/src/cencode.o ../src/libsass/src/cencode.c
c++ '-DNODE_GYP_MODULE_NAME=libsass' '-DUSING_UV_SHARED=1' '-DUSING_V8_SHARED=1' '-DV8_DEPRECATION_WARNINGS=1' '-D_DARWIN_USE_64_BIT_INODE=1' '-D_LARGEFILE_SOURCE' '-D_FILE_OFFSET_BITS=64' '-DLIBSASS_VERSION="3.5.0.beta.2"' -I/Users/stephen/.node-gyp/11.13.0/include/node -I/Users/stephen/.node-gyp/11.13.0/src -I/Users/stephen/.node-gyp/11.13.0/deps/uv/include -I/Users/stephen/.node-gyp/11.13.0/deps/v8/include -I../src/libsass/include -Os -gdwarf-2 -mmacosx-version-min=10.7 -arch x86_64 -Wall -Wendif-labels -W -Wno-unused-parameter -std=c++11 -stdlib=libc++ -fno-strict-aliasing -MMD -MF ./Release/.deps/Release/obj.target/libsass/src/libsass/src/check_nesting.o.d.raw -c -o Release/obj.target/libsass/src/libsass/src/check_nesting.o ../src/libsass/src/check_nesting.cpp
c++ '-DNODE_GYP_MODULE_NAME=libsass' '-DUSING_UV_SHARED=1' '-DUSING_V8_SHARED=1' '-DV8_DEPRECATION_WARNINGS=1' '-D_DARWIN_USE_64_BIT_INODE=1' '-D_LARGEFILE_SOURCE' '-D_FILE_OFFSET_BITS=64' '-DLIBSASS_VERSION="3.5.0.beta.2"' -I/Users/stephen/.node-gyp/11.13.0/include/node -I/Users/stephen/.node-gyp/11.13.0/src -I/Users/stephen/.node-gyp/11.13.0/deps/uv/include -I/Users/stephen/.node-gyp/11.13.0/deps/v8/include -I../src/libsass/include -Os -gdwarf-2 -mmacosx-version-min=10.7 -arch x86_64 -Wall -Wendif-labels -W -Wno-unused-parameter -std=c++11 -stdlib=libc++ -fno-strict-aliasing -MMD -MF ./Release/.deps/Release/obj.target/libsass/src/libsass/src/color_maps.o.d.raw -c -o Release/obj.target/libsass/src/libsass/src/color_maps.o ../src/libsass/src/color_maps.cpp
c++ '-DNODE_GYP_MODULE_NAME=libsass' '-DUSING_UV_SHARED=1' '-DUSING_V8_SHARED=1' '-DV8_DEPRECATION_WARNINGS=1' '-D_DARWIN_USE_64_BIT_INODE=1' '-D_LARGEFILE_SOURCE' '-D_FILE_OFFSET_BITS=64' '-DLIBSASS_VERSION="3.5.0.beta.2"' -I/Users/stephen/.node-gyp/11.13.0/include/node -I/Users/stephen/.node-gyp/11.13.0/src -I/Users/stephen/.node-gyp/11.13.0/deps/uv/include -I/Users/stephen/.node-gyp/11.13.0/deps/v8/include -I../src/libsass/include -Os -gdwarf-2 -mmacosx-version-min=10.7 -arch x86_64 -Wall -Wendif-labels -W -Wno-unused-parameter -std=c++11 -stdlib=libc++ -fno-strict-aliasing -MMD -MF ./Release/.deps/Release/obj.target/libsass/src/libsass/src/constants.o.d.raw -c -o Release/obj.target/libsass/src/libsass/src/constants.o ../src/libsass/src/constants.cpp
c++ '-DNODE_GYP_MODULE_NAME=libsass' '-DUSING_UV_SHARED=1' '-DUSING_V8_SHARED=1' '-DV8_DEPRECATION_WARNINGS=1' '-D_DARWIN_USE_64_BIT_INODE=1' '-D_LARGEFILE_SOURCE' '-D_FILE_OFFSET_BITS=64' '-DLIBSASS_VERSION="3.5.0.beta.2"' -I/Users/stephen/.node-gyp/11.13.0/include/node -I/Users/stephen/.node-gyp/11.13.0/src -I/Users/stephen/.node-gyp/11.13.0/deps/uv/include -I/Users/stephen/.node-gyp/11.13.0/deps/v8/include -I../src/libsass/include -Os -gdwarf-2 -mmacosx-version-min=10.7 -arch x86_64 -Wall -Wendif-labels -W -Wno-unused-parameter -std=c++11 -stdlib=libc++ -fno-strict-aliasing -MMD -MF ./Release/.deps/Release/obj.target/libsass/src/libsass/src/context.o.d.raw -c -o Release/obj.target/libsass/src/libsass/src/context.o ../src/libsass/src/context.cpp
c++ '-DNODE_GYP_MODULE_NAME=libsass' '-DUSING_UV_SHARED=1' '-DUSING_V8_SHARED=1' '-DV8_DEPRECATION_WARNINGS=1' '-D_DARWIN_USE_64_BIT_INODE=1' '-D_LARGEFILE_SOURCE' '-D_FILE_OFFSET_BITS=64' '-DLIBSASS_VERSION="3.5.0.beta.2"' -I/Users/stephen/.node-gyp/11.13.0/include/node -I/Users/stephen/.node-gyp/11.13.0/src -I/Users/stephen/.node-gyp/11.13.0/deps/uv/include -I/Users/stephen/.node-gyp/11.13.0/deps/v8/include -I../src/libsass/include -Os -gdwarf-2 -mmacosx-version-min=10.7 -arch x86_64 -Wall -Wendif-labels -W -Wno-unused-parameter -std=c++11 -stdlib=libc++ -fno-strict-aliasing -MMD -MF ./Release/.deps/Release/obj.target/libsass/src/libsass/src/cssize.o.d.raw -c -o Release/obj.target/libsass/src/libsass/src/cssize.o ../src/libsass/src/cssize.cpp
c++ '-DNODE_GYP_MODULE_NAME=libsass' '-DUSING_UV_SHARED=1' '-DUSING_V8_SHARED=1' '-DV8_DEPRECATION_WARNINGS=1' '-D_DARWIN_USE_64_BIT_INODE=1' '-D_LARGEFILE_SOURCE' '-D_FILE_OFFSET_BITS=64' '-DLIBSASS_VERSION="3.5.0.beta.2"' -I/Users/stephen/.node-gyp/11.13.0/include/node -I/Users/stephen/.node-gyp/11.13.0/src -I/Users/stephen/.node-gyp/11.13.0/deps/uv/include -I/Users/stephen/.node-gyp/11.13.0/deps/v8/include -I../src/libsass/include -Os -gdwarf-2 -mmacosx-version-min=10.7 -arch x86_64 -Wall -Wendif-labels -W -Wno-unused-parameter -std=c++11 -stdlib=libc++ -fno-strict-aliasing -MMD -MF ./Release/.deps/Release/obj.target/libsass/src/libsass/src/emitter.o.d.raw -c -o Release/obj.target/libsass/src/libsass/src/emitter.o ../src/libsass/src/emitter.cpp
c++ '-DNODE_GYP_MODULE_NAME=libsass' '-DUSING_UV_SHARED=1' '-DUSING_V8_SHARED=1' '-DV8_DEPRECATION_WARNINGS=1' '-D_DARWIN_USE_64_BIT_INODE=1' '-D_LARGEFILE_SOURCE' '-D_FILE_OFFSET_BITS=64' '-DLIBSASS_VERSION="3.5.0.beta.2"' -I/Users/stephen/.node-gyp/11.13.0/include/node -I/Users/stephen/.node-gyp/11.13.0/src -I/Users/stephen/.node-gyp/11.13.0/deps/uv/include -I/Users/stephen/.node-gyp/11.13.0/deps/v8/include -I../src/libsass/include -Os -gdwarf-2 -mmacosx-version-min=10.7 -arch x86_64 -Wall -Wendif-labels -W -Wno-unused-parameter -std=c++11 -stdlib=libc++ -fno-strict-aliasing -MMD -MF ./Release/.deps/Release/obj.target/libsass/src/libsass/src/environment.o.d.raw -c -o Release/obj.target/libsass/src/libsass/src/environment.o ../src/libsass/src/environment.cpp
c++ '-DNODE_GYP_MODULE_NAME=libsass' '-DUSING_UV_SHARED=1' '-DUSING_V8_SHARED=1' '-DV8_DEPRECATION_WARNINGS=1' '-D_DARWIN_USE_64_BIT_INODE=1' '-D_LARGEFILE_SOURCE' '-D_FILE_OFFSET_BITS=64' '-DLIBSASS_VERSION="3.5.0.beta.2"' -I/Users/stephen/.node-gyp/11.13.0/include/node -I/Users/stephen/.node-gyp/11.13.0/src -I/Users/stephen/.node-gyp/11.13.0/deps/uv/include -I/Users/stephen/.node-gyp/11.13.0/deps/v8/include -I../src/libsass/include -Os -gdwarf-2 -mmacosx-version-min=10.7 -arch x86_64 -Wall -Wendif-labels -W -Wno-unused-parameter -std=c++11 -stdlib=libc++ -fno-strict-aliasing -MMD -MF ./Release/.deps/Release/obj.target/libsass/src/libsass/src/error_handling.o.d.raw -c -o Release/obj.target/libsass/src/libsass/src/error_handling.o ../src/libsass/src/error_handling.cpp
c++ '-DNODE_GYP_MODULE_NAME=libsass' '-DUSING_UV_SHARED=1' '-DUSING_V8_SHARED=1' '-DV8_DEPRECATION_WARNINGS=1' '-D_DARWIN_USE_64_BIT_INODE=1' '-D_LARGEFILE_SOURCE' '-D_FILE_OFFSET_BITS=64' '-DLIBSASS_VERSION="3.5.0.beta.2"' -I/Users/stephen/.node-gyp/11.13.0/include/node -I/Users/stephen/.node-gyp/11.13.0/src -I/Users/stephen/.node-gyp/11.13.0/deps/uv/include -I/Users/stephen/.node-gyp/11.13.0/deps/v8/include -I../src/libsass/include -Os -gdwarf-2 -mmacosx-version-min=10.7 -arch x86_64 -Wall -Wendif-labels -W -Wno-unused-parameter -std=c++11 -stdlib=libc++ -fno-strict-aliasing -MMD -MF ./Release/.deps/Release/obj.target/libsass/src/libsass/src/eval.o.d.raw -c -o Release/obj.target/libsass/src/libsass/src/eval.o ../src/libsass/src/eval.cpp
c++ '-DNODE_GYP_MODULE_NAME=libsass' '-DUSING_UV_SHARED=1' '-DUSING_V8_SHARED=1' '-DV8_DEPRECATION_WARNINGS=1' '-D_DARWIN_USE_64_BIT_INODE=1' '-D_LARGEFILE_SOURCE' '-D_FILE_OFFSET_BITS=64' '-DLIBSASS_VERSION="3.5.0.beta.2"' -I/Users/stephen/.node-gyp/11.13.0/include/node -I/Users/stephen/.node-gyp/11.13.0/src -I/Users/stephen/.node-gyp/11.13.0/deps/uv/include -I/Users/stephen/.node-gyp/11.13.0/deps/v8/include -I../src/libsass/include -Os -gdwarf-2 -mmacosx-version-min=10.7 -arch x86_64 -Wall -Wendif-labels -W -Wno-unused-parameter -std=c++11 -stdlib=libc++ -fno-strict-aliasing -MMD -MF ./Release/.deps/Release/obj.target/libsass/src/libsass/src/expand.o.d.raw -c -o Release/obj.target/libsass/src/libsass/src/expand.o ../src/libsass/src/expand.cpp
c++ '-DNODE_GYP_MODULE_NAME=libsass' '-DUSING_UV_SHARED=1' '-DUSING_V8_SHARED=1' '-DV8_DEPRECATION_WARNINGS=1' '-D_DARWIN_USE_64_BIT_INODE=1' '-D_LARGEFILE_SOURCE' '-D_FILE_OFFSET_BITS=64' '-DLIBSASS_VERSION="3.5.0.beta.2"' -I/Users/stephen/.node-gyp/11.13.0/include/node -I/Users/stephen/.node-gyp/11.13.0/src -I/Users/stephen/.node-gyp/11.13.0/deps/uv/include -I/Users/stephen/.node-gyp/11.13.0/deps/v8/include -I../src/libsass/include -Os -gdwarf-2 -mmacosx-version-min=10.7 -arch x86_64 -Wall -Wendif-labels -W -Wno-unused-parameter -std=c++11 -stdlib=libc++ -fno-strict-aliasing -MMD -MF ./Release/.deps/Release/obj.target/libsass/src/libsass/src/extend.o.d.raw -c -o Release/obj.target/libsass/src/libsass/src/extend.o ../src/libsass/src/extend.cpp
c++ '-DNODE_GYP_MODULE_NAME=libsass' '-DUSING_UV_SHARED=1' '-DUSING_V8_SHARED=1' '-DV8_DEPRECATION_WARNINGS=1' '-D_DARWIN_USE_64_BIT_INODE=1' '-D_LARGEFILE_SOURCE' '-D_FILE_OFFSET_BITS=64' '-DLIBSASS_VERSION="3.5.0.beta.2"' -I/Users/stephen/.node-gyp/11.13.0/include/node -I/Users/stephen/.node-gyp/11.13.0/src -I/Users/stephen/.node-gyp/11.13.0/deps/uv/include -I/Users/stephen/.node-gyp/11.13.0/deps/v8/include -I../src/libsass/include -Os -gdwarf-2 -mmacosx-version-min=10.7 -arch x86_64 -Wall -Wendif-labels -W -Wno-unused-parameter -std=c++11 -stdlib=libc++ -fno-strict-aliasing -MMD -MF ./Release/.deps/Release/obj.target/libsass/src/libsass/src/file.o.d.raw -c -o Release/obj.target/libsass/src/libsass/src/file.o ../src/libsass/src/file.cpp
c++ '-DNODE_GYP_MODULE_NAME=libsass' '-DUSING_UV_SHARED=1' '-DUSING_V8_SHARED=1' '-DV8_DEPRECATION_WARNINGS=1' '-D_DARWIN_USE_64_BIT_INODE=1' '-D_LARGEFILE_SOURCE' '-D_FILE_OFFSET_BITS=64' '-DLIBSASS_VERSION="3.5.0.beta.2"' -I/Users/stephen/.node-gyp/11.13.0/include/node -I/Users/stephen/.node-gyp/11.13.0/src -I/Users/stephen/.node-gyp/11.13.0/deps/uv/include -I/Users/stephen/.node-gyp/11.13.0/deps/v8/include -I../src/libsass/include -Os -gdwarf-2 -mmacosx-version-min=10.7 -arch x86_64 -Wall -Wendif-labels -W -Wno-unused-parameter -std=c++11 -stdlib=libc++ -fno-strict-aliasing -MMD -MF ./Release/.deps/Release/obj.target/libsass/src/libsass/src/functions.o.d.raw -c -o Release/obj.target/libsass/src/libsass/src/functions.o ../src/libsass/src/functions.cpp
c++ '-DNODE_GYP_MODULE_NAME=libsass' '-DUSING_UV_SHARED=1' '-DUSING_V8_SHARED=1' '-DV8_DEPRECATION_WARNINGS=1' '-D_DARWIN_USE_64_BIT_INODE=1' '-D_LARGEFILE_SOURCE' '-D_FILE_OFFSET_BITS=64' '-DLIBSASS_VERSION="3.5.0.beta.2"' -I/Users/stephen/.node-gyp/11.13.0/include/node -I/Users/stephen/.node-gyp/11.13.0/src -I/Users/stephen/.node-gyp/11.13.0/deps/uv/include -I/Users/stephen/.node-gyp/11.13.0/deps/v8/include -I../src/libsass/include -Os -gdwarf-2 -mmacosx-version-min=10.7 -arch x86_64 -Wall -Wendif-labels -W -Wno-unused-parameter -std=c++11 -stdlib=libc++ -fno-strict-aliasing -MMD -MF ./Release/.deps/Release/obj.target/libsass/src/libsass/src/inspect.o.d.raw -c -o Release/obj.target/libsass/src/libsass/src/inspect.o ../src/libsass/src/inspect.cpp
c++ '-DNODE_GYP_MODULE_NAME=libsass' '-DUSING_UV_SHARED=1' '-DUSING_V8_SHARED=1' '-DV8_DEPRECATION_WARNINGS=1' '-D_DARWIN_USE_64_BIT_INODE=1' '-D_LARGEFILE_SOURCE' '-D_FILE_OFFSET_BITS=64' '-DLIBSASS_VERSION="3.5.0.beta.2"' -I/Users/stephen/.node-gyp/11.13.0/include/node -I/Users/stephen/.node-gyp/11.13.0/src -I/Users/stephen/.node-gyp/11.13.0/deps/uv/include -I/Users/stephen/.node-gyp/11.13.0/deps/v8/include -I../src/libsass/include -Os -gdwarf-2 -mmacosx-version-min=10.7 -arch x86_64 -Wall -Wendif-labels -W -Wno-unused-parameter -std=c++11 -stdlib=libc++ -fno-strict-aliasing -MMD -MF ./Release/.deps/Release/obj.target/libsass/src/libsass/src/json.o.d.raw -c -o Release/obj.target/libsass/src/libsass/src/json.o ../src/libsass/src/json.cpp
c++ '-DNODE_GYP_MODULE_NAME=libsass' '-DUSING_UV_SHARED=1' '-DUSING_V8_SHARED=1' '-DV8_DEPRECATION_WARNINGS=1' '-D_DARWIN_USE_64_BIT_INODE=1' '-D_LARGEFILE_SOURCE' '-D_FILE_OFFSET_BITS=64' '-DLIBSASS_VERSION="3.5.0.beta.2"' -I/Users/stephen/.node-gyp/11.13.0/include/node -I/Users/stephen/.node-gyp/11.13.0/src -I/Users/stephen/.node-gyp/11.13.0/deps/uv/include -I/Users/stephen/.node-gyp/11.13.0/deps/v8/include -I../src/libsass/include -Os -gdwarf-2 -mmacosx-version-min=10.7 -arch x86_64 -Wall -Wendif-labels -W -Wno-unused-parameter -std=c++11 -stdlib=libc++ -fno-strict-aliasing -MMD -MF ./Release/.deps/Release/obj.target/libsass/src/libsass/src/lexer.o.d.raw -c -o Release/obj.target/libsass/src/libsass/src/lexer.o ../src/libsass/src/lexer.cpp
c++ '-DNODE_GYP_MODULE_NAME=libsass' '-DUSING_UV_SHARED=1' '-DUSING_V8_SHARED=1' '-DV8_DEPRECATION_WARNINGS=1' '-D_DARWIN_USE_64_BIT_INODE=1' '-D_LARGEFILE_SOURCE' '-D_FILE_OFFSET_BITS=64' '-DLIBSASS_VERSION="3.5.0.beta.2"' -I/Users/stephen/.node-gyp/11.13.0/include/node -I/Users/stephen/.node-gyp/11.13.0/src -I/Users/stephen/.node-gyp/11.13.0/deps/uv/include -I/Users/stephen/.node-gyp/11.13.0/deps/v8/include -I../src/libsass/include -Os -gdwarf-2 -mmacosx-version-min=10.7 -arch x86_64 -Wall -Wendif-labels -W -Wno-unused-parameter -std=c++11 -stdlib=libc++ -fno-strict-aliasing -MMD -MF ./Release/.deps/Release/obj.target/libsass/src/libsass/src/listize.o.d.raw -c -o Release/obj.target/libsass/src/libsass/src/listize.o ../src/libsass/src/listize.cpp
c++ '-DNODE_GYP_MODULE_NAME=libsass' '-DUSING_UV_SHARED=1' '-DUSING_V8_SHARED=1' '-DV8_DEPRECATION_WARNINGS=1' '-D_DARWIN_USE_64_BIT_INODE=1' '-D_LARGEFILE_SOURCE' '-D_FILE_OFFSET_BITS=64' '-DLIBSASS_VERSION="3.5.0.beta.2"' -I/Users/stephen/.node-gyp/11.13.0/include/node -I/Users/stephen/.node-gyp/11.13.0/src -I/Users/stephen/.node-gyp/11.13.0/deps/uv/include -I/Users/stephen/.node-gyp/11.13.0/deps/v8/include -I../src/libsass/include -Os -gdwarf-2 -mmacosx-version-min=10.7 -arch x86_64 -Wall -Wendif-labels -W -Wno-unused-parameter -std=c++11 -stdlib=libc++ -fno-strict-aliasing -MMD -MF ./Release/.deps/Release/obj.target/libsass/src/libsass/src/memory/SharedPtr.o.d.raw -c -o Release/obj.target/libsass/src/libsass/src/memory/SharedPtr.o ../src/libsass/src/memory/SharedPtr.cpp
c++ '-DNODE_GYP_MODULE_NAME=libsass' '-DUSING_UV_SHARED=1' '-DUSING_V8_SHARED=1' '-DV8_DEPRECATION_WARNINGS=1' '-D_DARWIN_USE_64_BIT_INODE=1' '-D_LARGEFILE_SOURCE' '-D_FILE_OFFSET_BITS=64' '-DLIBSASS_VERSION="3.5.0.beta.2"' -I/Users/stephen/.node-gyp/11.13.0/include/node -I/Users/stephen/.node-gyp/11.13.0/src -I/Users/stephen/.node-gyp/11.13.0/deps/uv/include -I/Users/stephen/.node-gyp/11.13.0/deps/v8/include -I../src/libsass/include -Os -gdwarf-2 -mmacosx-version-min=10.7 -arch x86_64 -Wall -Wendif-labels -W -Wno-unused-parameter -std=c++11 -stdlib=libc++ -fno-strict-aliasing -MMD -MF ./Release/.deps/Release/obj.target/libsass/src/libsass/src/node.o.d.raw -c -o Release/obj.target/libsass/src/libsass/src/node.o ../src/libsass/src/node.cpp
c++ '-DNODE_GYP_MODULE_NAME=libsass' '-DUSING_UV_SHARED=1' '-DUSING_V8_SHARED=1' '-DV8_DEPRECATION_WARNINGS=1' '-D_DARWIN_USE_64_BIT_INODE=1' '-D_LARGEFILE_SOURCE' '-D_FILE_OFFSET_BITS=64' '-DLIBSASS_VERSION="3.5.0.beta.2"' -I/Users/stephen/.node-gyp/11.13.0/include/node -I/Users/stephen/.node-gyp/11.13.0/src -I/Users/stephen/.node-gyp/11.13.0/deps/uv/include -I/Users/stephen/.node-gyp/11.13.0/deps/v8/include -I../src/libsass/include -Os -gdwarf-2 -mmacosx-version-min=10.7 -arch x86_64 -Wall -Wendif-labels -W -Wno-unused-parameter -std=c++11 -stdlib=libc++ -fno-strict-aliasing -MMD -MF ./Release/.deps/Release/obj.target/libsass/src/libsass/src/output.o.d.raw -c -o Release/obj.target/libsass/src/libsass/src/output.o ../src/libsass/src/output.cpp
c++ '-DNODE_GYP_MODULE_NAME=libsass' '-DUSING_UV_SHARED=1' '-DUSING_V8_SHARED=1' '-DV8_DEPRECATION_WARNINGS=1' '-D_DARWIN_USE_64_BIT_INODE=1' '-D_LARGEFILE_SOURCE' '-D_FILE_OFFSET_BITS=64' '-DLIBSASS_VERSION="3.5.0.beta.2"' -I/Users/stephen/.node-gyp/11.13.0/include/node -I/Users/stephen/.node-gyp/11.13.0/src -I/Users/stephen/.node-gyp/11.13.0/deps/uv/include -I/Users/stephen/.node-gyp/11.13.0/deps/v8/include -I../src/libsass/include -Os -gdwarf-2 -mmacosx-version-min=10.7 -arch x86_64 -Wall -Wendif-labels -W -Wno-unused-parameter -std=c++11 -stdlib=libc++ -fno-strict-aliasing -MMD -MF ./Release/.deps/Release/obj.target/libsass/src/libsass/src/parser.o.d.raw -c -o Release/obj.target/libsass/src/libsass/src/parser.o ../src/libsass/src/parser.cpp
c++ '-DNODE_GYP_MODULE_NAME=libsass' '-DUSING_UV_SHARED=1' '-DUSING_V8_SHARED=1' '-DV8_DEPRECATION_WARNINGS=1' '-D_DARWIN_USE_64_BIT_INODE=1' '-D_LARGEFILE_SOURCE' '-D_FILE_OFFSET_BITS=64' '-DLIBSASS_VERSION="3.5.0.beta.2"' -I/Users/stephen/.node-gyp/11.13.0/include/node -I/Users/stephen/.node-gyp/11.13.0/src -I/Users/stephen/.node-gyp/11.13.0/deps/uv/include -I/Users/stephen/.node-gyp/11.13.0/deps/v8/include -I../src/libsass/include -Os -gdwarf-2 -mmacosx-version-min=10.7 -arch x86_64 -Wall -Wendif-labels -W -Wno-unused-parameter -std=c++11 -stdlib=libc++ -fno-strict-aliasing -MMD -MF ./Release/.deps/Release/obj.target/libsass/src/libsass/src/plugins.o.d.raw -c -o Release/obj.target/libsass/src/libsass/src/plugins.o ../src/libsass/src/plugins.cpp
c++ '-DNODE_GYP_MODULE_NAME=libsass' '-DUSING_UV_SHARED=1' '-DUSING_V8_SHARED=1' '-DV8_DEPRECATION_WARNINGS=1' '-D_DARWIN_USE_64_BIT_INODE=1' '-D_LARGEFILE_SOURCE' '-D_FILE_OFFSET_BITS=64' '-DLIBSASS_VERSION="3.5.0.beta.2"' -I/Users/stephen/.node-gyp/11.13.0/include/node -I/Users/stephen/.node-gyp/11.13.0/src -I/Users/stephen/.node-gyp/11.13.0/deps/uv/include -I/Users/stephen/.node-gyp/11.13.0/deps/v8/include -I../src/libsass/include -Os -gdwarf-2 -mmacosx-version-min=10.7 -arch x86_64 -Wall -Wendif-labels -W -Wno-unused-parameter -std=c++11 -stdlib=libc++ -fno-strict-aliasing -MMD -MF ./Release/.deps/Release/obj.target/libsass/src/libsass/src/position.o.d.raw -c -o Release/obj.target/libsass/src/libsass/src/position.o ../src/libsass/src/position.cpp
c++ '-DNODE_GYP_MODULE_NAME=libsass' '-DUSING_UV_SHARED=1' '-DUSING_V8_SHARED=1' '-DV8_DEPRECATION_WARNINGS=1' '-D_DARWIN_USE_64_BIT_INODE=1' '-D_LARGEFILE_SOURCE' '-D_FILE_OFFSET_BITS=64' '-DLIBSASS_VERSION="3.5.0.beta.2"' -I/Users/stephen/.node-gyp/11.13.0/include/node -I/Users/stephen/.node-gyp/11.13.0/src -I/Users/stephen/.node-gyp/11.13.0/deps/uv/include -I/Users/stephen/.node-gyp/11.13.0/deps/v8/include -I../src/libsass/include -Os -gdwarf-2 -mmacosx-version-min=10.7 -arch x86_64 -Wall -Wendif-labels -W -Wno-unused-parameter -std=c++11 -stdlib=libc++ -fno-strict-aliasing -MMD -MF ./Release/.deps/Release/obj.target/libsass/src/libsass/src/prelexer.o.d.raw -c -o Release/obj.target/libsass/src/libsass/src/prelexer.o ../src/libsass/src/prelexer.cpp
c++ '-DNODE_GYP_MODULE_NAME=libsass' '-DUSING_UV_SHARED=1' '-DUSING_V8_SHARED=1' '-DV8_DEPRECATION_WARNINGS=1' '-D_DARWIN_USE_64_BIT_INODE=1' '-D_LARGEFILE_SOURCE' '-D_FILE_OFFSET_BITS=64' '-DLIBSASS_VERSION="3.5.0.beta.2"' -I/Users/stephen/.node-gyp/11.13.0/include/node -I/Users/stephen/.node-gyp/11.13.0/src -I/Users/stephen/.node-gyp/11.13.0/deps/uv/include -I/Users/stephen/.node-gyp/11.13.0/deps/v8/include -I../src/libsass/include -Os -gdwarf-2 -mmacosx-version-min=10.7 -arch x86_64 -Wall -Wendif-labels -W -Wno-unused-parameter -std=c++11 -stdlib=libc++ -fno-strict-aliasing -MMD -MF ./Release/.deps/Release/obj.target/libsass/src/libsass/src/remove_placeholders.o.d.raw -c -o Release/obj.target/libsass/src/libsass/src/remove_placeholders.o ../src/libsass/src/remove_placeholders.cpp
c++ '-DNODE_GYP_MODULE_NAME=libsass' '-DUSING_UV_SHARED=1' '-DUSING_V8_SHARED=1' '-DV8_DEPRECATION_WARNINGS=1' '-D_DARWIN_USE_64_BIT_INODE=1' '-D_LARGEFILE_SOURCE' '-D_FILE_OFFSET_BITS=64' '-DLIBSASS_VERSION="3.5.0.beta.2"' -I/Users/stephen/.node-gyp/11.13.0/include/node -I/Users/stephen/.node-gyp/11.13.0/src -I/Users/stephen/.node-gyp/11.13.0/deps/uv/include -I/Users/stephen/.node-gyp/11.13.0/deps/v8/include -I../src/libsass/include -Os -gdwarf-2 -mmacosx-version-min=10.7 -arch x86_64 -Wall -Wendif-labels -W -Wno-unused-parameter -std=c++11 -stdlib=libc++ -fno-strict-aliasing -MMD -MF ./Release/.deps/Release/obj.target/libsass/src/libsass/src/sass.o.d.raw -c -o Release/obj.target/libsass/src/libsass/src/sass.o ../src/libsass/src/sass.cpp
c++ '-DNODE_GYP_MODULE_NAME=libsass' '-DUSING_UV_SHARED=1' '-DUSING_V8_SHARED=1' '-DV8_DEPRECATION_WARNINGS=1' '-D_DARWIN_USE_64_BIT_INODE=1' '-D_LARGEFILE_SOURCE' '-D_FILE_OFFSET_BITS=64' '-DLIBSASS_VERSION="3.5.0.beta.2"' -I/Users/stephen/.node-gyp/11.13.0/include/node -I/Users/stephen/.node-gyp/11.13.0/src -I/Users/stephen/.node-gyp/11.13.0/deps/uv/include -I/Users/stephen/.node-gyp/11.13.0/deps/v8/include -I../src/libsass/include -Os -gdwarf-2 -mmacosx-version-min=10.7 -arch x86_64 -Wall -Wendif-labels -W -Wno-unused-parameter -std=c++11 -stdlib=libc++ -fno-strict-aliasing -MMD -MF ./Release/.deps/Release/obj.target/libsass/src/libsass/src/sass2scss.o.d.raw -c -o Release/obj.target/libsass/src/libsass/src/sass2scss.o ../src/libsass/src/sass2scss.cpp
c++ '-DNODE_GYP_MODULE_NAME=libsass' '-DUSING_UV_SHARED=1' '-DUSING_V8_SHARED=1' '-DV8_DEPRECATION_WARNINGS=1' '-D_DARWIN_USE_64_BIT_INODE=1' '-D_LARGEFILE_SOURCE' '-D_FILE_OFFSET_BITS=64' '-DLIBSASS_VERSION="3.5.0.beta.2"' -I/Users/stephen/.node-gyp/11.13.0/include/node -I/Users/stephen/.node-gyp/11.13.0/src -I/Users/stephen/.node-gyp/11.13.0/deps/uv/include -I/Users/stephen/.node-gyp/11.13.0/deps/v8/include -I../src/libsass/include -Os -gdwarf-2 -mmacosx-version-min=10.7 -arch x86_64 -Wall -Wendif-labels -W -Wno-unused-parameter -std=c++11 -stdlib=libc++ -fno-strict-aliasing -MMD -MF ./Release/.deps/Release/obj.target/libsass/src/libsass/src/sass_context.o.d.raw -c -o Release/obj.target/libsass/src/libsass/src/sass_context.o ../src/libsass/src/sass_context.cpp
c++ '-DNODE_GYP_MODULE_NAME=libsass' '-DUSING_UV_SHARED=1' '-DUSING_V8_SHARED=1' '-DV8_DEPRECATION_WARNINGS=1' '-D_DARWIN_USE_64_BIT_INODE=1' '-D_LARGEFILE_SOURCE' '-D_FILE_OFFSET_BITS=64' '-DLIBSASS_VERSION="3.5.0.beta.2"' -I/Users/stephen/.node-gyp/11.13.0/include/node -I/Users/stephen/.node-gyp/11.13.0/src -I/Users/stephen/.node-gyp/11.13.0/deps/uv/include -I/Users/stephen/.node-gyp/11.13.0/deps/v8/include -I../src/libsass/include -Os -gdwarf-2 -mmacosx-version-min=10.7 -arch x86_64 -Wall -Wendif-labels -W -Wno-unused-parameter -std=c++11 -stdlib=libc++ -fno-strict-aliasing -MMD -MF ./Release/.deps/Release/obj.target/libsass/src/libsass/src/sass_functions.o.d.raw -c -o Release/obj.target/libsass/src/libsass/src/sass_functions.o ../src/libsass/src/sass_functions.cpp
c++ '-DNODE_GYP_MODULE_NAME=libsass' '-DUSING_UV_SHARED=1' '-DUSING_V8_SHARED=1' '-DV8_DEPRECATION_WARNINGS=1' '-D_DARWIN_USE_64_BIT_INODE=1' '-D_LARGEFILE_SOURCE' '-D_FILE_OFFSET_BITS=64' '-DLIBSASS_VERSION="3.5.0.beta.2"' -I/Users/stephen/.node-gyp/11.13.0/include/node -I/Users/stephen/.node-gyp/11.13.0/src -I/Users/stephen/.node-gyp/11.13.0/deps/uv/include -I/Users/stephen/.node-gyp/11.13.0/deps/v8/include -I../src/libsass/include -Os -gdwarf-2 -mmacosx-version-min=10.7 -arch x86_64 -Wall -Wendif-labels -W -Wno-unused-parameter -std=c++11 -stdlib=libc++ -fno-strict-aliasing -MMD -MF ./Release/.deps/Release/obj.target/libsass/src/libsass/src/sass_util.o.d.raw -c -o Release/obj.target/libsass/src/libsass/src/sass_util.o ../src/libsass/src/sass_util.cpp
c++ '-DNODE_GYP_MODULE_NAME=libsass' '-DUSING_UV_SHARED=1' '-DUSING_V8_SHARED=1' '-DV8_DEPRECATION_WARNINGS=1' '-D_DARWIN_USE_64_BIT_INODE=1' '-D_LARGEFILE_SOURCE' '-D_FILE_OFFSET_BITS=64' '-DLIBSASS_VERSION="3.5.0.beta.2"' -I/Users/stephen/.node-gyp/11.13.0/include/node -I/Users/stephen/.node-gyp/11.13.0/src -I/Users/stephen/.node-gyp/11.13.0/deps/uv/include -I/Users/stephen/.node-gyp/11.13.0/deps/v8/include -I../src/libsass/include -Os -gdwarf-2 -mmacosx-version-min=10.7 -arch x86_64 -Wall -Wendif-labels -W -Wno-unused-parameter -std=c++11 -stdlib=libc++ -fno-strict-aliasing -MMD -MF ./Release/.deps/Release/obj.target/libsass/src/libsass/src/sass_values.o.d.raw -c -o Release/obj.target/libsass/src/libsass/src/sass_values.o ../src/libsass/src/sass_values.cpp
c++ '-DNODE_GYP_MODULE_NAME=libsass' '-DUSING_UV_SHARED=1' '-DUSING_V8_SHARED=1' '-DV8_DEPRECATION_WARNINGS=1' '-D_DARWIN_USE_64_BIT_INODE=1' '-D_LARGEFILE_SOURCE' '-D_FILE_OFFSET_BITS=64' '-DLIBSASS_VERSION="3.5.0.beta.2"' -I/Users/stephen/.node-gyp/11.13.0/include/node -I/Users/stephen/.node-gyp/11.13.0/src -I/Users/stephen/.node-gyp/11.13.0/deps/uv/include -I/Users/stephen/.node-gyp/11.13.0/deps/v8/include -I../src/libsass/include -Os -gdwarf-2 -mmacosx-version-min=10.7 -arch x86_64 -Wall -Wendif-labels -W -Wno-unused-parameter -std=c++11 -stdlib=libc++ -fno-strict-aliasing -MMD -MF ./Release/.deps/Release/obj.target/libsass/src/libsass/src/source_map.o.d.raw -c -o Release/obj.target/libsass/src/libsass/src/source_map.o ../src/libsass/src/source_map.cpp
c++ '-DNODE_GYP_MODULE_NAME=libsass' '-DUSING_UV_SHARED=1' '-DUSING_V8_SHARED=1' '-DV8_DEPRECATION_WARNINGS=1' '-D_DARWIN_USE_64_BIT_INODE=1' '-D_LARGEFILE_SOURCE' '-D_FILE_OFFSET_BITS=64' '-DLIBSASS_VERSION="3.5.0.beta.2"' -I/Users/stephen/.node-gyp/11.13.0/include/node -I/Users/stephen/.node-gyp/11.13.0/src -I/Users/stephen/.node-gyp/11.13.0/deps/uv/include -I/Users/stephen/.node-gyp/11.13.0/deps/v8/include -I../src/libsass/include -Os -gdwarf-2 -mmacosx-version-min=10.7 -arch x86_64 -Wall -Wendif-labels -W -Wno-unused-parameter -std=c++11 -stdlib=libc++ -fno-strict-aliasing -MMD -MF ./Release/.deps/Release/obj.target/libsass/src/libsass/src/subset_map.o.d.raw -c -o Release/obj.target/libsass/src/libsass/src/subset_map.o ../src/libsass/src/subset_map.cpp
c++ '-DNODE_GYP_MODULE_NAME=libsass' '-DUSING_UV_SHARED=1' '-DUSING_V8_SHARED=1' '-DV8_DEPRECATION_WARNINGS=1' '-D_DARWIN_USE_64_BIT_INODE=1' '-D_LARGEFILE_SOURCE' '-D_FILE_OFFSET_BITS=64' '-DLIBSASS_VERSION="3.5.0.beta.2"' -I/Users/stephen/.node-gyp/11.13.0/include/node -I/Users/stephen/.node-gyp/11.13.0/src -I/Users/stephen/.node-gyp/11.13.0/deps/uv/include -I/Users/stephen/.node-gyp/11.13.0/deps/v8/include -I../src/libsass/include -Os -gdwarf-2 -mmacosx-version-min=10.7 -arch x86_64 -Wall -Wendif-labels -W -Wno-unused-parameter -std=c++11 -stdlib=libc++ -fno-strict-aliasing -MMD -MF ./Release/.deps/Release/obj.target/libsass/src/libsass/src/to_c.o.d.raw -c -o Release/obj.target/libsass/src/libsass/src/to_c.o ../src/libsass/src/to_c.cpp
c++ '-DNODE_GYP_MODULE_NAME=libsass' '-DUSING_UV_SHARED=1' '-DUSING_V8_SHARED=1' '-DV8_DEPRECATION_WARNINGS=1' '-D_DARWIN_USE_64_BIT_INODE=1' '-D_LARGEFILE_SOURCE' '-D_FILE_OFFSET_BITS=64' '-DLIBSASS_VERSION="3.5.0.beta.2"' -I/Users/stephen/.node-gyp/11.13.0/include/node -I/Users/stephen/.node-gyp/11.13.0/src -I/Users/stephen/.node-gyp/11.13.0/deps/uv/include -I/Users/stephen/.node-gyp/11.13.0/deps/v8/include -I../src/libsass/include -Os -gdwarf-2 -mmacosx-version-min=10.7 -arch x86_64 -Wall -Wendif-labels -W -Wno-unused-parameter -std=c++11 -stdlib=libc++ -fno-strict-aliasing -MMD -MF ./Release/.deps/Release/obj.target/libsass/src/libsass/src/to_value.o.d.raw -c -o Release/obj.target/libsass/src/libsass/src/to_value.o ../src/libsass/src/to_value.cpp
c++ '-DNODE_GYP_MODULE_NAME=libsass' '-DUSING_UV_SHARED=1' '-DUSING_V8_SHARED=1' '-DV8_DEPRECATION_WARNINGS=1' '-D_DARWIN_USE_64_BIT_INODE=1' '-D_LARGEFILE_SOURCE' '-D_FILE_OFFSET_BITS=64' '-DLIBSASS_VERSION="3.5.0.beta.2"' -I/Users/stephen/.node-gyp/11.13.0/include/node -I/Users/stephen/.node-gyp/11.13.0/src -I/Users/stephen/.node-gyp/11.13.0/deps/uv/include -I/Users/stephen/.node-gyp/11.13.0/deps/v8/include -I../src/libsass/include -Os -gdwarf-2 -mmacosx-version-min=10.7 -arch x86_64 -Wall -Wendif-labels -W -Wno-unused-parameter -std=c++11 -stdlib=libc++ -fno-strict-aliasing -MMD -MF ./Release/.deps/Release/obj.target/libsass/src/libsass/src/units.o.d.raw -c -o Release/obj.target/libsass/src/libsass/src/units.o ../src/libsass/src/units.cpp
c++ '-DNODE_GYP_MODULE_NAME=libsass' '-DUSING_UV_SHARED=1' '-DUSING_V8_SHARED=1' '-DV8_DEPRECATION_WARNINGS=1' '-D_DARWIN_USE_64_BIT_INODE=1' '-D_LARGEFILE_SOURCE' '-D_FILE_OFFSET_BITS=64' '-DLIBSASS_VERSION="3.5.0.beta.2"' -I/Users/stephen/.node-gyp/11.13.0/include/node -I/Users/stephen/.node-gyp/11.13.0/src -I/Users/stephen/.node-gyp/11.13.0/deps/uv/include -I/Users/stephen/.node-gyp/11.13.0/deps/v8/include -I../src/libsass/include -Os -gdwarf-2 -mmacosx-version-min=10.7 -arch x86_64 -Wall -Wendif-labels -W -Wno-unused-parameter -std=c++11 -stdlib=libc++ -fno-strict-aliasing -MMD -MF ./Release/.deps/Release/obj.target/libsass/src/libsass/src/utf8_string.o.d.raw -c -o Release/obj.target/libsass/src/libsass/src/utf8_string.o ../src/libsass/src/utf8_string.cpp
c++ '-DNODE_GYP_MODULE_NAME=libsass' '-DUSING_UV_SHARED=1' '-DUSING_V8_SHARED=1' '-DV8_DEPRECATION_WARNINGS=1' '-D_DARWIN_USE_64_BIT_INODE=1' '-D_LARGEFILE_SOURCE' '-D_FILE_OFFSET_BITS=64' '-DLIBSASS_VERSION="3.5.0.beta.2"' -I/Users/stephen/.node-gyp/11.13.0/include/node -I/Users/stephen/.node-gyp/11.13.0/src -I/Users/stephen/.node-gyp/11.13.0/deps/uv/include -I/Users/stephen/.node-gyp/11.13.0/deps/v8/include -I../src/libsass/include -Os -gdwarf-2 -mmacosx-version-min=10.7 -arch x86_64 -Wall -Wendif-labels -W -Wno-unused-parameter -std=c++11 -stdlib=libc++ -fno-strict-aliasing -MMD -MF ./Release/.deps/Release/obj.target/libsass/src/libsass/src/util.o.d.raw -c -o Release/obj.target/libsass/src/libsass/src/util.o ../src/libsass/src/util.cpp
c++ '-DNODE_GYP_MODULE_NAME=libsass' '-DUSING_UV_SHARED=1' '-DUSING_V8_SHARED=1' '-DV8_DEPRECATION_WARNINGS=1' '-D_DARWIN_USE_64_BIT_INODE=1' '-D_LARGEFILE_SOURCE' '-D_FILE_OFFSET_BITS=64' '-DLIBSASS_VERSION="3.5.0.beta.2"' -I/Users/stephen/.node-gyp/11.13.0/include/node -I/Users/stephen/.node-gyp/11.13.0/src -I/Users/stephen/.node-gyp/11.13.0/deps/uv/include -I/Users/stephen/.node-gyp/11.13.0/deps/v8/include -I../src/libsass/include -Os -gdwarf-2 -mmacosx-version-min=10.7 -arch x86_64 -Wall -Wendif-labels -W -Wno-unused-parameter -std=c++11 -stdlib=libc++ -fno-strict-aliasing -MMD -MF ./Release/.deps/Release/obj.target/libsass/src/libsass/src/values.o.d.raw -c -o Release/obj.target/libsass/src/libsass/src/values.o ../src/libsass/src/values.cpp
rm -f Release/sass.a && ./gyp-mac-tool filter-libtool libtool -static -o Release/sass.a Release/obj.target/libsass/src/libsass/src/ast.o Release/obj.target/libsass/src/libsass/src/ast_fwd_decl.o Release/obj.target/libsass/src/libsass/src/base64vlq.o Release/obj.target/libsass/src/libsass/src/bind.o Release/obj.target/libsass/src/libsass/src/cencode.o Release/obj.target/libsass/src/libsass/src/check_nesting.o Release/obj.target/libsass/src/libsass/src/color_maps.o Release/obj.target/libsass/src/libsass/src/constants.o Release/obj.target/libsass/src/libsass/src/context.o Release/obj.target/libsass/src/libsass/src/cssize.o Release/obj.target/libsass/src/libsass/src/emitter.o Release/obj.target/libsass/src/libsass/src/environment.o Release/obj.target/libsass/src/libsass/src/error_handling.o Release/obj.target/libsass/src/libsass/src/eval.o Release/obj.target/libsass/src/libsass/src/expand.o Release/obj.target/libsass/src/libsass/src/extend.o Release/obj.target/libsass/src/libsass/src/file.o Release/obj.target/libsass/src/libsass/src/functions.o Release/obj.target/libsass/src/libsass/src/inspect.o Release/obj.target/libsass/src/libsass/src/json.o Release/obj.target/libsass/src/libsass/src/lexer.o Release/obj.target/libsass/src/libsass/src/listize.o Release/obj.target/libsass/src/libsass/src/memory/SharedPtr.o Release/obj.target/libsass/src/libsass/src/node.o Release/obj.target/libsass/src/libsass/src/output.o Release/obj.target/libsass/src/libsass/src/parser.o Release/obj.target/libsass/src/libsass/src/plugins.o Release/obj.target/libsass/src/libsass/src/position.o Release/obj.target/libsass/src/libsass/src/prelexer.o Release/obj.target/libsass/src/libsass/src/remove_placeholders.o Release/obj.target/libsass/src/libsass/src/sass.o Release/obj.target/libsass/src/libsass/src/sass2scss.o Release/obj.target/libsass/src/libsass/src/sass_context.o Release/obj.target/libsass/src/libsass/src/sass_functions.o Release/obj.target/libsass/src/libsass/src/sass_util.o Release/obj.target/libsass/src/libsass/src/sass_values.o Release/obj.target/libsass/src/libsass/src/source_map.o Release/obj.target/libsass/src/libsass/src/subset_map.o Release/obj.target/libsass/src/libsass/src/to_c.o Release/obj.target/libsass/src/libsass/src/to_value.o Release/obj.target/libsass/src/libsass/src/units.o Release/obj.target/libsass/src/libsass/src/utf8_string.o Release/obj.target/libsass/src/libsass/src/util.o Release/obj.target/libsass/src/libsass/src/values.o
c++ '-DNODE_GYP_MODULE_NAME=binding' '-DUSING_UV_SHARED=1' '-DUSING_V8_SHARED=1' '-DV8_DEPRECATION_WARNINGS=1' '-D_DARWIN_USE_64_BIT_INODE=1' '-D_LARGEFILE_SOURCE' '-D_FILE_OFFSET_BITS=64' '-DBUILDING_NODE_EXTENSION' -I/Users/stephen/.node-gyp/11.13.0/include/node -I/Users/stephen/.node-gyp/11.13.0/src -I/Users/stephen/.node-gyp/11.13.0/deps/uv/include -I/Users/stephen/.node-gyp/11.13.0/deps/v8/include -I../../nan -I../src/libsass/include -Os -gdwarf-2 -mmacosx-version-min=10.7 -arch x86_64 -Wall -Wendif-labels -W -Wno-unused-parameter -std=gnu++1y -stdlib=libc++ -fno-rtti -fno-exceptions -std=c++11 -MMD -MF ./Release/.deps/Release/obj.target/binding/src/binding.o.d.raw -c -o Release/obj.target/binding/src/binding.o ../src/binding.cpp
In file included from ../src/binding.cpp:1:
In file included from ../../nan/nan.h:192:
../../nan/nan_maybe_43_inl.h:112:15: error: no member named 'ForceSet' in 'v8::Object'
return obj->ForceSet(isolate->GetCurrentContext(), key, value, attribs);
~~~ ^
In file included from ../src/binding.cpp:1:
In file included from ../../nan/nan.h:198:
In file included from ../../nan/nan_new.h:189:
../../nan/nan_implementation_12_inl.h:337:28: warning: 'New' is deprecated: Use Isolate* version [-Wdeprecated-declarations]
return v8::StringObject::New(value).As<v8::StringObject>();
^
/Users/stephen/.node-gyp/11.13.0/include/node/v8.h:5241:3: note: 'New' has been explicitly marked deprecated here
V8_DEPRECATED("Use Isolate* version",
^
/Users/stephen/.node-gyp/11.13.0/include/node/v8config.h:326:29: note: expanded from macro 'V8_DEPRECATED'
declarator __attribute__((deprecated(message)))
^
In file included from ../src/binding.cpp:1:
../../nan/nan.h:834:18: warning: 'MakeCallback' is deprecated: Use MakeCallback(..., async_context) [-Wdeprecated-declarations]
return node::MakeCallback(
^
/Users/stephen/.node-gyp/11.13.0/include/node/node.h:171:1: note: 'MakeCallback' has been explicitly marked deprecated here
NODE_DEPRECATED("Use MakeCallback(..., async_context)",
^
/Users/stephen/.node-gyp/11.13.0/include/node/node.h:91:20: note: expanded from macro 'NODE_DEPRECATED'
__attribute__((deprecated(message))) declarator
^
In file included from ../src/binding.cpp:1:
../../nan/nan.h:849:18: warning: 'MakeCallback' is deprecated: Use MakeCallback(..., async_context) [-Wdeprecated-declarations]
return node::MakeCallback(
^
/Users/stephen/.node-gyp/11.13.0/include/node/node.h:164:1: note: 'MakeCallback' has been explicitly marked deprecated here
NODE_DEPRECATED("Use MakeCallback(..., async_context)",
^
/Users/stephen/.node-gyp/11.13.0/include/node/node.h:91:20: note: expanded from macro 'NODE_DEPRECATED'
__attribute__((deprecated(message))) declarator
^
In file included from ../src/binding.cpp:1:
../../nan/nan.h:864:18: warning: 'MakeCallback' is deprecated: Use MakeCallback(..., async_context) [-Wdeprecated-declarations]
return node::MakeCallback(
^
/Users/stephen/.node-gyp/11.13.0/include/node/node.h:157:1: note: 'MakeCallback' has been explicitly marked deprecated here
NODE_DEPRECATED("Use MakeCallback(..., async_context)",
^
/Users/stephen/.node-gyp/11.13.0/include/node/node.h:91:20: note: expanded from macro 'NODE_DEPRECATED'
__attribute__((deprecated(message))) declarator
^
In file included from ../src/binding.cpp:1:
../../nan/nan.h:911:44: warning: 'ToString' is deprecated: Use maybe version [-Wdeprecated-declarations]
v8::Local<v8::String> string = from->ToString();
^
/Users/stephen/.node-gyp/11.13.0/include/node/v8.h:2548:10: note: 'ToString' has been explicitly marked deprecated here
inline V8_DEPRECATED("Use maybe version", Local<String> ToString() const);
^
/Users/stephen/.node-gyp/11.13.0/include/node/v8config.h:326:29: note: expanded from macro 'V8_DEPRECATED'
declarator __attribute__((deprecated(message)))
^
In file included from ../src/binding.cpp:1:
../../nan/nan.h:921:27: warning: 'WriteUtf8' is deprecated: Use Isolate* version [-Wdeprecated-declarations]
length_ = string->WriteUtf8(str_, static_cast<int>(len), 0, flags);
^
/Users/stephen/.node-gyp/11.13.0/include/node/v8.h:2753:3: note: 'WriteUtf8' has been explicitly marked deprecated here
V8_DEPRECATED("Use Isolate* version",
^
/Users/stephen/.node-gyp/11.13.0/include/node/v8config.h:326:29: note: expanded from macro 'V8_DEPRECATED'
declarator __attribute__((deprecated(message)))
^
In file included from ../src/binding.cpp:1:
../../nan/nan.h:1473:31: warning: 'MakeCallback' is deprecated: Use MakeCallback(..., async_context) [-Wdeprecated-declarations]
return scope.Escape(node::MakeCallback(
^
/Users/stephen/.node-gyp/11.13.0/include/node/node.h:171:1: note: 'MakeCallback' has been explicitly marked deprecated here
NODE_DEPRECATED("Use MakeCallback(..., async_context)",
^
/Users/stephen/.node-gyp/11.13.0/include/node/node.h:91:20: note: expanded from macro 'NODE_DEPRECATED'
__attribute__((deprecated(message))) declarator
^
7 warnings and 1 error generated.
make: *** [Release/obj.target/binding/src/binding.o] Error 1
gyp ERR! build error
gyp ERR! stack Error: `make` failed with exit code: 2
gyp ERR! stack at ChildProcess.onExit (/Users/stephen/dev/elm/apps/elm-ports-example/node_modules/node-gyp/lib/build.js:258:23)
gyp ERR! stack at ChildProcess.emit (events.js:193:13)
gyp ERR! stack at Process.ChildProcess._handle.onexit (internal/child_process.js:255:12)
gyp ERR! System Darwin 18.5.0
gyp ERR! command "/Users/stephen/.asdf/installs/nodejs/11.13.0/bin/node" "/Users/stephen/dev/elm/apps/elm-ports-example/node_modules/node-gyp/bin/node-gyp.js" "rebuild" "--verbose" "--libsass_ext=" "--libsass_cflags=" "--libsass_ldflags=" "--libsass_library="
gyp ERR! cwd /Users/stephen/dev/elm/apps/elm-ports-example/node_modules/node-sass
gyp ERR! node -v v11.13.0
gyp ERR! node-gyp -v v3.6.2
Sign up for free to join this conversation on GitHub. Already have an account? Sign in to comment
You can’t perform that action at this time.