[...] net.continuumsecurity.junit.SecurityTest > Scenario: Transmit authentication credentials over HTTPS.Then the protocol should be HTTPS FAILED java.lang.AssertionError [...] Report available on: /Users/.../bdd-security/build/reports/cucumber/pretty/feature-overview.html [...] BUILD FAILED