Skip to content

Instantly share code, notes, and snippets.

Embed
What would you like to do?
CMakeFiles/minetestserver.dir/convert_json.cpp.o: In function `fetchJsonValue(std::string const&, std::vector<std::string, std::allocator<std::string> >*)':
convert_json.cpp:(.text+0x68e): undefined reference to `Json::Value::Value(Json::Value&&)'
CMakeFiles/minetestserver.dir/serverlist.cpp.o: In function `ServerList::deleteEntry(Json::Value const&)':
serverlist.cpp:(.text+0x22c7): undefined reference to `Json::Value::Value(Json::Value&&)'
serverlist.cpp:(.text+0x230d): undefined reference to `Json::Value::Value(Json::Value&&)'
serverlist.cpp:(.text+0x2339): undefined reference to `Json::Value::Value(Json::Value&&)'
serverlist.cpp:(.text+0x2365): undefined reference to `Json::Value::Value(Json::Value&&)'
CMakeFiles/minetestserver.dir/serverlist.cpp.o:serverlist.cpp:(.text+0x239d): more undefined references to `Json::Value::Value(Json::Value&&)' follow
collect2: error: ld returned 1 exit status
src/CMakeFiles/minetestserver.dir/build.make:4294: recipe for target 'bin/minetestserver' failed
make[2]: *** [bin/minetestserver] Error 1
CMakeFiles/Makefile2:216: recipe for target 'src/CMakeFiles/minetestserver.dir/all' failed
make[1]: *** [src/CMakeFiles/minetestserver.dir/all] Error 2
make[1]: *** Waiting for unfinished jobs....
Sign up for free to join this conversation on GitHub. Already have an account? Sign in to comment
You can’t perform that action at this time.