Skip to content

@takluyver /gist:1118181
Created

Embed URL

HTTPS clone URL

Subversion checkout URL

You can clone with
or
.
Download ZIP
IPython.parallel test failures
iptest IPython.parallel
..............................................................FSSSSSSSSSS.................................F
======================================================================
FAIL: test graceful handling of engine death (balanced)
----------------------------------------------------------------------
Traceback (most recent call last):
File "/home/thomas/code/virtualenvs/ipy-trunk/lib/python2.7/site-packages/IPython/parallel/tests/test_lbview.py", line 44, in test_z_crash_task
self.assertRaisesRemote(error.EngineError, ar.get, 10)
File "/home/thomas/code/virtualenvs/ipy-trunk/lib/python2.7/site-packages/IPython/parallel/tests/clienttest.py", line 109, in assertRaisesRemote
self.assertEquals(etype.__name__, e.ename, "Should have raised %r, but raised %r"%(etype.__name__, e.ename))
AssertionError: Should have raised 'EngineError', but raised 'NameError'
"'EngineError' != 'NameError'" = '%s != %s' % (safe_repr('EngineError'), safe_repr('NameError'))
"Should have raised 'EngineError', but raised 'NameError'" = self._formatMessage("Should have raised 'EngineError', but raised 'NameError'", "'EngineError' != 'NameError'")
>> raise self.failureException("Should have raised 'EngineError', but raised 'NameError'")
======================================================================
FAIL: test graceful handling of engine death (direct)
----------------------------------------------------------------------
Traceback (most recent call last):
File "/home/thomas/code/virtualenvs/ipy-trunk/lib/python2.7/site-packages/IPython/parallel/tests/test_view.py", line 46, in test_z_crash_mux
self.assertRaisesRemote(error.EngineError, ar.get, 10)
File "/home/thomas/code/virtualenvs/ipy-trunk/lib/python2.7/site-packages/IPython/parallel/tests/clienttest.py", line 109, in assertRaisesRemote
self.assertEquals(etype.__name__, e.ename, "Should have raised %r, but raised %r"%(etype.__name__, e.ename))
AssertionError: Should have raised 'EngineError', but raised 'NameError'
"'EngineError' != 'NameError'" = '%s != %s' % (safe_repr('EngineError'), safe_repr('NameError'))
"Should have raised 'EngineError', but raised 'NameError'" = self._formatMessage("Should have raised 'EngineError', but raised 'NameError'", "'EngineError' != 'NameError'")
>> raise self.failureException("Should have raised 'EngineError', but raised 'NameError'")
----------------------------------------------------------------------
Ran 107 tests in 48.994s
FAILED (SKIP=10, failures=2)
Sign up for free to join this conversation on GitHub. Already have an account? Sign in to comment
Something went wrong with that request. Please try again.