Create a gist now

Instantly share code, notes, and snippets.

@vjmaiky /fullLog
Last active Oct 11, 2017

What would you like to do?
16:40:50.307 [INFO] [org.gradle.process.internal.DefaultExecHandle] Successfully started process 'Gradle Test Executor 1'
16:40:50.330 [ERROR] [system.err] Java HotSpot(TM) 64-Bit Server VM warning: ignoring option MaxPermSize=256m; support was removed in 8.0
16:40:50.737 [DEBUG] [org.gradle.internal.remote.internal.inet.TcpIncomingConnector] Accepted connection from /0:0:0:0:0:0:0:1:49494 to /0:0:0:0:0:0:0:1:49493.
16:40:50.750 [DEBUG] [org.gradle.process.internal.worker.DefaultWorkerProcess] Received connection org.gradle.internal.remote.internal.hub.MessageHubBackedObjectConnection@15756aa1 from Gradle Test Executor 1
16:40:50.867 [DEBUG] [org.gradle.process.internal.worker.child.ActionExecutionWorker] Starting Gradle Test Executor 1.
16:40:50.908 [INFO] [org.gradle.internal.nativeintegration.services.NativeServices] Initialized native services in: /Users/Shared/Jenkins/.gradle/native
16:40:50.908 [INFO] [org.gradle.api.internal.tasks.testing.worker.TestWorker] Gradle Test Executor 1 started executing tests.
16:40:50.979 [DEBUG] [TestEventLogger]
16:40:50.979 [DEBUG] [TestEventLogger] Gradle Test Executor 1 STARTED
16:40:50.981 [DEBUG] [org.gradle.api.internal.tasks.testing.junit.JUnitTestClassProcessor] Executing test class tests.TestSet_01_FirstTimeView
16:40:50.982 [DEBUG] [TestEventLogger]
16:40:50.982 [DEBUG] [TestEventLogger] tests.TestSet_01_FirstTimeView STARTED
16:40:51.093 [LIFECYCLE] [org.gradle.api.Task] Runnin test: Test ftwIsDisplayedAfterAppPutToBackground(tests.TestSet_01_FirstTimeView)
16:40:51.093 [DEBUG] [TestEventLogger]
16:40:51.093 [DEBUG] [TestEventLogger] tests.TestSet_01_FirstTimeView > ftwIsDisplayedAfterAppPutToBackground STARTED
16:40:51.145 [DEBUG] [TestEventLogger]
16:40:51.145 [DEBUG] [TestEventLogger] tests.TestSet_01_FirstTimeView > ftwIsDisplayedAfterAppPutToBackground STANDARD_OUT
16:40:51.145 [DEBUG] [TestEventLogger] 10-11-2017 16:40:51 - [core.managers.ServerManager / getOS][INFO ] - Running command to see if it is Windows or Mac environment
16:40:51.149 [DEBUG] [TestEventLogger] 10-11-2017 16:40:51 - [core.managers.ServerManager / getOS][INFO ] - Detected OS is: Mac OS X
16:40:51.149 [DEBUG] [TestEventLogger] 10-11-2017 16:40:51 - [core.managers.ServerManager / getOS][INFO ] - Running command to see if it is Windows or Mac environment
16:40:51.152 [DEBUG] [TestEventLogger] 10-11-2017 16:40:51 - [core.managers.ServerManager / getOS][INFO ] - Detected OS is: Mac OS X
16:40:51.152 [DEBUG] [TestEventLogger] 10-11-2017 16:40:51 - [core.managers.ServerManager / getPlatformVersionFromJason][INFO ] - Get Platform Version From Jason
16:40:51.155 [DEBUG] [TestEventLogger] 10-11-2017 16:40:51 - [core.managers.ServerManager / getPlatformVersionFromJason][INFO ] - Platform Version From Jason is: ios
16:40:51.155 [DEBUG] [TestEventLogger] 10-11-2017 16:40:51 - [core.managers.ServerManager / getOS][INFO ] - Running command to see if it is Windows or Mac environment
16:40:51.156 [DEBUG] [TestEventLogger] 10-11-2017 16:40:51 - [core.managers.ServerManager / getOS][INFO ] - Detected OS is: Mac OS X
16:40:51.158 [DEBUG] [TestEventLogger] 10-11-2017 16:40:51 - [core.managers.ServerManager / getPlatformVersionFromJason][INFO ] - Get Platform Version From Jason
16:40:51.159 [DEBUG] [TestEventLogger] 10-11-2017 16:40:51 - [core.managers.ServerManager / getPlatformVersionFromJason][INFO ] - Platform Version From Jason is: ios
16:40:51.159 [DEBUG] [TestEventLogger] 10-11-2017 16:40:51 - [core.managers.TestManager / before][INFO ] - ++++++++++++++++++++++ Driver creation started for Mac Environment ++++++++++++++++++++++
16:40:51.163 [DEBUG] [TestEventLogger] 10-11-2017 16:40:51 - [core.managers.ServerManager / getOS][INFO ] - Running command to see if it is Windows or Mac environment
16:40:51.164 [DEBUG] [TestEventLogger] 10-11-2017 16:40:51 - [core.managers.ServerManager / getOS][INFO ] - Detected OS is: Mac OS X
16:40:51.165 [DEBUG] [TestEventLogger] 10-11-2017 16:40:51 - [core.managers.ServerManager / getOS][INFO ] - Running command to see if it is Windows or Mac environment
16:40:51.165 [DEBUG] [TestEventLogger] 10-11-2017 16:40:51 - [core.managers.ServerManager / getOS][INFO ] - Detected OS is: Mac OS X
16:40:51.167 [DEBUG] [TestEventLogger] 10-11-2017 16:40:51 - [core.managers.ServerManager / getPlatformVersionFromJason][INFO ] - Get Platform Version From Jason
16:40:51.168 [DEBUG] [TestEventLogger] 10-11-2017 16:40:51 - [core.managers.ServerManager / getPlatformVersionFromJason][INFO ] - Platform Version From Jason is: ios
16:40:51.169 [DEBUG] [TestEventLogger] 10-11-2017 16:40:51 - [core.managers.ServerManager / getOS][INFO ] - Running command to see if it is Windows or Mac environment
16:40:51.169 [DEBUG] [TestEventLogger] 10-11-2017 16:40:51 - [core.managers.ServerManager / getOS][INFO ] - Detected OS is: Mac OS X
16:40:51.170 [DEBUG] [TestEventLogger] 10-11-2017 16:40:51 - [core.managers.ServerManager / getPlatformVersionFromJason][INFO ] - Get Platform Version From Jason
16:40:51.170 [DEBUG] [TestEventLogger] 10-11-2017 16:40:51 - [core.managers.ServerManager / getPlatformVersionFromJason][INFO ] - Platform Version From Jason is: ios
16:40:51.172 [DEBUG] [TestEventLogger] 10-11-2017 16:40:51 - [core.managers.DriverManagerIOS / queueUp][INFO ] - Queueing Up: 5d3c119a141e3842c2bb7ac77de8e47bf0c578c4
16:40:51.176 [DEBUG] [TestEventLogger] 10-11-2017 16:40:51 - [core.managers.DriverManagerIOS / queueUp][INFO ] - JSON Queue: {"192.168.92.102:5555":{"queued_at":1502091722673},"2ccf30dd21fa31a77967a66580e6c7ee62ecce88":{"queued_at":1505482692526},"192.168.66.101:5555":{"queued_at":1502086398311},"5d3c119a141e3842c2bb7ac77de8e47bf0c578c4":{"queued_at":1507729251172}}
16:40:51.178 [DEBUG] [TestEventLogger] 10-11-2017 16:40:51 - [core.managers.DriverManagerIOS / createiOSDriver][INFO ] - Trying to create new Driver for device: 5d3c119a141e3842c2bb7ac77de8e47bf0c578c4
16:40:51.205 [DEBUG] [TestEventLogger] 10-11-2017 16:40:51 - [core.managers.ServerManager / getOS][INFO ] - Running command to see if it is Windows or Mac environment
16:40:51.205 [DEBUG] [TestEventLogger] 10-11-2017 16:40:51 - [core.managers.ServerManager / getOS][INFO ] - Detected OS is: Mac OS X
16:40:51.206 [DEBUG] [TestEventLogger] 10-11-2017 16:40:51 - [core.managers.ServerManager / getOS][INFO ] - Running command to see if it is Windows or Mac environment
16:40:51.208 [DEBUG] [TestEventLogger] 10-11-2017 16:40:51 - [core.managers.ServerManager / getOS][INFO ] - Detected OS is: Mac OS X
16:40:51.208 [DEBUG] [TestEventLogger] 10-11-2017 16:40:51 - [core.managers.ServerManager / getPlatformVersionFromJason][INFO ] - Get Platform Version From Jason
16:40:51.209 [DEBUG] [TestEventLogger] 10-11-2017 16:40:51 - [core.managers.ServerManager / getPlatformVersionFromJason][INFO ] - Platform Version From Jason is: ios
16:40:51.210 [DEBUG] [TestEventLogger] 10-11-2017 16:40:51 - [core.managers.ServerManager / getOS][INFO ] - Running command to see if it is Windows or Mac environment
16:40:51.210 [DEBUG] [TestEventLogger] 10-11-2017 16:40:51 - [core.managers.ServerManager / getOS][INFO ] - Detected OS is: Mac OS X
16:40:51.210 [DEBUG] [TestEventLogger] 10-11-2017 16:40:51 - [core.managers.ServerManager / getPlatformVersionFromJason][INFO ] - Get Platform Version From Jason
16:40:51.211 [DEBUG] [TestEventLogger] 10-11-2017 16:40:51 - [core.managers.ServerManager / getPlatformVersionFromJason][INFO ] - Platform Version From Jason is: ios
16:40:51.240 [DEBUG] [TestEventLogger] 10-11-2017 16:40:51 - [core.managers.DriverManagerIOS / createService][INFO ] - +++++++++++++++++++++++ STARTING APPIUM SERVER ++++++++++++++++++++++
16:40:51.241 [DEBUG] [TestEventLogger] 10-11-2017 16:40:51 - [core.managers.ServerManager / getOS][INFO ] - Running command to see if it is Windows or Mac environment
16:40:51.241 [DEBUG] [TestEventLogger] 10-11-2017 16:40:51 - [core.managers.ServerManager / getOS][INFO ] - Detected OS is: Mac OS X
16:40:51.242 [DEBUG] [TestEventLogger] 10-11-2017 16:40:51 - [core.managers.ServerManager / getOS][INFO ] - Running command to see if it is Windows or Mac environment
16:40:51.242 [DEBUG] [TestEventLogger] 10-11-2017 16:40:51 - [core.managers.ServerManager / getOS][INFO ] - Detected OS is: Mac OS X
16:40:51.243 [DEBUG] [TestEventLogger] 10-11-2017 16:40:51 - [core.managers.ServerManager / getPlatformVersionFromJason][INFO ] - Get Platform Version From Jason
16:40:51.244 [DEBUG] [TestEventLogger] 10-11-2017 16:40:51 - [core.managers.ServerManager / getPlatformVersionFromJason][INFO ] - Platform Version From Jason is: ios
16:40:51.245 [DEBUG] [TestEventLogger] 10-11-2017 16:40:51 - [core.managers.ServerManager / getOS][INFO ] - Running command to see if it is Windows or Mac environment
16:40:51.246 [DEBUG] [TestEventLogger] 10-11-2017 16:40:51 - [core.managers.ServerManager / getOS][INFO ] - Detected OS is: Mac OS X
16:40:51.246 [DEBUG] [TestEventLogger] 10-11-2017 16:40:51 - [core.managers.ServerManager / getPlatformVersionFromJason][INFO ] - Get Platform Version From Jason
16:40:51.247 [DEBUG] [TestEventLogger] 10-11-2017 16:40:51 - [core.managers.ServerManager / getPlatformVersionFromJason][INFO ] - Platform Version From Jason is: ios
16:40:51.248 [DEBUG] [TestEventLogger] 10-11-2017 16:40:51 - [core.managers.DriverManagerIOS / createService][INFO ] - Appium server running for device with UDID: 5d3c119a141e3842c2bb7ac77de8e47bf0c578c4
16:40:51.249 [DEBUG] [TestEventLogger] 10-11-2017 16:40:51 - [core.managers.DriverManagerIOS / createService][INFO ] - ++++++++++++++++++ STARTED APPIUM SERVER ++++++++++++++++++: http://127.0.0.1:11177/wd/hub
16:40:56.175 [DEBUG] [TestEventLogger] 10-11-2017 16:40:56 - [core.managers.DriverManagerIOS / getCaps][INFO ] - Creating driver caps for device: 5d3c119a141e3842c2bb7ac77de8e47bf0c578c4
16:40:56.178 [DEBUG] [TestEventLogger] 10-11-2017 16:40:56 - [core.managers.ServerManager / getOS][INFO ] - Running command to see if it is Windows or Mac environment
16:40:56.182 [DEBUG] [TestEventLogger] 10-11-2017 16:40:56 - [core.managers.ServerManager / getOS][INFO ] - Detected OS is: Mac OS X
16:40:56.183 [DEBUG] [TestEventLogger] 10-11-2017 16:40:56 - [core.managers.ServerManager / getOS][INFO ] - Running command to see if it is Windows or Mac environment
16:40:56.183 [DEBUG] [TestEventLogger] 10-11-2017 16:40:56 - [core.managers.ServerManager / getOS][INFO ] - Detected OS is: Mac OS X
16:40:56.183 [DEBUG] [TestEventLogger] 10-11-2017 16:40:56 - [core.managers.ServerManager / getPlatformVersionFromJason][INFO ] - Get Platform Version From Jason
16:40:56.183 [DEBUG] [TestEventLogger] 10-11-2017 16:40:56 - [core.managers.ServerManager / getPlatformVersionFromJason][INFO ] - Platform Version From Jason is: ios
16:40:56.183 [DEBUG] [TestEventLogger] 10-11-2017 16:40:56 - [core.managers.ServerManager / getOS][INFO ] - Running command to see if it is Windows or Mac environment
16:40:56.183 [DEBUG] [TestEventLogger] 10-11-2017 16:40:56 - [core.managers.ServerManager / getOS][INFO ] - Detected OS is: Mac OS X
16:40:56.183 [DEBUG] [TestEventLogger] 10-11-2017 16:40:56 - [core.managers.ServerManager / getPlatformVersionFromJason][INFO ] - Get Platform Version From Jason
16:40:56.184 [DEBUG] [TestEventLogger] 10-11-2017 16:40:56 - [core.managers.ServerManager / getPlatformVersionFromJason][INFO ] - Platform Version From Jason is: ios
16:40:56.193 [DEBUG] [TestEventLogger] 10-11-2017 16:40:56 - [core.managers.ServerManager / getOS][INFO ] - Running command to see if it is Windows or Mac environment
16:40:56.193 [DEBUG] [TestEventLogger] 10-11-2017 16:40:56 - [core.managers.ServerManager / getOS][INFO ] - Detected OS is: Mac OS X
16:40:56.194 [DEBUG] [TestEventLogger] 10-11-2017 16:40:56 - [core.managers.ServerManager / getOS][INFO ] - Running command to see if it is Windows or Mac environment
16:40:56.194 [DEBUG] [TestEventLogger] 10-11-2017 16:40:56 - [core.managers.ServerManager / getOS][INFO ] - Detected OS is: Mac OS X
16:40:56.194 [DEBUG] [TestEventLogger] 10-11-2017 16:40:56 - [core.managers.ServerManager / getPlatformVersionFromJason][INFO ] - Get Platform Version From Jason
16:40:56.194 [DEBUG] [TestEventLogger] 10-11-2017 16:40:56 - [core.managers.ServerManager / getPlatformVersionFromJason][INFO ] - Platform Version From Jason is: ios
16:40:56.194 [DEBUG] [TestEventLogger] 10-11-2017 16:40:56 - [core.managers.ServerManager / getOS][INFO ] - Running command to see if it is Windows or Mac environment
16:40:56.194 [DEBUG] [TestEventLogger] 10-11-2017 16:40:56 - [core.managers.ServerManager / getOS][INFO ] - Detected OS is: Mac OS X
16:40:56.195 [DEBUG] [TestEventLogger] 10-11-2017 16:40:56 - [core.managers.ServerManager / getPlatformVersionFromJason][INFO ] - Get Platform Version From Jason
16:40:56.195 [DEBUG] [TestEventLogger] 10-11-2017 16:40:56 - [core.managers.ServerManager / getPlatformVersionFromJason][INFO ] - Platform Version From Jason is: ios
16:40:56.204 [DEBUG] [TestEventLogger] 10-11-2017 16:40:56 - [core.managers.ServerManager / getOS][INFO ] - Running command to see if it is Windows or Mac environment
16:40:56.204 [DEBUG] [TestEventLogger] 10-11-2017 16:40:56 - [core.managers.ServerManager / getOS][INFO ] - Detected OS is: Mac OS X
16:40:56.204 [DEBUG] [TestEventLogger] 10-11-2017 16:40:56 - [core.managers.ServerManager / getOS][INFO ] - Running command to see if it is Windows or Mac environment
16:40:56.204 [DEBUG] [TestEventLogger] 10-11-2017 16:40:56 - [core.managers.ServerManager / getOS][INFO ] - Detected OS is: Mac OS X
16:40:56.207 [DEBUG] [TestEventLogger] 10-11-2017 16:40:56 - [core.managers.ServerManager / getPlatformVersionFromJason][INFO ] - Get Platform Version From Jason
16:40:56.207 [DEBUG] [TestEventLogger] 10-11-2017 16:40:56 - [core.managers.ServerManager / getPlatformVersionFromJason][INFO ] - Platform Version From Jason is: ios
16:40:56.208 [DEBUG] [TestEventLogger] 10-11-2017 16:40:56 - [core.managers.ServerManager / getOS][INFO ] - Running command to see if it is Windows or Mac environment
16:40:56.208 [DEBUG] [TestEventLogger] 10-11-2017 16:40:56 - [core.managers.ServerManager / getOS][INFO ] - Detected OS is: Mac OS X
16:40:56.208 [DEBUG] [TestEventLogger] 10-11-2017 16:40:56 - [core.managers.ServerManager / getPlatformVersionFromJason][INFO ] - Get Platform Version From Jason
16:40:56.208 [DEBUG] [TestEventLogger] 10-11-2017 16:40:56 - [core.managers.ServerManager / getPlatformVersionFromJason][INFO ] - Platform Version From Jason is: ios
16:40:58.673 [DEBUG] [org.gradle.launcher.daemon.server.Daemon] DaemonExpirationPeriodicCheck running
16:40:58.674 [DEBUG] [org.gradle.cache.internal.DefaultFileLockManager] Waiting to acquire shared lock on daemon addresses registry.
16:40:58.674 [DEBUG] [org.gradle.cache.internal.DefaultFileLockManager] Lock acquired.
16:40:58.674 [DEBUG] [org.gradle.cache.internal.DefaultFileLockManager] Releasing lock on daemon addresses registry.
16:40:58.675 [DEBUG] [org.gradle.cache.internal.DefaultFileLockManager] Waiting to acquire shared lock on daemon addresses registry.
16:40:58.675 [DEBUG] [org.gradle.cache.internal.DefaultFileLockManager] Lock acquired.
16:40:58.675 [DEBUG] [org.gradle.cache.internal.DefaultFileLockManager] Releasing lock on daemon addresses registry.
16:41:08.676 [DEBUG] [org.gradle.launcher.daemon.server.Daemon] DaemonExpirationPeriodicCheck running
16:41:08.677 [DEBUG] [org.gradle.cache.internal.DefaultFileLockManager] Waiting to acquire shared lock on daemon addresses registry.
16:41:08.677 [DEBUG] [org.gradle.cache.internal.DefaultFileLockManager] Lock acquired.
16:41:08.678 [DEBUG] [org.gradle.cache.internal.DefaultFileLockManager] Releasing lock on daemon addresses registry.
16:41:08.678 [DEBUG] [org.gradle.cache.internal.DefaultFileLockManager] Waiting to acquire shared lock on daemon addresses registry.
16:41:08.678 [DEBUG] [org.gradle.cache.internal.DefaultFileLockManager] Lock acquired.
16:41:08.678 [DEBUG] [org.gradle.cache.internal.DefaultFileLockManager] Releasing lock on daemon addresses registry.
16:41:18.681 [DEBUG] [org.gradle.launcher.daemon.server.Daemon] DaemonExpirationPeriodicCheck running
16:41:18.682 [DEBUG] [org.gradle.cache.internal.DefaultFileLockManager] Waiting to acquire shared lock on daemon addresses registry.
16:41:18.682 [DEBUG] [org.gradle.cache.internal.DefaultFileLockManager] Lock acquired.
16:41:18.683 [DEBUG] [org.gradle.cache.internal.DefaultFileLockManager] Releasing lock on daemon addresses registry.
16:41:18.683 [DEBUG] [org.gradle.cache.internal.DefaultFileLockManager] Waiting to acquire shared lock on daemon addresses registry.
16:41:18.683 [DEBUG] [org.gradle.cache.internal.DefaultFileLockManager] Lock acquired.
16:41:18.684 [DEBUG] [org.gradle.cache.internal.DefaultFileLockManager] Releasing lock on daemon addresses registry.
16:41:23.393 [DEBUG] [TestEventLogger] [XCUITest] Error: Unable to launch WebDriverAgent because of xcodebuild failure: "xcodebuild failed with code 65". Make sure you follow the tutorial at https://github.com/appium/appium-xcuitest-driver/blob/master/docs/real-device-config.md. Try to remove the WebDriverAgentRunner application from the device if it is installed and reboot the device.
16:41:23.393 [DEBUG] [TestEventLogger] at XCUITestDriver.quitAndUninstall$ (../../lib/driver.js:381:13)
16:41:23.394 [DEBUG] [TestEventLogger] at tryCatch (/usr/local/lib/node_modules/appium/node_modules/babel-runtime/regenerator/runtime.js:67:40)
16:41:23.394 [DEBUG] [TestEventLogger] at GeneratorFunctionPrototype.invoke [as _invoke] (/usr/local/lib/node_modules/appium/node_modules/babel-runtime/regenerator/runtime.js:315:22)
16:41:23.395 [DEBUG] [TestEventLogger] at GeneratorFunctionPrototype.prototype.(anonymous function) [as next] (/usr/local/lib/node_modules/appium/node_modules/babel-runtime/regenerator/runtime.js:100:21)
16:41:23.395 [DEBUG] [TestEventLogger] at GeneratorFunctionPrototype.invoke (/usr/local/lib/node_modules/appium/node_modules/babel-runtime/regenerator/runtime.js:136:37)
16:41:23.395 [DEBUG] [TestEventLogger] at <anonymous>
16:41:23.395 [DEBUG] [TestEventLogger] at process._tickCallback (internal/process/next_tick.js:188:7)
16:41:23.396 [DEBUG] [TestEventLogger] Error: Unable to launch WebDriverAgent because of xcodebuild failure: "xcodebuild failed with code 65". Make sure you follow the tutorial at https://github.com/appium/appium-xcuitest-driver/blob/master/docs/real-device-config.md. Try to remove the WebDriverAgentRunner application from the device if it is installed and reboot the device.
16:41:23.396 [DEBUG] [TestEventLogger] at XCUITestDriver.quitAndUninstall$ (../../lib/driver.js:381:13)
16:41:23.403 [DEBUG] [TestEventLogger] at tryCatch (/usr/local/lib/node_modules/appium/node_modules/babel-runtime/regenerator/runtime.js:67:40)
16:41:23.403 [DEBUG] [TestEventLogger] at GeneratorFunctionPrototype.invoke [as _invoke] (/usr/local/lib/node_modules/appium/node_modules/babel-runtime/regenerator/runtime.js:315:22)
16:41:23.404 [DEBUG] [TestEventLogger] at GeneratorFunctionPrototype.prototype.(anonymous function) [as next] (/usr/local/lib/node_modules/appium/node_modules/babel-runtime/regenerator/runtime.js:100:21)
16:41:23.404 [DEBUG] [TestEventLogger] at GeneratorFunctionPrototype.invoke (/usr/local/lib/node_modules/appium/node_modules/babel-runtime/regenerator/runtime.js:136:37)
16:41:23.404 [DEBUG] [TestEventLogger] at <anonymous>
16:41:23.404 [DEBUG] [TestEventLogger] at process._tickCallback (internal/process/next_tick.js:188:7)
16:41:23.409 [DEBUG] [TestEventLogger] [MJSONWP] Encountered internal error running command: Error: Unable to launch WebDriverAgent because of xcodebuild failure: "xcodebuild failed with code 65". Make sure you follow the tutorial at https://github.com/appium/appium-xcuitest-driver/blob/master/docs/real-device-config.md. Try to remove the WebDriverAgentRunner application from the device if it is installed and reboot the device.
16:41:23.409 [DEBUG] [TestEventLogger] at XCUITestDriver.quitAndUninstall$ (../../lib/driver.js:381:13)
16:41:23.409 [DEBUG] [TestEventLogger] at tryCatch (/usr/local/lib/node_modules/appium/node_modules/babel-runtime/regenerator/runtime.js:67:40)
16:41:23.409 [DEBUG] [TestEventLogger] at GeneratorFunctionPrototype.invoke [as _invoke] (/usr/local/lib/node_modules/appium/node_modules/babel-runtime/regenerator/runtime.js:315:22)
16:41:23.409 [DEBUG] [TestEventLogger] at GeneratorFunctionPrototype.prototype.(anonymous function) [as next] (/usr/local/lib/node_modules/appium/node_modules/babel-runtime/regenerator/runtime.js:100:21)
16:41:23.409 [DEBUG] [TestEventLogger] at GeneratorFunctionPrototype.invoke (/usr/local/lib/node_modules/appium/node_modules/babel-runtime/regenerator/runtime.js:136:37)
16:41:23.409 [DEBUG] [TestEventLogger] at <anonymous>
16:41:23.410 [DEBUG] [TestEventLogger] at process._tickCallback (internal/process/next_tick.js:188:7)
16:41:28.669 [DEBUG] [org.gradle.launcher.daemon.server.Daemon] DaemonExpirationPeriodicCheck running
16:41:28.670 [DEBUG] [org.gradle.cache.internal.DefaultFileLockManager] Waiting to acquire shared lock on daemon addresses registry.
16:41:28.670 [DEBUG] [org.gradle.cache.internal.DefaultFileLockManager] Lock acquired.
16:41:28.670 [DEBUG] [org.gradle.cache.internal.DefaultFileLockManager] Releasing lock on daemon addresses registry.
16:41:28.671 [DEBUG] [org.gradle.cache.internal.DefaultFileLockManager] Waiting to acquire shared lock on daemon addresses registry.
16:41:28.671 [DEBUG] [org.gradle.cache.internal.DefaultFileLockManager] Lock acquired.
16:41:28.671 [DEBUG] [org.gradle.cache.internal.DefaultFileLockManager] Releasing lock on daemon addresses registry.
16:41:38.669 [DEBUG] [org.gradle.launcher.daemon.server.Daemon] DaemonExpirationPeriodicCheck running
16:41:38.670 [DEBUG] [org.gradle.cache.internal.DefaultFileLockManager] Waiting to acquire shared lock on daemon addresses registry.
16:41:38.670 [DEBUG] [org.gradle.cache.internal.DefaultFileLockManager] Lock acquired.
16:41:38.670 [DEBUG] [org.gradle.cache.internal.DefaultFileLockManager] Releasing lock on daemon addresses registry.
16:41:38.671 [DEBUG] [org.gradle.cache.internal.DefaultFileLockManager] Waiting to acquire shared lock on daemon addresses registry.
16:41:38.671 [DEBUG] [org.gradle.cache.internal.DefaultFileLockManager] Lock acquired.
16:41:38.671 [DEBUG] [org.gradle.cache.internal.DefaultFileLockManager] Releasing lock on daemon addresses registry.
16:41:46.286 [DEBUG] [TestEventLogger] [XCUITest] Error: Unable to launch WebDriverAgent because of xcodebuild failure: "xcodebuild failed with code 65". Make sure you follow the tutorial at https://github.com/appium/appium-xcuitest-driver/blob/master/docs/real-device-config.md. Try to remove the WebDriverAgentRunner application from the device if it is installed and reboot the device.
16:41:46.286 [DEBUG] [TestEventLogger] at XCUITestDriver.quitAndUninstall$ (../../lib/driver.js:381:13)
16:41:46.287 [DEBUG] [TestEventLogger] at tryCatch (/usr/local/lib/node_modules/appium/node_modules/babel-runtime/regenerator/runtime.js:67:40)
16:41:46.287 [DEBUG] [TestEventLogger] at GeneratorFunctionPrototype.invoke [as _invoke] (/usr/local/lib/node_modules/appium/node_modules/babel-runtime/regenerator/runtime.js:315:22)
16:41:46.287 [DEBUG] [TestEventLogger] at GeneratorFunctionPrototype.prototype.(anonymous function) [as next] (/usr/local/lib/node_modules/appium/node_modules/babel-runtime/regenerator/runtime.js:100:21)
16:41:46.288 [DEBUG] [TestEventLogger] at GeneratorFunctionPrototype.invoke (/usr/local/lib/node_modules/appium/node_modules/babel-runtime/regenerator/runtime.js:136:37)
16:41:46.288 [DEBUG] [TestEventLogger] at <anonymous>
16:41:46.288 [DEBUG] [TestEventLogger] at process._tickCallback (internal/process/next_tick.js:188:7)
16:41:46.288 [DEBUG] [TestEventLogger] Error: Unable to launch WebDriverAgent because of xcodebuild failure: "xcodebuild failed with code 65". Make sure you follow the tutorial at https://github.com/appium/appium-xcuitest-driver/blob/master/docs/real-device-config.md. Try to remove the WebDriverAgentRunner application from the device if it is installed and reboot the device.
16:41:46.288 [DEBUG] [TestEventLogger] at XCUITestDriver.quitAndUninstall$ (../../lib/driver.js:381:13)
16:41:46.289 [DEBUG] [TestEventLogger] at tryCatch (/usr/local/lib/node_modules/appium/node_modules/babel-runtime/regenerator/runtime.js:67:40)
16:41:46.289 [DEBUG] [TestEventLogger] at GeneratorFunctionPrototype.invoke [as _invoke] (/usr/local/lib/node_modules/appium/node_modules/babel-runtime/regenerator/runtime.js:315:22)
16:41:46.289 [DEBUG] [TestEventLogger] at GeneratorFunctionPrototype.prototype.(anonymous function) [as next] (/usr/local/lib/node_modules/appium/node_modules/babel-runtime/regenerator/runtime.js:100:21)
16:41:46.289 [DEBUG] [TestEventLogger] at GeneratorFunctionPrototype.invoke (/usr/local/lib/node_modules/appium/node_modules/babel-runtime/regenerator/runtime.js:136:37)
16:41:46.289 [DEBUG] [TestEventLogger] at <anonymous>
16:41:46.289 [DEBUG] [TestEventLogger] at process._tickCallback (internal/process/next_tick.js:188:7)
16:41:46.293 [DEBUG] [TestEventLogger] [MJSONWP] Encountered internal error running command: Error: Unable to launch WebDriverAgent because of xcodebuild failure: "xcodebuild failed with code 65". Make sure you follow the tutorial at https://github.com/appium/appium-xcuitest-driver/blob/master/docs/real-device-config.md. Try to remove the WebDriverAgentRunner application from the device if it is installed and reboot the device.
16:41:46.293 [DEBUG] [TestEventLogger] at XCUITestDriver.quitAndUninstall$ (../../lib/driver.js:381:13)
16:41:46.293 [DEBUG] [TestEventLogger] at tryCatch (/usr/local/lib/node_modules/appium/node_modules/babel-runtime/regenerator/runtime.js:67:40)
16:41:46.295 [DEBUG] [TestEventLogger] at GeneratorFunctionPrototype.invoke [as _invoke] (/usr/local/lib/node_modules/appium/node_modules/babel-runtime/regenerator/runtime.js:315:22)
16:41:46.295 [DEBUG] [TestEventLogger] at GeneratorFunctionPrototype.prototype.(anonymous function) [as next] (/usr/local/lib/node_modules/appium/node_modules/babel-runtime/regenerator/runtime.js:100:21)
16:41:46.295 [DEBUG] [TestEventLogger] at GeneratorFunctionPrototype.invoke (/usr/local/lib/node_modules/appium/node_modules/babel-runtime/regenerator/runtime.js:136:37)
16:41:46.296 [DEBUG] [TestEventLogger] at <anonymous>
16:41:46.296 [DEBUG] [TestEventLogger] at process._tickCallback (internal/process/next_tick.js:188:7)
16:41:46.299 [DEBUG] [TestEventLogger]
16:41:46.301 [DEBUG] [TestEventLogger] tests.TestSet_01_FirstTimeView > ftwIsDisplayedAfterAppPutToBackground STANDARD_ERROR
16:41:46.301 [DEBUG] [TestEventLogger] org.openqa.selenium.WebDriverException: An unknown server-side error occurred while processing the command. Original error: Unable to launch WebDriverAgent because of xcodebuild failure: "xcodebuild failed with code 65". Make sure you follow the tutorial at https://github.com/appium/appium-xcuitest-driver/blob/master/docs/real-device-config.md. Try to remove the WebDriverAgentRunner application from the device if it is installed and reboot the device. (WARNING: The server did not provide any stacktrace information)
16:41:46.308 [DEBUG] [TestEventLogger] Command duration or timeout: 22.81 seconds
16:41:46.310 [DEBUG] [TestEventLogger] Build info: version: '3.5.3', revision: 'a88d25fe6b', time: '2017-08-29T12:42:44.417Z'
16:41:46.310 [DEBUG] [TestEventLogger] System info: host: 'Lucian.local', ip: 'fe80:0:0:0:10cb:da16:5c11:d2c1%en0', os.name: 'Mac OS X', os.arch: 'x86_64', os.version: '10.12.6', java.version: '1.8.0_144'
16:41:46.310 [DEBUG] [TestEventLogger] Driver info: driver.version: IOSDriver
16:41:46.310 [DEBUG] [TestEventLogger] at sun.reflect.NativeConstructorAccessorImpl.newInstance0(Native Method)
16:41:46.310 [DEBUG] [TestEventLogger] at sun.reflect.NativeConstructorAccessorImpl.newInstance(NativeConstructorAccessorImpl.java:62)
16:41:46.310 [DEBUG] [TestEventLogger] at sun.reflect.DelegatingConstructorAccessorImpl.newInstance(DelegatingConstructorAccessorImpl.java:45)
16:41:46.311 [DEBUG] [TestEventLogger] at java.lang.reflect.Constructor.newInstance(Constructor.java:423)
16:41:46.311 [DEBUG] [TestEventLogger] at org.openqa.selenium.remote.ErrorHandler.createThrowable(ErrorHandler.java:215)
16:41:46.311 [DEBUG] [TestEventLogger] at org.openqa.selenium.remote.ErrorHandler.throwIfResponseFailed(ErrorHandler.java:167)
16:41:46.311 [DEBUG] [TestEventLogger] at org.openqa.selenium.remote.JsonWireProtocolResponse.lambda$new$0(JsonWireProtocolResponse.java:53)
16:41:46.311 [DEBUG] [TestEventLogger] at org.openqa.selenium.remote.JsonWireProtocolResponse.lambda$getResponseFunction$2(JsonWireProtocolResponse.java:91)
16:41:46.311 [DEBUG] [TestEventLogger] at org.openqa.selenium.remote.ProtocolHandshake.lambda$createSession$24(ProtocolHandshake.java:359)
16:41:46.312 [DEBUG] [TestEventLogger] at java.util.stream.ReferencePipeline$3$1.accept(ReferencePipeline.java:193)
16:41:46.312 [DEBUG] [TestEventLogger] at java.util.Spliterators$ArraySpliterator.tryAdvance(Spliterators.java:958)
16:41:46.312 [DEBUG] [TestEventLogger] at java.util.stream.ReferencePipeline.forEachWithCancel(ReferencePipeline.java:126)
16:41:46.312 [DEBUG] [TestEventLogger] at java.util.stream.AbstractPipeline.copyIntoWithCancel(AbstractPipeline.java:498)
16:41:46.312 [DEBUG] [TestEventLogger] at java.util.stream.AbstractPipeline.copyInto(AbstractPipeline.java:485)
16:41:46.312 [DEBUG] [TestEventLogger] at java.util.stream.AbstractPipeline.wrapAndCopyInto(AbstractPipeline.java:471)
16:41:46.312 [DEBUG] [TestEventLogger] at java.util.stream.FindOps$FindOp.evaluateSequential(FindOps.java:152)
16:41:46.312 [DEBUG] [TestEventLogger] at java.util.stream.AbstractPipeline.evaluate(AbstractPipeline.java:234)
16:41:46.312 [DEBUG] [TestEventLogger] at java.util.stream.ReferencePipeline.findFirst(ReferencePipeline.java:464)
16:41:46.313 [DEBUG] [TestEventLogger] at org.openqa.selenium.remote.ProtocolHandshake.createSession(ProtocolHandshake.java:362)
16:41:46.313 [DEBUG] [TestEventLogger] at org.openqa.selenium.remote.ProtocolHandshake.createSession(ProtocolHandshake.java:136)
16:41:46.313 [DEBUG] [TestEventLogger] at org.openqa.selenium.remote.HttpCommandExecutor.execute(HttpCommandExecutor.java:142)
16:41:46.313 [DEBUG] [TestEventLogger] at io.appium.java_client.remote.AppiumCommandExecutor.execute(AppiumCommandExecutor.java:89)
16:41:46.313 [DEBUG] [TestEventLogger] at org.openqa.selenium.remote.RemoteWebDriver.execute(RemoteWebDriver.java:646)
16:41:46.313 [DEBUG] [TestEventLogger] at io.appium.java_client.DefaultGenericMobileDriver.execute(DefaultGenericMobileDriver.java:42)
16:41:46.313 [DEBUG] [TestEventLogger] at io.appium.java_client.AppiumDriver.execute(AppiumDriver.java:1)
16:41:46.314 [DEBUG] [TestEventLogger] at io.appium.java_client.ios.IOSDriver.execute(IOSDriver.java:1)
16:41:46.314 [DEBUG] [TestEventLogger] at org.openqa.selenium.remote.RemoteWebDriver.startSession(RemoteWebDriver.java:255)
16:41:46.314 [DEBUG] [TestEventLogger] at org.openqa.selenium.remote.RemoteWebDriver.startSession(RemoteWebDriver.java:237)
16:41:46.314 [DEBUG] [TestEventLogger] at org.openqa.selenium.remote.RemoteWebDriver.<init>(RemoteWebDriver.java:138)
16:41:46.314 [DEBUG] [TestEventLogger] at io.appium.java_client.DefaultGenericMobileDriver.<init>(DefaultGenericMobileDriver.java:38)
16:41:46.314 [DEBUG] [TestEventLogger] at io.appium.java_client.AppiumDriver.<init>(AppiumDriver.java:87)
16:41:46.314 [DEBUG] [TestEventLogger] at io.appium.java_client.AppiumDriver.<init>(AppiumDriver.java:122)
16:41:46.315 [DEBUG] [TestEventLogger] at io.appium.java_client.ios.IOSDriver.<init>(IOSDriver.java:102)
16:41:46.315 [DEBUG] [TestEventLogger] at core.managers.DriverManagerIOS.getNewDriver(DriverManagerIOS.java:258)
16:41:46.315 [DEBUG] [TestEventLogger] at core.managers.DriverManagerIOS.createiOSDriver(DriverManagerIOS.java:127)
16:41:46.315 [DEBUG] [TestEventLogger] at core.managers.TestManager.before(TestManager.java:54)
16:41:46.315 [DEBUG] [TestEventLogger] at sun.reflect.NativeMethodAccessorImpl.invoke0(Native Method)
16:41:46.315 [DEBUG] [TestEventLogger] at sun.reflect.NativeMethodAccessorImpl.invoke(NativeMethodAccessorImpl.java:62)
16:41:46.315 [DEBUG] [TestEventLogger] at sun.reflect.DelegatingMethodAccessorImpl.invoke(DelegatingMethodAccessorImpl.java:43)
16:41:46.315 [DEBUG] [TestEventLogger] at java.lang.reflect.Method.invoke(Method.java:498)
16:41:46.316 [DEBUG] [TestEventLogger] at org.junit.runners.model.FrameworkMethod$1.runReflectiveCall(FrameworkMethod.java:50)
16:41:46.316 [DEBUG] [TestEventLogger] at org.junit.internal.runners.model.ReflectiveCallable.run(ReflectiveCallable.java:12)
16:41:46.316 [DEBUG] [TestEventLogger] at org.junit.runners.model.FrameworkMethod.invokeExplosively(FrameworkMethod.java:47)
16:41:46.316 [DEBUG] [TestEventLogger] at org.junit.internal.runners.statements.RunBefores.evaluate(RunBefores.java:24)
16:41:46.316 [DEBUG] [TestEventLogger] at org.junit.internal.runners.statements.RunAfters.evaluate(RunAfters.java:27)
16:41:46.316 [DEBUG] [TestEventLogger] at org.junit.rules.TestWatcher$1.evaluate(TestWatcher.java:55)
16:41:46.316 [DEBUG] [TestEventLogger] at core.Retry$1.evaluate(Retry.java:28)
16:41:46.316 [DEBUG] [TestEventLogger] at org.junit.rules.RunRules.evaluate(RunRules.java:20)
16:41:46.316 [DEBUG] [TestEventLogger] at org.junit.runners.ParentRunner.runLeaf(ParentRunner.java:325)
16:41:46.317 [DEBUG] [TestEventLogger] at org.junit.runners.BlockJUnit4ClassRunner.runChild(BlockJUnit4ClassRunner.java:78)
16:41:46.317 [DEBUG] [TestEventLogger] at org.junit.runners.BlockJUnit4ClassRunner.runChild(BlockJUnit4ClassRunner.java:57)
16:41:46.317 [DEBUG] [TestEventLogger] at org.junit.runners.ParentRunner$3.run(ParentRunner.java:290)
16:41:46.317 [DEBUG] [TestEventLogger] at org.junit.runners.ParentRunner$1.schedule(ParentRunner.java:71)
16:41:46.317 [DEBUG] [TestEventLogger] at org.junit.runners.ParentRunner.runChildren(ParentRunner.java:288)
16:41:46.318 [DEBUG] [TestEventLogger] at org.junit.runners.ParentRunner.access$000(ParentRunner.java:58)
16:41:46.318 [DEBUG] [TestEventLogger] at org.junit.runners.ParentRunner$2.evaluate(ParentRunner.java:268)
16:41:46.318 [DEBUG] [TestEventLogger] at org.junit.runners.ParentRunner.run(ParentRunner.java:363)
16:41:46.318 [DEBUG] [TestEventLogger] at org.gradle.api.internal.tasks.testing.junit.JUnitTestClassExecuter.runTestClass(JUnitTestClassExecuter.java:114)
16:41:46.322 [DEBUG] [TestEventLogger] at org.gradle.api.internal.tasks.testing.junit.JUnitTestClassExecuter.execute(JUnitTestClassExecuter.java:57)
16:41:46.323 [DEBUG] [TestEventLogger] at org.gradle.api.internal.tasks.testing.junit.JUnitTestClassProcessor.processTestClass(JUnitTestClassProcessor.java:66)
16:41:46.323 [DEBUG] [TestEventLogger] at org.gradle.api.internal.tasks.testing.SuiteTestClassProcessor.processTestClass(SuiteTestClassProcessor.java:51)
16:41:46.323 [DEBUG] [TestEventLogger] at sun.reflect.NativeMethodAccessorImpl.invoke0(Native Method)
16:41:46.323 [DEBUG] [TestEventLogger] at sun.reflect.NativeMethodAccessorImpl.invoke(NativeMethodAccessorImpl.java:62)
16:41:46.323 [DEBUG] [TestEventLogger] at sun.reflect.DelegatingMethodAccessorImpl.invoke(DelegatingMethodAccessorImpl.java:43)
16:41:46.323 [DEBUG] [TestEventLogger] at java.lang.reflect.Method.invoke(Method.java:498)
16:41:46.323 [DEBUG] [TestEventLogger] at org.gradle.internal.dispatch.ReflectionDispatch.dispatch(ReflectionDispatch.java:35)
16:41:46.323 [DEBUG] [TestEventLogger] at org.gradle.internal.dispatch.ReflectionDispatch.dispatch(ReflectionDispatch.java:24)
16:41:46.323 [DEBUG] [TestEventLogger] at org.gradle.internal.dispatch.ContextClassLoaderDispatch.dispatch(ContextClassLoaderDispatch.java:32)
16:41:46.324 [DEBUG] [TestEventLogger] at org.gradle.internal.dispatch.ProxyDispatchAdapter$DispatchingInvocationHandler.invoke(ProxyDispatchAdapter.java:93)
16:41:46.324 [DEBUG] [TestEventLogger] at com.sun.proxy.$Proxy3.processTestClass(Unknown Source)
16:41:46.324 [DEBUG] [TestEventLogger] at org.gradle.api.internal.tasks.testing.worker.TestWorker.processTestClass(TestWorker.java:109)
16:41:46.324 [DEBUG] [TestEventLogger] at sun.reflect.NativeMethodAccessorImpl.invoke0(Native Method)
16:41:46.324 [DEBUG] [TestEventLogger] at sun.reflect.NativeMethodAccessorImpl.invoke(NativeMethodAccessorImpl.java:62)
16:41:46.324 [DEBUG] [TestEventLogger] at sun.reflect.DelegatingMethodAccessorImpl.invoke(DelegatingMethodAccessorImpl.java:43)
16:41:46.324 [DEBUG] [TestEventLogger] at java.lang.reflect.Method.invoke(Method.java:498)
16:41:46.324 [DEBUG] [TestEventLogger] at org.gradle.internal.dispatch.ReflectionDispatch.dispatch(ReflectionDispatch.java:35)
16:41:46.324 [DEBUG] [TestEventLogger] at org.gradle.internal.dispatch.ReflectionDispatch.dispatch(ReflectionDispatch.java:24)
16:41:46.325 [DEBUG] [TestEventLogger] at org.gradle.internal.remote.internal.hub.MessageHub$Handler.run(MessageHub.java:377)
16:41:46.325 [DEBUG] [TestEventLogger] at org.gradle.internal.concurrent.ExecutorPolicy$CatchAndRecordFailures.onExecute(ExecutorPolicy.java:54)
16:41:46.325 [DEBUG] [TestEventLogger] at org.gradle.internal.concurrent.StoppableExecutorImpl$1.run(StoppableExecutorImpl.java:40)
16:41:46.325 [DEBUG] [TestEventLogger] at java.util.concurrent.ThreadPoolExecutor.runWorker(ThreadPoolExecutor.java:1149)
16:41:46.325 [DEBUG] [TestEventLogger] at java.util.concurrent.ThreadPoolExecutor$Worker.run(ThreadPoolExecutor.java:624)
16:41:46.325 [DEBUG] [TestEventLogger] at java.lang.Thread.run(Thread.java:748)
16:41:46.325 [DEBUG] [TestEventLogger]
16:41:46.325 [DEBUG] [TestEventLogger] tests.TestSet_01_FirstTimeView > ftwIsDisplayedAfterAppPutToBackground STANDARD_OUT
16:41:46.325 [DEBUG] [TestEventLogger] 10-11-2017 16:41:46 - [api.apps.inflightiOS.workarounds.Workarounds / skipLoginmethod][INFO ] - Unlock the app to start testing
16:41:46.326 [DEBUG] [TestEventLogger] 10-11-2017 16:41:46 - [api.apps.inflightiOS.pincode.PinCode / clickSetupLaterPin][INFO ] - Click on Setup Pin later from create a pin code page
16:41:46.326 [DEBUG] [TestEventLogger] 10-11-2017 16:41:46 - [core.managers.ServerManager / getOS][INFO ] - Running command to see if it is Windows or Mac environment
16:41:46.326 [DEBUG] [TestEventLogger] 10-11-2017 16:41:46 - [core.managers.ServerManager / getOS][INFO ] - Detected OS is: Mac OS X
16:41:46.326 [DEBUG] [TestEventLogger] 10-11-2017 16:41:46 - [core.managers.ServerManager / getOS][INFO ] - Running command to see if it is Windows or Mac environment
16:41:46.326 [DEBUG] [TestEventLogger] 10-11-2017 16:41:46 - [core.managers.ServerManager / getOS][INFO ] - Detected OS is: Mac OS X
16:41:46.326 [DEBUG] [TestEventLogger] 10-11-2017 16:41:46 - [core.managers.ServerManager / getPlatformVersionFromJason][INFO ] - Get Platform Version From Jason
16:41:46.326 [DEBUG] [TestEventLogger] 10-11-2017 16:41:46 - [core.managers.ServerManager / getPlatformVersionFromJason][INFO ] - Platform Version From Jason is: ios
16:41:46.326 [DEBUG] [TestEventLogger] 10-11-2017 16:41:46 - [core.managers.ServerManager / getOS][INFO ] - Running command to see if it is Windows or Mac environment
16:41:46.327 [DEBUG] [TestEventLogger] 10-11-2017 16:41:46 - [core.managers.ServerManager / getOS][INFO ] - Detected OS is: Mac OS X
16:41:46.327 [DEBUG] [TestEventLogger] 10-11-2017 16:41:46 - [core.managers.ServerManager / getPlatformVersionFromJason][INFO ] - Get Platform Version From Jason
16:41:46.327 [DEBUG] [TestEventLogger] 10-11-2017 16:41:46 - [core.managers.ServerManager / getPlatformVersionFromJason][INFO ] - Platform Version From Jason is: ios
16:41:46.327 [DEBUG] [TestEventLogger] 10-11-2017 16:41:46 - [core.managers.TestManager / cleanAfterTest][INFO ] - ++++++++++++++++++++++ Killing IOS Driver ++++++++++++++++++++++
16:41:46.327 [DEBUG] [TestEventLogger] 10-11-2017 16:41:46 - [core.managers.DriverManagerIOS / killIOSDriver][INFO ] - IOS Driver is not initialized, nothing to kill
16:41:46.328 [DEBUG] [TestEventLogger] 10-11-2017 16:41:46 - [core.managers.TestManager$1 / failed][INFO ] - Test Failed:
16:41:46.332 [DEBUG] [TestEventLogger] 10-11-2017 16:41:46 - [core.TestInfo / printResults][INFO ] - Test ID: null
16:41:46.333 [DEBUG] [TestEventLogger] 10-11-2017 16:41:46 - [core.TestInfo / printResults][INFO ] - Test Name: null
16:41:46.333 [DEBUG] [TestEventLogger] 10-11-2017 16:41:46 - [core.TestInfo / printResults][INFO ] - Test Suite: null
16:41:46.333 [DEBUG] [TestEventLogger] Run 1 failed!
16:41:46.334 [DEBUG] [TestEventLogger] Giving up after 1 failures
16:41:46.387 [DEBUG] [TestEventLogger]
16:41:46.387 [DEBUG] [TestEventLogger] tests.TestSet_01_FirstTimeView > ftwIsDisplayedAfterAppPutToBackground FAILED
16:41:46.388 [DEBUG] [TestEventLogger] java.lang.NullPointerException
16:41:46.389 [DEBUG] [TestEventLogger] at api.apps.inflightiOS.pincode.PinCode.clickSetupLaterPin(PinCode.java:142)
16:41:46.389 [DEBUG] [TestEventLogger] at api.apps.inflightiOS.workarounds.Workarounds.skipLoginmethod(Workarounds.java:44)
16:41:46.391 [DEBUG] [TestEventLogger] at tests.TestSet_01_FirstTimeView.skipLoginAndPin(TestSet_01_FirstTimeView.java:21)
16:41:46.391 [DEBUG] [TestEventLogger] at sun.reflect.NativeMethodAccessorImpl.invoke0(Native Method)
16:41:46.391 [DEBUG] [TestEventLogger] at sun.reflect.NativeMethodAccessorImpl.invoke(NativeMethodAccessorImpl.java:62)
16:41:46.392 [DEBUG] [TestEventLogger] at sun.reflect.DelegatingMethodAccessorImpl.invoke(DelegatingMethodAccessorImpl.java:43)
16:41:46.392 [DEBUG] [TestEventLogger] at java.lang.reflect.Method.invoke(Method.java:498)
16:41:46.392 [DEBUG] [TestEventLogger] at org.junit.runners.model.FrameworkMethod$1.runReflectiveCall(FrameworkMethod.java:50)
16:41:46.392 [DEBUG] [TestEventLogger] at org.junit.internal.runners.model.ReflectiveCallable.run(ReflectiveCallable.java:12)
16:41:46.392 [DEBUG] [TestEventLogger] at org.junit.runners.model.FrameworkMethod.invokeExplosively(FrameworkMethod.java:47)
16:41:46.393 [DEBUG] [TestEventLogger] at org.junit.internal.runners.statements.RunBefores.evaluate(RunBefores.java:24)
16:41:46.393 [DEBUG] [TestEventLogger] at org.junit.internal.runners.statements.RunAfters.evaluate(RunAfters.java:27)
16:41:46.393 [DEBUG] [TestEventLogger] at org.junit.rules.TestWatcher$1.evaluate(TestWatcher.java:55)
16:41:46.393 [DEBUG] [TestEventLogger] at core.Retry$1.evaluate(Retry.java:28)
16:41:46.393 [DEBUG] [TestEventLogger] at org.junit.rules.RunRules.evaluate(RunRules.java:20)
16:41:46.393 [DEBUG] [TestEventLogger] at org.junit.runners.ParentRunner.runLeaf(ParentRunner.java:325)
16:41:46.393 [DEBUG] [TestEventLogger] at org.junit.runners.BlockJUnit4ClassRunner.runChild(BlockJUnit4ClassRunner.java:78)
16:41:46.393 [DEBUG] [TestEventLogger] at org.junit.runners.BlockJUnit4ClassRunner.runChild(BlockJUnit4ClassRunner.java:57)
16:41:46.394 [DEBUG] [TestEventLogger] at org.junit.runners.ParentRunner$3.run(ParentRunner.java:290)
16:41:46.394 [DEBUG] [TestEventLogger] at org.junit.runners.ParentRunner$1.schedule(ParentRunner.java:71)
16:41:46.394 [DEBUG] [TestEventLogger] at org.junit.runners.ParentRunner.runChildren(ParentRunner.java:288)
16:41:46.394 [DEBUG] [TestEventLogger] at org.junit.runners.ParentRunner.access$000(ParentRunner.java:58)
16:41:46.394 [DEBUG] [TestEventLogger] at org.junit.runners.ParentRunner$2.evaluate(ParentRunner.java:268)
16:41:46.394 [DEBUG] [TestEventLogger] at org.junit.runners.ParentRunner.run(ParentRunner.java:363)
16:41:46.394 [DEBUG] [TestEventLogger] at org.gradle.api.internal.tasks.testing.junit.JUnitTestClassExecuter.runTestClass(JUnitTestClassExecuter.java:114)
16:41:46.394 [DEBUG] [TestEventLogger] at org.gradle.api.internal.tasks.testing.junit.JUnitTestClassExecuter.execute(JUnitTestClassExecuter.java:57)
16:41:46.394 [DEBUG] [TestEventLogger] at org.gradle.api.internal.tasks.testing.junit.JUnitTestClassProcessor.processTestClass(JUnitTestClassProcessor.java:66)
16:41:46.394 [DEBUG] [TestEventLogger] at org.gradle.api.internal.tasks.testing.SuiteTestClassProcessor.processTestClass(SuiteTestClassProcessor.java:51)
16:41:46.395 [DEBUG] [TestEventLogger] at sun.reflect.NativeMethodAccessorImpl.invoke0(Native Method)
16:41:46.395 [DEBUG] [TestEventLogger] at sun.reflect.NativeMethodAccessorImpl.invoke(NativeMethodAccessorImpl.java:62)
16:41:46.395 [DEBUG] [TestEventLogger] at sun.reflect.DelegatingMethodAccessorImpl.invoke(DelegatingMethodAccessorImpl.java:43)
16:41:46.395 [DEBUG] [TestEventLogger] at java.lang.reflect.Method.invoke(Method.java:498)
16:41:46.395 [DEBUG] [TestEventLogger] at org.gradle.internal.dispatch.ReflectionDispatch.dispatch(ReflectionDispatch.java:35)
16:41:46.395 [DEBUG] [TestEventLogger] at org.gradle.internal.dispatch.ReflectionDispatch.dispatch(ReflectionDispatch.java:24)
16:41:46.395 [DEBUG] [TestEventLogger] at org.gradle.internal.dispatch.ContextClassLoaderDispatch.dispatch(ContextClassLoaderDispatch.java:32)
16:41:46.395 [DEBUG] [TestEventLogger] at org.gradle.internal.dispatch.ProxyDispatchAdapter$DispatchingInvocationHandler.invoke(ProxyDispatchAdapter.java:93)
16:41:46.395 [DEBUG] [TestEventLogger] at com.sun.proxy.$Proxy3.processTestClass(Unknown Source)
16:41:46.396 [DEBUG] [TestEventLogger] at org.gradle.api.internal.tasks.testing.worker.TestWorker.processTestClass(TestWorker.java:109)
16:41:46.396 [DEBUG] [TestEventLogger] at sun.reflect.NativeMethodAccessorImpl.invoke0(Native Method)
16:41:46.396 [DEBUG] [TestEventLogger] at sun.reflect.NativeMethodAccessorImpl.invoke(NativeMethodAccessorImpl.java:62)
16:41:46.396 [DEBUG] [TestEventLogger] at sun.reflect.DelegatingMethodAccessorImpl.invoke(DelegatingMethodAccessorImpl.java:43)
16:41:46.396 [DEBUG] [TestEventLogger] at java.lang.reflect.Method.invoke(Method.java:498)
16:41:46.396 [DEBUG] [TestEventLogger] at org.gradle.internal.dispatch.ReflectionDispatch.dispatch(ReflectionDispatch.java:35)
16:41:46.396 [DEBUG] [TestEventLogger] at org.gradle.internal.dispatch.ReflectionDispatch.dispatch(ReflectionDispatch.java:24)
16:41:46.396 [DEBUG] [TestEventLogger] at org.gradle.internal.remote.internal.hub.MessageHub$Handler.run(MessageHub.java:377)
16:41:46.397 [DEBUG] [TestEventLogger] at org.gradle.internal.concurrent.ExecutorPolicy$CatchAndRecordFailures.onExecute(ExecutorPolicy.java:54)
16:41:46.397 [DEBUG] [TestEventLogger] at org.gradle.internal.concurrent.StoppableExecutorImpl$1.run(StoppableExecutorImpl.java:40)
16:41:46.397 [DEBUG] [TestEventLogger] at java.util.concurrent.ThreadPoolExecutor.runWorker(ThreadPoolExecutor.java:1149)
16:41:46.397 [DEBUG] [TestEventLogger] at java.util.concurrent.ThreadPoolExecutor$Worker.run(ThreadPoolExecutor.java:624)
16:41:46.397 [DEBUG] [TestEventLogger] at java.lang.Thread.run(Thread.java:748)
16:41:46.399 [LIFECYCLE] [org.gradle.api.Task] Runnin test: Test ftwNotDisplayedAfterXBtnisPressed(tests.TestSet_01_FirstTimeView)
16:41:46.399 [DEBUG] [TestEventLogger]
16:41:46.399 [DEBUG] [TestEventLogger] tests.TestSet_01_FirstTimeView > ftwNotDisplayedAfterXBtnisPressed STARTED
16:41:46.399 [DEBUG] [TestEventLogger]
16:41:46.400 [DEBUG] [TestEventLogger] tests.TestSet_01_FirstTimeView > ftwNotDisplayedAfterXBtnisPressed STANDARD_OUT
16:41:46.400 [DEBUG] [TestEventLogger] 10-11-2017 16:41:46 - [core.managers.ServerManager / getOS][INFO ] - Running command to see if it is Windows or Mac environment
16:41:46.400 [DEBUG] [TestEventLogger] 10-11-2017 16:41:46 - [core.managers.ServerManager / getOS][INFO ] - Detected OS is: Mac OS X
16:41:46.400 [DEBUG] [TestEventLogger] 10-11-2017 16:41:46 - [core.managers.ServerManager / getOS][INFO ] - Running command to see if it is Windows or Mac environment
16:41:46.401 [DEBUG] [TestEventLogger] 10-11-2017 16:41:46 - [core.managers.ServerManager / getOS][INFO ] - Detected OS is: Mac OS X
16:41:46.401 [DEBUG] [TestEventLogger] 10-11-2017 16:41:46 - [core.managers.ServerManager / getPlatformVersionFromJason][INFO ] - Get Platform Version From Jason
16:41:46.401 [DEBUG] [TestEventLogger] 10-11-2017 16:41:46 - [core.managers.ServerManager / getPlatformVersionFromJason][INFO ] - Platform Version From Jason is: ios
16:41:46.402 [DEBUG] [TestEventLogger] 10-11-2017 16:41:46 - [core.managers.ServerManager / getOS][INFO ] - Running command to see if it is Windows or Mac environment
16:41:46.402 [DEBUG] [TestEventLogger] 10-11-2017 16:41:46 - [core.managers.ServerManager / getOS][INFO ] - Detected OS is: Mac OS X
16:41:46.402 [DEBUG] [TestEventLogger] 10-11-2017 16:41:46 - [core.managers.ServerManager / getPlatformVersionFromJason][INFO ] - Get Platform Version From Jason
16:41:46.402 [DEBUG] [TestEventLogger] 10-11-2017 16:41:46 - [core.managers.ServerManager / getPlatformVersionFromJason][INFO ] - Platform Version From Jason is: ios
16:41:46.402 [DEBUG] [TestEventLogger] 10-11-2017 16:41:46 - [core.managers.TestManager / before][INFO ] - ++++++++++++++++++++++ Driver creation started for Mac Environment ++++++++++++++++++++++
16:41:46.403 [DEBUG] [TestEventLogger] 10-11-2017 16:41:46 - [core.managers.ServerManager / getOS][INFO ] - Running command to see if it is Windows or Mac environment
16:41:46.403 [DEBUG] [TestEventLogger] 10-11-2017 16:41:46 - [core.managers.ServerManager / getOS][INFO ] - Detected OS is: Mac OS X
16:41:46.403 [DEBUG] [TestEventLogger] 10-11-2017 16:41:46 - [core.managers.ServerManager / getOS][INFO ] - Running command to see if it is Windows or Mac environment
16:41:46.404 [DEBUG] [TestEventLogger] 10-11-2017 16:41:46 - [core.managers.ServerManager / getOS][INFO ] - Detected OS is: Mac OS X
16:41:46.404 [DEBUG] [TestEventLogger] 10-11-2017 16:41:46 - [core.managers.ServerManager / getPlatformVersionFromJason][INFO ] - Get Platform Version From Jason
16:41:46.404 [DEBUG] [TestEventLogger] 10-11-2017 16:41:46 - [core.managers.ServerManager / getPlatformVersionFromJason][INFO ] - Platform Version From Jason is: ios
16:41:46.405 [DEBUG] [TestEventLogger] 10-11-2017 16:41:46 - [core.managers.ServerManager / getOS][INFO ] - Running command to see if it is Windows or Mac environment
16:41:46.405 [DEBUG] [TestEventLogger] 10-11-2017 16:41:46 - [core.managers.ServerManager / getOS][INFO ] - Detected OS is: Mac OS X
16:41:46.405 [DEBUG] [TestEventLogger] 10-11-2017 16:41:46 - [core.managers.ServerManager / getPlatformVersionFromJason][INFO ] - Get Platform Version From Jason
16:41:46.405 [DEBUG] [TestEventLogger] 10-11-2017 16:41:46 - [core.managers.ServerManager / getPlatformVersionFromJason][INFO ] - Platform Version From Jason is: ios
16:41:46.408 [DEBUG] [TestEventLogger] 10-11-2017 16:41:46 - [core.managers.DriverManagerIOS / queueUp][INFO ] - Queueing Up: 5d3c119a141e3842c2bb7ac77de8e47bf0c578c4
16:41:46.408 [DEBUG] [TestEventLogger] 10-11-2017 16:41:46 - [core.managers.DriverManagerIOS / queueUp][INFO ] - JSON Queue: {"192.168.92.102:5555":{"queued_at":1502091722673},"2ccf30dd21fa31a77967a66580e6c7ee62ecce88":{"queued_at":1505482692526},"192.168.66.101:5555":{"queued_at":1502086398311},"5d3c119a141e3842c2bb7ac77de8e47bf0c578c4":{"queued_at":1507729306343}}
16:41:46.408 [DEBUG] [TestEventLogger] 10-11-2017 16:41:46 - [core.managers.DriverManagerIOS / createiOSDriver][INFO ] - Trying to create new Driver for device: 5d3c119a141e3842c2bb7ac77de8e47bf0c578c4
16:41:46.409 [DEBUG] [TestEventLogger] 10-11-2017 16:41:46 - [core.managers.ServerManager / getOS][INFO ] - Running command to see if it is Windows or Mac environment
16:41:46.409 [DEBUG] [TestEventLogger] 10-11-2017 16:41:46 - [core.managers.ServerManager / getOS][INFO ] - Detected OS is: Mac OS X
16:41:46.409 [DEBUG] [TestEventLogger] 10-11-2017 16:41:46 - [core.managers.ServerManager / getOS][INFO ] - Running command to see if it is Windows or Mac environment
16:41:46.409 [DEBUG] [TestEventLogger] 10-11-2017 16:41:46 - [core.managers.ServerManager / getOS][INFO ] - Detected OS is: Mac OS X
16:41:46.409 [DEBUG] [TestEventLogger] 10-11-2017 16:41:46 - [core.managers.ServerManager / getPlatformVersionFromJason][INFO ] - Get Platform Version From Jason
16:41:46.409 [DEBUG] [TestEventLogger] 10-11-2017 16:41:46 - [core.managers.ServerManager / getPlatformVersionFromJason][INFO ] - Platform Version From Jason is: ios
16:41:46.409 [DEBUG] [TestEventLogger] 10-11-2017 16:41:46 - [core.managers.ServerManager / getOS][INFO ] - Running command to see if it is Windows or Mac environment
16:41:46.409 [DEBUG] [TestEventLogger] 10-11-2017 16:41:46 - [core.managers.ServerManager / getOS][INFO ] - Detected OS is: Mac OS X
16:41:46.410 [DEBUG] [TestEventLogger] 10-11-2017 16:41:46 - [core.managers.ServerManager / getPlatformVersionFromJason][INFO ] - Get Platform Version From Jason
16:41:46.410 [DEBUG] [TestEventLogger] 10-11-2017 16:41:46 - [core.managers.ServerManager / getPlatformVersionFromJason][INFO ] - Platform Version From Jason is: ios
16:41:46.410 [DEBUG] [TestEventLogger] 10-11-2017 16:41:46 - [core.managers.DriverManagerIOS / createService][INFO ] - +++++++++++++++++++++++ STARTING APPIUM SERVER ++++++++++++++++++++++
16:41:46.410 [DEBUG] [TestEventLogger] 10-11-2017 16:41:46 - [core.managers.ServerManager / getOS][INFO ] - Running command to see if it is Windows or Mac environment
16:41:46.410 [DEBUG] [TestEventLogger] 10-11-2017 16:41:46 - [core.managers.ServerManager / getOS][INFO ] - Detected OS is: Mac OS X
16:41:46.410 [DEBUG] [TestEventLogger] 10-11-2017 16:41:46 - [core.managers.ServerManager / getOS][INFO ] - Running command to see if it is Windows or Mac environment
16:41:46.410 [DEBUG] [TestEventLogger] 10-11-2017 16:41:46 - [core.managers.ServerManager / getOS][INFO ] - Detected OS is: Mac OS X
16:41:46.410 [DEBUG] [TestEventLogger] 10-11-2017 16:41:46 - [core.managers.ServerManager / getPlatformVersionFromJason][INFO ] - Get Platform Version From Jason
16:41:46.410 [DEBUG] [TestEventLogger] 10-11-2017 16:41:46 - [core.managers.ServerManager / getPlatformVersionFromJason][INFO ] - Platform Version From Jason is: ios
16:41:46.411 [DEBUG] [TestEventLogger] 10-11-2017 16:41:46 - [core.managers.ServerManager / getOS][INFO ] - Running command to see if it is Windows or Mac environment
16:41:46.411 [DEBUG] [TestEventLogger] 10-11-2017 16:41:46 - [core.managers.ServerManager / getOS][INFO ] - Detected OS is: Mac OS X
16:41:46.411 [DEBUG] [TestEventLogger] 10-11-2017 16:41:46 - [core.managers.ServerManager / getPlatformVersionFromJason][INFO ] - Get Platform Version From Jason
16:41:46.411 [DEBUG] [TestEventLogger] 10-11-2017 16:41:46 - [core.managers.ServerManager / getPlatformVersionFromJason][INFO ] - Platform Version From Jason is: ios
16:41:46.411 [DEBUG] [TestEventLogger] 10-11-2017 16:41:46 - [core.managers.DriverManagerIOS / createService][INFO ] - Appium server running for device with UDID: 5d3c119a141e3842c2bb7ac77de8e47bf0c578c4
16:41:46.411 [DEBUG] [TestEventLogger] 10-11-2017 16:41:46 - [core.managers.DriverManagerIOS / createService][INFO ] - ++++++++++++++++++ STARTED APPIUM SERVER ++++++++++++++++++: http://127.0.0.1:35132/wd/hub
16:41:48.684 [DEBUG] [org.gradle.launcher.daemon.server.Daemon] DaemonExpirationPeriodicCheck running
16:41:48.685 [DEBUG] [org.gradle.cache.internal.DefaultFileLockManager] Waiting to acquire shared lock on daemon addresses registry.
16:41:48.685 [DEBUG] [org.gradle.cache.internal.DefaultFileLockManager] Lock acquired.
16:41:48.685 [DEBUG] [org.gradle.cache.internal.DefaultFileLockManager] Releasing lock on daemon addresses registry.
16:41:48.685 [DEBUG] [org.gradle.cache.internal.DefaultFileLockManager] Waiting to acquire shared lock on daemon addresses registry.
16:41:48.686 [DEBUG] [org.gradle.cache.internal.DefaultFileLockManager] Lock acquired.
16:41:48.686 [DEBUG] [org.gradle.cache.internal.DefaultFileLockManager] Releasing lock on daemon addresses registry.
16:41:49.778 [DEBUG] [TestEventLogger] 10-11-2017 16:41:49 - [core.managers.DriverManagerIOS / getCaps][INFO ] - Creating driver caps for device: 5d3c119a141e3842c2bb7ac77de8e47bf0c578c4
16:41:49.779 [DEBUG] [TestEventLogger] 10-11-2017 16:41:49 - [core.managers.ServerManager / getOS][INFO ] - Running command to see if it is Windows or Mac environment
16:41:49.779 [DEBUG] [TestEventLogger] 10-11-2017 16:41:49 - [core.managers.ServerManager / getOS][INFO ] - Detected OS is: Mac OS X
16:41:49.779 [DEBUG] [TestEventLogger] 10-11-2017 16:41:49 - [core.managers.ServerManager / getOS][INFO ] - Running command to see if it is Windows or Mac environment
16:41:49.779 [DEBUG] [TestEventLogger] 10-11-2017 16:41:49 - [core.managers.ServerManager / getOS][INFO ] - Detected OS is: Mac OS X
16:41:49.779 [DEBUG] [TestEventLogger] 10-11-2017 16:41:49 - [core.managers.ServerManager / getPlatformVersionFromJason][INFO ] - Get Platform Version From Jason
16:41:49.780 [DEBUG] [TestEventLogger] 10-11-2017 16:41:49 - [core.managers.ServerManager / getPlatformVersionFromJason][INFO ] - Platform Version From Jason is: ios
16:41:49.780 [DEBUG] [TestEventLogger] 10-11-2017 16:41:49 - [core.managers.ServerManager / getOS][INFO ] - Running command to see if it is Windows or Mac environment
16:41:49.780 [DEBUG] [TestEventLogger] 10-11-2017 16:41:49 - [core.managers.ServerManager / getOS][INFO ] - Detected OS is: Mac OS X
16:41:49.781 [DEBUG] [TestEventLogger] 10-11-2017 16:41:49 - [core.managers.ServerManager / getPlatformVersionFromJason][INFO ] - Get Platform Version From Jason
16:41:49.781 [DEBUG] [TestEventLogger] 10-11-2017 16:41:49 - [core.managers.ServerManager / getPlatformVersionFromJason][INFO ] - Platform Version From Jason is: ios
16:41:49.781 [DEBUG] [TestEventLogger] 10-11-2017 16:41:49 - [core.managers.ServerManager / getOS][INFO ] - Running command to see if it is Windows or Mac environment
16:41:49.782 [DEBUG] [TestEventLogger] 10-11-2017 16:41:49 - [core.managers.ServerManager / getOS][INFO ] - Detected OS is: Mac OS X
16:41:49.782 [DEBUG] [TestEventLogger] 10-11-2017 16:41:49 - [core.managers.ServerManager / getOS][INFO ] - Running command to see if it is Windows or Mac environment
16:41:49.782 [DEBUG] [TestEventLogger] 10-11-2017 16:41:49 - [core.managers.ServerManager / getOS][INFO ] - Detected OS is: Mac OS X
16:41:49.783 [DEBUG] [TestEventLogger] 10-11-2017 16:41:49 - [core.managers.ServerManager / getPlatformVersionFromJason][INFO ] - Get Platform Version From Jason
16:41:49.783 [DEBUG] [TestEventLogger] 10-11-2017 16:41:49 - [core.managers.ServerManager / getPlatformVersionFromJason][INFO ] - Platform Version From Jason is: ios
16:41:49.784 [DEBUG] [TestEventLogger] 10-11-2017 16:41:49 - [core.managers.ServerManager / getOS][INFO ] - Running command to see if it is Windows or Mac environment
16:41:49.784 [DEBUG] [TestEventLogger] 10-11-2017 16:41:49 - [core.managers.ServerManager / getOS][INFO ] - Detected OS is: Mac OS X
16:41:49.784 [DEBUG] [TestEventLogger] 10-11-2017 16:41:49 - [core.managers.ServerManager / getPlatformVersionFromJason][INFO ] - Get Platform Version From Jason
16:41:49.784 [DEBUG] [TestEventLogger] 10-11-2017 16:41:49 - [core.managers.ServerManager / getPlatformVersionFromJason][INFO ] - Platform Version From Jason is: ios
16:41:49.785 [DEBUG] [TestEventLogger] 10-11-2017 16:41:49 - [core.managers.ServerManager / getOS][INFO ] - Running command to see if it is Windows or Mac environment
16:41:49.786 [DEBUG] [TestEventLogger] 10-11-2017 16:41:49 - [core.managers.ServerManager / getOS][INFO ] - Detected OS is: Mac OS X
16:41:49.786 [DEBUG] [TestEventLogger] 10-11-2017 16:41:49 - [core.managers.ServerManager / getOS][INFO ] - Running command to see if it is Windows or Mac environment
16:41:49.786 [DEBUG] [TestEventLogger] 10-11-2017 16:41:49 - [core.managers.ServerManager / getOS][INFO ] - Detected OS is: Mac OS X
16:41:49.786 [DEBUG] [TestEventLogger] 10-11-2017 16:41:49 - [core.managers.ServerManager / getPlatformVersionFromJason][INFO ] - Get Platform Version From Jason
16:41:49.786 [DEBUG] [TestEventLogger] 10-11-2017 16:41:49 - [core.managers.ServerManager / getPlatformVersionFromJason][INFO ] - Platform Version From Jason is: ios
16:41:49.789 [DEBUG] [TestEventLogger] 10-11-2017 16:41:49 - [core.managers.ServerManager / getOS][INFO ] - Running command to see if it is Windows or Mac environment
16:41:49.789 [DEBUG] [TestEventLogger] 10-11-2017 16:41:49 - [core.managers.ServerManager / getOS][INFO ] - Detected OS is: Mac OS X
16:41:49.789 [DEBUG] [TestEventLogger] 10-11-2017 16:41:49 - [core.managers.ServerManager / getPlatformVersionFromJason][INFO ] - Get Platform Version From Jason
16:41:49.789 [DEBUG] [TestEventLogger] 10-11-2017 16:41:49 - [core.managers.ServerManager / getPlatformVersionFromJason][INFO ] - Platform Version From Jason is: ios
16:41:58.669 [DEBUG] [org.gradle.launcher.daemon.server.Daemon] DaemonExpirationPeriodicCheck running
16:41:58.670 [DEBUG] [org.gradle.cache.internal.DefaultFileLockManager] Waiting to acquire shared lock on daemon addresses registry.
16:41:58.670 [DEBUG] [org.gradle.cache.internal.DefaultFileLockManager] Lock acquired.
16:41:58.670 [DEBUG] [org.gradle.cache.internal.DefaultFileLockManager] Releasing lock on daemon addresses registry.
16:41:58.670 [DEBUG] [org.gradle.cache.internal.DefaultFileLockManager] Waiting to acquire shared lock on daemon addresses registry.
16:41:58.670 [DEBUG] [org.gradle.cache.internal.DefaultFileLockManager] Lock acquired.
16:41:58.671 [DEBUG] [org.gradle.cache.internal.DefaultFileLockManager] Releasing lock on daemon addresses registry.
16:42:08.672 [DEBUG] [org.gradle.launcher.daemon.server.Daemon] DaemonExpirationPeriodicCheck running
16:42:08.673 [DEBUG] [org.gradle.cache.internal.DefaultFileLockManager] Waiting to acquire shared lock on daemon addresses registry.
16:42:08.673 [DEBUG] [org.gradle.cache.internal.DefaultFileLockManager] Lock acquired.
16:42:08.673 [DEBUG] [org.gradle.cache.internal.DefaultFileLockManager] Releasing lock on daemon addresses registry.
16:42:08.673 [DEBUG] [org.gradle.cache.internal.DefaultFileLockManager] Waiting to acquire shared lock on daemon addresses registry.
16:42:08.674 [DEBUG] [org.gradle.cache.internal.DefaultFileLockManager] Lock acquired.
16:42:08.674 [DEBUG] [org.gradle.cache.internal.DefaultFileLockManager] Releasing lock on daemon addresses registry.
16:42:11.824 [DEBUG] [TestEventLogger] [XCUITest] Error: Unable to launch WebDriverAgent because of xcodebuild failure: "xcodebuild failed with code 65". Make sure you follow the tutorial at https://github.com/appium/appium-xcuitest-driver/blob/master/docs/real-device-config.md. Try to remove the WebDriverAgentRunner application from the device if it is installed and reboot the device.
16:42:11.824 [DEBUG] [TestEventLogger] at XCUITestDriver.quitAndUninstall$ (../../lib/driver.js:381:13)
16:42:11.824 [DEBUG] [TestEventLogger] at tryCatch (/usr/local/lib/node_modules/appium/node_modules/babel-runtime/regenerator/runtime.js:67:40)
16:42:11.825 [DEBUG] [TestEventLogger] at GeneratorFunctionPrototype.invoke [as _invoke] (/usr/local/lib/node_modules/appium/node_modules/babel-runtime/regenerator/runtime.js:315:22)
16:42:11.825 [DEBUG] [TestEventLogger] at GeneratorFunctionPrototype.prototype.(anonymous function) [as next] (/usr/local/lib/node_modules/appium/node_modules/babel-runtime/regenerator/runtime.js:100:21)
16:42:11.825 [DEBUG] [TestEventLogger] at GeneratorFunctionPrototype.invoke (/usr/local/lib/node_modules/appium/node_modules/babel-runtime/regenerator/runtime.js:136:37)
16:42:11.825 [DEBUG] [TestEventLogger] at <anonymous>
16:42:11.825 [DEBUG] [TestEventLogger] at process._tickCallback (internal/process/next_tick.js:188:7)
16:42:11.825 [DEBUG] [TestEventLogger] Error: Unable to launch WebDriverAgent because of xcodebuild failure: "xcodebuild failed with code 65". Make sure you follow the tutorial at https://github.com/appium/appium-xcuitest-driver/blob/master/docs/real-device-config.md. Try to remove the WebDriverAgentRunner application from the device if it is installed and reboot the device.
16:42:11.825 [DEBUG] [TestEventLogger] at XCUITestDriver.quitAndUninstall$ (../../lib/driver.js:381:13)
16:42:11.826 [DEBUG] [TestEventLogger] at tryCatch (/usr/local/lib/node_modules/appium/node_modules/babel-runtime/regenerator/runtime.js:67:40)
16:42:11.826 [DEBUG] [TestEventLogger] at GeneratorFunctionPrototype.invoke [as _invoke] (/usr/local/lib/node_modules/appium/node_modules/babel-runtime/regenerator/runtime.js:315:22)
16:42:11.826 [DEBUG] [TestEventLogger] at GeneratorFunctionPrototype.prototype.(anonymous function) [as next] (/usr/local/lib/node_modules/appium/node_modules/babel-runtime/regenerator/runtime.js:100:21)
16:42:11.826 [DEBUG] [TestEventLogger] at GeneratorFunctionPrototype.invoke (/usr/local/lib/node_modules/appium/node_modules/babel-runtime/regenerator/runtime.js:136:37)
16:42:11.826 [DEBUG] [TestEventLogger] at <anonymous>
16:42:11.826 [DEBUG] [TestEventLogger] at process._tickCallback (internal/process/next_tick.js:188:7)
16:42:11.828 [DEBUG] [TestEventLogger] [MJSONWP] Encountered internal error running command: Error: Unable to launch WebDriverAgent because of xcodebuild failure: "xcodebuild failed with code 65". Make sure you follow the tutorial at https://github.com/appium/appium-xcuitest-driver/blob/master/docs/real-device-config.md. Try to remove the WebDriverAgentRunner application from the device if it is installed and reboot the device.
16:42:11.828 [DEBUG] [TestEventLogger] at XCUITestDriver.quitAndUninstall$ (../../lib/driver.js:381:13)
16:42:11.828 [DEBUG] [TestEventLogger] at tryCatch (/usr/local/lib/node_modules/appium/node_modules/babel-runtime/regenerator/runtime.js:67:40)
16:42:11.828 [DEBUG] [TestEventLogger] at GeneratorFunctionPrototype.invoke [as _invoke] (/usr/local/lib/node_modules/appium/node_modules/babel-runtime/regenerator/runtime.js:315:22)
16:42:11.828 [DEBUG] [TestEventLogger] at GeneratorFunctionPrototype.prototype.(anonymous function) [as next] (/usr/local/lib/node_modules/appium/node_modules/babel-runtime/regenerator/runtime.js:100:21)
16:42:11.828 [DEBUG] [TestEventLogger] at GeneratorFunctionPrototype.invoke (/usr/local/lib/node_modules/appium/node_modules/babel-runtime/regenerator/runtime.js:136:37)
16:42:11.828 [DEBUG] [TestEventLogger] at <anonymous>
16:42:11.828 [DEBUG] [TestEventLogger] at process._tickCallback (internal/process/next_tick.js:188:7)
16:42:18.677 [DEBUG] [org.gradle.launcher.daemon.server.Daemon] DaemonExpirationPeriodicCheck running
16:42:18.678 [DEBUG] [org.gradle.cache.internal.DefaultFileLockManager] Waiting to acquire shared lock on daemon addresses registry.
16:42:18.678 [DEBUG] [org.gradle.cache.internal.DefaultFileLockManager] Lock acquired.
16:42:18.678 [DEBUG] [org.gradle.cache.internal.DefaultFileLockManager] Releasing lock on daemon addresses registry.
16:42:18.679 [DEBUG] [org.gradle.cache.internal.DefaultFileLockManager] Waiting to acquire shared lock on daemon addresses registry.
16:42:18.679 [DEBUG] [org.gradle.cache.internal.DefaultFileLockManager] Lock acquired.
16:42:18.679 [DEBUG] [org.gradle.cache.internal.DefaultFileLockManager] Releasing lock on daemon addresses registry.
16:42:28.610 [DEBUG] [org.gradle.launcher.daemon.server.Daemon] DaemonExpirationPeriodicCheck running
16:42:28.611 [DEBUG] [org.gradle.cache.internal.DefaultFileLockManager] Waiting to acquire shared lock on daemon addresses registry.
16:42:28.611 [DEBUG] [org.gradle.cache.internal.DefaultFileLockManager] Lock acquired.
16:42:28.611 [DEBUG] [org.gradle.cache.internal.DefaultFileLockManager] Releasing lock on daemon addresses registry.
16:42:28.611 [DEBUG] [org.gradle.cache.internal.DefaultFileLockManager] Waiting to acquire shared lock on daemon addresses registry.
16:42:28.612 [DEBUG] [org.gradle.cache.internal.DefaultFileLockManager] Lock acquired.
16:42:28.612 [DEBUG] [org.gradle.cache.internal.DefaultFileLockManager] Releasing lock on daemon addresses registry.
16:42:33.387 [DEBUG] [TestEventLogger] [XCUITest] Error: Unable to launch WebDriverAgent because of xcodebuild failure: "xcodebuild failed with code 65". Make sure you follow the tutorial at https://github.com/appium/appium-xcuitest-driver/blob/master/docs/real-device-config.md. Try to remove the WebDriverAgentRunner application from the device if it is installed and reboot the device.
16:42:33.387 [DEBUG] [TestEventLogger] at XCUITestDriver.quitAndUninstall$ (../../lib/driver.js:381:13)
16:42:33.387 [DEBUG] [TestEventLogger] at tryCatch (/usr/local/lib/node_modules/appium/node_modules/babel-runtime/regenerator/runtime.js:67:40)
16:42:33.388 [DEBUG] [TestEventLogger] at GeneratorFunctionPrototype.invoke [as _invoke] (/usr/local/lib/node_modules/appium/node_modules/babel-runtime/regenerator/runtime.js:315:22)
16:42:33.388 [DEBUG] [TestEventLogger] at GeneratorFunctionPrototype.prototype.(anonymous function) [as next] (/usr/local/lib/node_modules/appium/node_modules/babel-runtime/regenerator/runtime.js:100:21)
16:42:33.388 [DEBUG] [TestEventLogger] at GeneratorFunctionPrototype.invoke (/usr/local/lib/node_modules/appium/node_modules/babel-runtime/regenerator/runtime.js:136:37)
16:42:33.388 [DEBUG] [TestEventLogger] at <anonymous>
16:42:33.388 [DEBUG] [TestEventLogger] at process._tickCallback (internal/process/next_tick.js:188:7)
16:42:33.388 [DEBUG] [TestEventLogger] Error: Unable to launch WebDriverAgent because of xcodebuild failure: "xcodebuild failed with code 65". Make sure you follow the tutorial at https://github.com/appium/appium-xcuitest-driver/blob/master/docs/real-device-config.md. Try to remove the WebDriverAgentRunner application from the device if it is installed and reboot the device.
16:42:33.388 [DEBUG] [TestEventLogger] at XCUITestDriver.quitAndUninstall$ (../../lib/driver.js:381:13)
16:42:33.388 [DEBUG] [TestEventLogger] at tryCatch (/usr/local/
Sign up for free to join this conversation on GitHub. Already have an account? Sign in to comment