Skip to content

Instantly share code, notes, and snippets.

Embed
What would you like to do?
travis_fold:start:worker_info
Worker information
hostname: d855bfe1-81e6-4cd2-8eba-0ca0c468e30d@1.production-1-worker-org-gce-2t5v
version: v6.2.0 https://github.com/travis-ci/worker/tree/5e5476e01646095f48eec13196fdb3faf8f5cbf7
instance: travis-job-366c10fa-5f0f-4787-88b1-565d249bd558 travis-ci-sardonyx-xenial-1553530528-f909ac5 (via amqp)
startup: 2m7.194284098s
travis_fold:end:worker_info
travis_fold:start:system_info
Build system information
Build language: python
Build group: stable
Build dist: xenial
Build id: 550918101
Job id: 550918123
Runtime kernel version: 4.15.0-1028-gcp
travis-build version: b2fd3f0ba
Build image provisioning date and time
Mon Mar 25 16:43:24 UTC 2019
Operating System Details
Distributor ID: Ubuntu
Description: Ubuntu 16.04.6 LTS
Release: 16.04
Codename: xenial
Systemd Version
systemd 229
Cookbooks Version
42e42e4 https://github.com/travis-ci/travis-cookbooks/tree/42e42e4
git version
git version 2.21.0
bash version
GNU bash, version 4.3.48(1)-release (x86_64-pc-linux-gnu)
gcc version
gcc (Ubuntu 5.4.0-6ubuntu1~16.04.11) 5.4.0 20160609
docker version
Client:
Version: 18.06.0-ce
API version: 1.38
Go version: go1.10.3
Git commit: 0ffa825
Built: Wed Jul 18 19:11:02 2018
OS/Arch: linux/amd64
Experimental: false
Server:
Engine:
Version: 18.06.0-ce
API version: 1.38 (minimum version 1.12)
Go version: go1.10.3
Git commit: 0ffa825
Built: Wed Jul 18 19:09:05 2018
OS/Arch: linux/amd64
Experimental: false
clang version
clang version 7.0.0 (tags/RELEASE_700/final)
jq version
jq-1.5
bats version
Bats 0.4.0
shellcheck version
0.6.0
shfmt version
v2.6.3
ccache version
3.2.4
cmake version
cmake version 3.12.4
heroku version
heroku/7.22.7 linux-x64 node-v11.10.1
imagemagick version
Version: ImageMagick 6.8.9-9 Q16 x86_64 2018-09-28 http://www.imagemagick.org
md5deep version
4.4
mercurial version
version 4.8
mysql version
mysql Ver 14.14 Distrib 5.7.25, for Linux (x86_64) using EditLine wrapper
openssl version
OpenSSL 1.0.2g 1 Mar 2016
packer version
1.3.3
postgresql client version
psql (PostgreSQL) 10.7 (Ubuntu 10.7-1.pgdg16.04+1)
ragel version
Ragel State Machine Compiler version 6.8 Feb 2013
sudo version
1.8.16
gzip version
gzip 1.6
zip version
Zip 3.0
vim version
VIM - Vi IMproved 7.4 (2013 Aug 10, compiled Nov 24 2016 16:44:48)
iptables version
iptables v1.6.0
curl version
curl 7.47.0 (x86_64-pc-linux-gnu) libcurl/7.47.0 GnuTLS/3.4.10 zlib/1.2.8 libidn/1.32 librtmp/2.3
wget version
GNU Wget 1.17.1 built on linux-gnu.
rsync version
rsync version 3.1.1 protocol version 31
gimme version
v1.5.3
nvm version
0.34.0
perlbrew version
/home/travis/perl5/perlbrew/bin/perlbrew - App::perlbrew/0.86
phpenv version
rbenv 1.1.2
rvm version
rvm 1.29.7 (latest) by Michal Papis, Piotr Kuczynski, Wayne E. Seguin [https://rvm.io]
default ruby version
ruby 2.5.3p105 (2018-10-18 revision 65156) [x86_64-linux]
CouchDB version
couchdb 1.6.1
ElasticSearch version
5.5.0
Installed Firefox version
firefox 63.0.1
MongoDB version
MongoDB 4.0.7
PhantomJS version
2.1.1
Pre-installed PostgreSQL versions
9.4.21
9.5.16
9.6.12
Redis version
redis-server 5.0.4
Pre-installed Go versions
1.11.1
mvn version
Apache Maven 3.6.0 (97c98ec64a1fdfee7767ce5ffb20918da4f719f3; 2018-10-24T18:41:47Z)
gradle version
Gradle 4.10.2!
lein version
Leiningen 2.9.1 on Java 11.0.2 OpenJDK 64-Bit Server VM
Pre-installed Node.js versions
v10.15.3
v11.0.0
v4.9.1
v6.17.0
v8.12.0
v8.15.1
v8.9
phpenv versions
system
5.6
5.6.40
7.1
7.1.27
7.2
* 7.2.15 (set by /home/travis/.phpenv/version)
hhvm
hhvm-stable
composer --version
Composer version 1.8.4 2019-02-11 10:52:10
Pre-installed Ruby versions
ruby-2.3.8
ruby-2.4.5
ruby-2.5.3
travis_fold:end:system_info

travis_fold:start:docker_mtu
travis_fold:end:docker_mtu
travis_fold:start:resolvconf
travis_fold:end:resolvconf
travis_fold:start:apt
Installing APT Packages
travis_time:start:00bc00de
$ travis_apt_get_update
travis_time:end:00bc00de:start=1561571531097438625,finish=1561571542052181164,duration=10954742539
travis_time:start:001e4920
$ sudo -E apt-get -yq --no-install-suggests --no-install-recommends $(travis_apt_get_options) install lib32stdc++6 lib32z1 lib32z1-dev gcc-multilib python-dev openssl libssl-dev jq unzip
Reading package lists...
Building dependency tree...
Reading state information...
unzip is already the newest version (6.0-20ubuntu1).
libssl-dev is already the newest version (1.0.2g-1ubuntu4.15).
libssl-dev set to manually installed.
openssl is already the newest version (1.0.2g-1ubuntu4.15).
python-dev is already the newest version (2.7.12-1~16.04).
The following additional packages will be installed:
gcc-5-multilib lib32asan2 lib32atomic1 lib32cilkrts5 lib32gcc-5-dev
lib32gcc1 lib32gomp1 lib32itm1 lib32mpx0 lib32quadmath0 lib32ubsan0
libc6-dev-i386 libc6-dev-x32 libc6-i386 libc6-x32 libonig2 libx32asan2
libx32atomic1 libx32cilkrts5 libx32gcc-5-dev libx32gcc1 libx32gomp1
libx32itm1 libx32quadmath0 libx32stdc++6 libx32ubsan0
The following NEW packages will be installed:
gcc-5-multilib gcc-multilib jq lib32asan2 lib32atomic1 lib32cilkrts5
lib32gcc-5-dev lib32gcc1 lib32gomp1 lib32itm1 lib32mpx0 lib32quadmath0
lib32stdc++6 lib32ubsan0 lib32z1 lib32z1-dev libc6-dev-i386 libc6-dev-x32
libc6-i386 libc6-x32 libonig2 libx32asan2 libx32atomic1 libx32cilkrts5
libx32gcc-5-dev libx32gcc1 libx32gomp1 libx32itm1 libx32quadmath0
libx32stdc++6 libx32ubsan0
0 upgraded, 31 newly installed, 0 to remove and 164 not upgraded.
Need to get 14.2 MB of archives.
After this operation, 59.8 MB of additional disk space will be used.
Get:1 http://us-east-1.ec2.archive.ubuntu.com/ubuntu xenial-updates/main amd64 libc6-i386 amd64 2.23-0ubuntu11 [2,328 kB]
Get:2 http://us-east-1.ec2.archive.ubuntu.com/ubuntu xenial-updates/main amd64 libc6-dev-i386 amd64 2.23-0ubuntu11 [1,264 kB]
Get:3 http://us-east-1.ec2.archive.ubuntu.com/ubuntu xenial-updates/main amd64 libc6-x32 amd64 2.23-0ubuntu11 [2,550 kB]
Get:4 http://us-east-1.ec2.archive.ubuntu.com/ubuntu xenial-updates/main amd64 libc6-dev-x32 amd64 2.23-0ubuntu11 [1,562 kB]
Get:5 http://us-east-1.ec2.archive.ubuntu.com/ubuntu xenial/main amd64 lib32gcc1 amd64 1:6.0.1-0ubuntu1 [46.6 kB]
Get:6 http://us-east-1.ec2.archive.ubuntu.com/ubuntu xenial/main amd64 libx32gcc1 amd64 1:6.0.1-0ubuntu1 [38.7 kB]
Get:7 http://us-east-1.ec2.archive.ubuntu.com/ubuntu xenial-updates/main amd64 lib32gomp1 amd64 5.4.0-6ubuntu1~16.04.11 [59.7 kB]
Get:8 http://us-east-1.ec2.archive.ubuntu.com/ubuntu xenial-updates/main amd64 libx32gomp1 amd64 5.4.0-6ubuntu1~16.04.11 [55.4 kB]
Get:9 http://us-east-1.ec2.archive.ubuntu.com/ubuntu xenial-updates/main amd64 lib32itm1 amd64 5.4.0-6ubuntu1~16.04.11 [29.6 kB]
Get:10 http://us-east-1.ec2.archive.ubuntu.com/ubuntu xenial-updates/main amd64 libx32itm1 amd64 5.4.0-6ubuntu1~16.04.11 [27.7 kB]
Get:11 http://us-east-1.ec2.archive.ubuntu.com/ubuntu xenial-updates/main amd64 lib32atomic1 amd64 5.4.0-6ubuntu1~16.04.11 [8,638 B]
Get:12 http://us-east-1.ec2.archive.ubuntu.com/ubuntu xenial-updates/main amd64 libx32atomic1 amd64 5.4.0-6ubuntu1~16.04.11 [8,896 B]
Get:13 http://us-east-1.ec2.archive.ubuntu.com/ubuntu xenial-updates/main amd64 lib32asan2 amd64 5.4.0-6ubuntu1~16.04.11 [259 kB]
Get:14 http://us-east-1.ec2.archive.ubuntu.com/ubuntu xenial-updates/main amd64 libx32asan2 amd64 5.4.0-6ubuntu1~16.04.11 [253 kB]
Get:15 http://us-east-1.ec2.archive.ubuntu.com/ubuntu xenial-updates/main amd64 lib32stdc++6 amd64 5.4.0-6ubuntu1~16.04.11 [404 kB]
Get:16 http://us-east-1.ec2.archive.ubuntu.com/ubuntu xenial-updates/main amd64 lib32ubsan0 amd64 5.4.0-6ubuntu1~16.04.11 [105 kB]
Get:17 http://us-east-1.ec2.archive.ubuntu.com/ubuntu xenial-updates/main amd64 libx32stdc++6 amd64 5.4.0-6ubuntu1~16.04.11 [383 kB]
Get:18 http://us-east-1.ec2.archive.ubuntu.com/ubuntu xenial-updates/main amd64 libx32ubsan0 amd64 5.4.0-6ubuntu1~16.04.11 [97.0 kB]
Get:19 http://us-east-1.ec2.archive.ubuntu.com/ubuntu xenial-updates/main amd64 lib32cilkrts5 amd64 5.4.0-6ubuntu1~16.04.11 [44.8 kB]
Get:20 http://us-east-1.ec2.archive.ubuntu.com/ubuntu xenial-updates/main amd64 libx32cilkrts5 amd64 5.4.0-6ubuntu1~16.04.11 [40.8 kB]
Get:21 http://us-east-1.ec2.archive.ubuntu.com/ubuntu xenial-updates/main amd64 lib32mpx0 amd64 5.4.0-6ubuntu1~16.04.11 [11.1 kB]
Get:22 http://us-east-1.ec2.archive.ubuntu.com/ubuntu xenial-updates/main amd64 lib32quadmath0 amd64 5.4.0-6ubuntu1~16.04.11 [203 kB]
Get:23 http://us-east-1.ec2.archive.ubuntu.com/ubuntu xenial-updates/main amd64 libx32quadmath0 amd64 5.4.0-6ubuntu1~16.04.11 [134 kB]
Get:24 http://us-east-1.ec2.archive.ubuntu.com/ubuntu xenial-updates/main amd64 lib32gcc-5-dev amd64 5.4.0-6ubuntu1~16.04.11 [2,051 kB]
Get:25 http://us-east-1.ec2.archive.ubuntu.com/ubuntu xenial-updates/main amd64 libx32gcc-5-dev amd64 5.4.0-6ubuntu1~16.04.11 [1,867 kB]
Get:26 http://us-east-1.ec2.archive.ubuntu.com/ubuntu xenial-updates/main amd64 gcc-5-multilib amd64 5.4.0-6ubuntu1~16.04.11 [964 B]
Get:27 http://us-east-1.ec2.archive.ubuntu.com/ubuntu xenial/main amd64 gcc-multilib amd64 4:5.3.1-1ubuntu1 [1,212 B]
Get:28 http://us-east-1.ec2.archive.ubuntu.com/ubuntu xenial-updates/universe amd64 libonig2 amd64 5.9.6-1ubuntu0.1 [86.7 kB]
Get:29 http://us-east-1.ec2.archive.ubuntu.com/ubuntu xenial-updates/universe amd64 jq amd64 1.5+dfsg-1ubuntu0.1 [144 kB]
Get:30 http://us-east-1.ec2.archive.ubuntu.com/ubuntu xenial-updates/main amd64 lib32z1 amd64 1:1.2.8.dfsg-2ubuntu4.1 [52.2 kB]
Get:31 http://us-east-1.ec2.archive.ubuntu.com/ubuntu xenial-updates/main amd64 lib32z1-dev amd64 1:1.2.8.dfsg-2ubuntu4.1 [54.7 kB]
Fetched 14.2 MB in 0s (40.1 MB/s)
Extracting templates from packages: 96%
Extracting templates from packages: 100%
Selecting previously unselected package libc6-i386.
(Reading database ...
(Reading database ... 5%
(Reading database ... 10%
(Reading database ... 15%
(Reading database ... 20%
(Reading database ... 25%
(Reading database ... 30%
(Reading database ... 35%
(Reading database ... 40%
(Reading database ... 45%
(Reading database ... 50%
(Reading database ... 55%
(Reading database ... 60%
(Reading database ... 65%
(Reading database ... 70%
(Reading database ... 75%
(Reading database ... 80%
(Reading database ... 85%
(Reading database ... 90%
(Reading database ... 95%
(Reading database ... 100%
(Reading database ... 124189 files and directories currently installed.)
Preparing to unpack .../libc6-i386_2.23-0ubuntu11_amd64.deb ...
Unpacking libc6-i386 (2.23-0ubuntu11) ...
Selecting previously unselected package libc6-dev-i386.
Preparing to unpack .../libc6-dev-i386_2.23-0ubuntu11_amd64.deb ...
Unpacking libc6-dev-i386 (2.23-0ubuntu11) ...
Selecting previously unselected package libc6-x32.
Preparing to unpack .../libc6-x32_2.23-0ubuntu11_amd64.deb ...
Unpacking libc6-x32 (2.23-0ubuntu11) ...
Selecting previously unselected package libc6-dev-x32.
Preparing to unpack .../libc6-dev-x32_2.23-0ubuntu11_amd64.deb ...
Unpacking libc6-dev-x32 (2.23-0ubuntu11) ...
Selecting previously unselected package lib32gcc1.
Preparing to unpack .../lib32gcc1_1%3a6.0.1-0ubuntu1_amd64.deb ...
Unpacking lib32gcc1 (1:6.0.1-0ubuntu1) ...
Selecting previously unselected package libx32gcc1.
Preparing to unpack .../libx32gcc1_1%3a6.0.1-0ubuntu1_amd64.deb ...
Unpacking libx32gcc1 (1:6.0.1-0ubuntu1) ...
Selecting previously unselected package lib32gomp1.
Preparing to unpack .../lib32gomp1_5.4.0-6ubuntu1~16.04.11_amd64.deb ...
Unpacking lib32gomp1 (5.4.0-6ubuntu1~16.04.11) ...
Selecting previously unselected package libx32gomp1.
Preparing to unpack .../libx32gomp1_5.4.0-6ubuntu1~16.04.11_amd64.deb ...
Unpacking libx32gomp1 (5.4.0-6ubuntu1~16.04.11) ...
Selecting previously unselected package lib32itm1.
Preparing to unpack .../lib32itm1_5.4.0-6ubuntu1~16.04.11_amd64.deb ...
Unpacking lib32itm1 (5.4.0-6ubuntu1~16.04.11) ...
Selecting previously unselected package libx32itm1.
Preparing to unpack .../libx32itm1_5.4.0-6ubuntu1~16.04.11_amd64.deb ...
Unpacking libx32itm1 (5.4.0-6ubuntu1~16.04.11) ...
Selecting previously unselected package lib32atomic1.
Preparing to unpack .../lib32atomic1_5.4.0-6ubuntu1~16.04.11_amd64.deb ...
Unpacking lib32atomic1 (5.4.0-6ubuntu1~16.04.11) ...
Selecting previously unselected package libx32atomic1.
Preparing to unpack .../libx32atomic1_5.4.0-6ubuntu1~16.04.11_amd64.deb ...
Unpacking libx32atomic1 (5.4.0-6ubuntu1~16.04.11) ...
Selecting previously unselected package lib32asan2.
Preparing to unpack .../lib32asan2_5.4.0-6ubuntu1~16.04.11_amd64.deb ...
Unpacking lib32asan2 (5.4.0-6ubuntu1~16.04.11) ...
Selecting previously unselected package libx32asan2.
Preparing to unpack .../libx32asan2_5.4.0-6ubuntu1~16.04.11_amd64.deb ...
Unpacking libx32asan2 (5.4.0-6ubuntu1~16.04.11) ...
Selecting previously unselected package lib32stdc++6.
Preparing to unpack .../lib32stdc++6_5.4.0-6ubuntu1~16.04.11_amd64.deb ...
Unpacking lib32stdc++6 (5.4.0-6ubuntu1~16.04.11) ...
Selecting previously unselected package lib32ubsan0.
Preparing to unpack .../lib32ubsan0_5.4.0-6ubuntu1~16.04.11_amd64.deb ...
Unpacking lib32ubsan0 (5.4.0-6ubuntu1~16.04.11) ...
Selecting previously unselected package libx32stdc++6.
Preparing to unpack .../libx32stdc++6_5.4.0-6ubuntu1~16.04.11_amd64.deb ...
Unpacking libx32stdc++6 (5.4.0-6ubuntu1~16.04.11) ...
Selecting previously unselected package libx32ubsan0.
Preparing to unpack .../libx32ubsan0_5.4.0-6ubuntu1~16.04.11_amd64.deb ...
Unpacking libx32ubsan0 (5.4.0-6ubuntu1~16.04.11) ...
Selecting previously unselected package lib32cilkrts5.
Preparing to unpack .../lib32cilkrts5_5.4.0-6ubuntu1~16.04.11_amd64.deb ...
Unpacking lib32cilkrts5 (5.4.0-6ubuntu1~16.04.11) ...
Selecting previously unselected package libx32cilkrts5.
Preparing to unpack .../libx32cilkrts5_5.4.0-6ubuntu1~16.04.11_amd64.deb ...
Unpacking libx32cilkrts5 (5.4.0-6ubuntu1~16.04.11) ...
Selecting previously unselected package lib32mpx0.
Preparing to unpack .../lib32mpx0_5.4.0-6ubuntu1~16.04.11_amd64.deb ...
Unpacking lib32mpx0 (5.4.0-6ubuntu1~16.04.11) ...
Selecting previously unselected package lib32quadmath0.
Preparing to unpack .../lib32quadmath0_5.4.0-6ubuntu1~16.04.11_amd64.deb ...
Unpacking lib32quadmath0 (5.4.0-6ubuntu1~16.04.11) ...
Selecting previously unselected package libx32quadmath0.
Preparing to unpack .../libx32quadmath0_5.4.0-6ubuntu1~16.04.11_amd64.deb ...
Unpacking libx32quadmath0 (5.4.0-6ubuntu1~16.04.11) ...
Selecting previously unselected package lib32gcc-5-dev.
Preparing to unpack .../lib32gcc-5-dev_5.4.0-6ubuntu1~16.04.11_amd64.deb ...
Unpacking lib32gcc-5-dev (5.4.0-6ubuntu1~16.04.11) ...
Selecting previously unselected package libx32gcc-5-dev.
Preparing to unpack .../libx32gcc-5-dev_5.4.0-6ubuntu1~16.04.11_amd64.deb ...
Unpacking libx32gcc-5-dev (5.4.0-6ubuntu1~16.04.11) ...
Selecting previously unselected package gcc-5-multilib.
Preparing to unpack .../gcc-5-multilib_5.4.0-6ubuntu1~16.04.11_amd64.deb ...
Unpacking gcc-5-multilib (5.4.0-6ubuntu1~16.04.11) ...
Selecting previously unselected package gcc-multilib.
Preparing to unpack .../gcc-multilib_4%3a5.3.1-1ubuntu1_amd64.deb ...
Unpacking gcc-multilib (4:5.3.1-1ubuntu1) ...
Selecting previously unselected package libonig2:amd64.
Preparing to unpack .../libonig2_5.9.6-1ubuntu0.1_amd64.deb ...
Unpacking libonig2:amd64 (5.9.6-1ubuntu0.1) ...
Selecting previously unselected package jq.
Preparing to unpack .../jq_1.5+dfsg-1ubuntu0.1_amd64.deb ...
Unpacking jq (1.5+dfsg-1ubuntu0.1) ...
Selecting previously unselected package lib32z1.
Preparing to unpack .../lib32z1_1%3a1.2.8.dfsg-2ubuntu4.1_amd64.deb ...
Unpacking lib32z1 (1:1.2.8.dfsg-2ubuntu4.1) ...
Selecting previously unselected package lib32z1-dev.
Preparing to unpack .../lib32z1-dev_1%3a1.2.8.dfsg-2ubuntu4.1_amd64.deb ...
Unpacking lib32z1-dev (1:1.2.8.dfsg-2ubuntu4.1) ...
Processing triggers for libc-bin (2.23-0ubuntu11) ...
Processing triggers for ccache (3.2.4-1) ...
Updating symlinks in /usr/lib/ccache ...
Processing triggers for man-db (2.7.5-1) ...
Setting up libc6-i386 (2.23-0ubuntu11) ...
Setting up libc6-dev-i386 (2.23-0ubuntu11) ...
Setting up libc6-x32 (2.23-0ubuntu11) ...
Setting up libc6-dev-x32 (2.23-0ubuntu11) ...
Setting up lib32gcc1 (1:6.0.1-0ubuntu1) ...
Setting up libx32gcc1 (1:6.0.1-0ubuntu1) ...
Setting up lib32gomp1 (5.4.0-6ubuntu1~16.04.11) ...
Setting up libx32gomp1 (5.4.0-6ubuntu1~16.04.11) ...
Setting up lib32itm1 (5.4.0-6ubuntu1~16.04.11) ...
Setting up libx32itm1 (5.4.0-6ubuntu1~16.04.11) ...
Setting up lib32atomic1 (5.4.0-6ubuntu1~16.04.11) ...
Setting up libx32atomic1 (5.4.0-6ubuntu1~16.04.11) ...
Setting up lib32asan2 (5.4.0-6ubuntu1~16.04.11) ...
Setting up libx32asan2 (5.4.0-6ubuntu1~16.04.11) ...
Setting up lib32stdc++6 (5.4.0-6ubuntu1~16.04.11) ...
Setting up lib32ubsan0 (5.4.0-6ubuntu1~16.04.11) ...
Setting up libx32stdc++6 (5.4.0-6ubuntu1~16.04.11) ...
Setting up libx32ubsan0 (5.4.0-6ubuntu1~16.04.11) ...
Setting up lib32cilkrts5 (5.4.0-6ubuntu1~16.04.11) ...
Setting up libx32cilkrts5 (5.4.0-6ubuntu1~16.04.11) ...
Setting up lib32mpx0 (5.4.0-6ubuntu1~16.04.11) ...
Setting up lib32quadmath0 (5.4.0-6ubuntu1~16.04.11) ...
Setting up libx32quadmath0 (5.4.0-6ubuntu1~16.04.11) ...
Setting up lib32gcc-5-dev (5.4.0-6ubuntu1~16.04.11) ...
Setting up libx32gcc-5-dev (5.4.0-6ubuntu1~16.04.11) ...
Setting up gcc-5-multilib (5.4.0-6ubuntu1~16.04.11) ...
Setting up gcc-multilib (4:5.3.1-1ubuntu1) ...
Setting up libonig2:amd64 (5.9.6-1ubuntu0.1) ...
Setting up jq (1.5+dfsg-1ubuntu0.1) ...
Setting up lib32z1 (1:1.2.8.dfsg-2ubuntu4.1) ...
Setting up lib32z1-dev (1:1.2.8.dfsg-2ubuntu4.1) ...
Processing triggers for libc-bin (2.23-0ubuntu11) ...
travis_time:end:001e4920:start=1561571542056714442,finish=1561571550916212907,duration=8859498465
travis_fold:end:apt

travis_fold:start:git.checkout
travis_time:start:0ebead58
$ git clone --depth=50 --branch=1.17.x https://github.com/pantsbuild/pants.git pantsbuild/pants
Cloning into 'pantsbuild/pants'...
remote: Enumerating objects: 5226, done.
remote: Counting objects: 0% (1/5226) 
remote: Counting objects: 1% (53/5226) 
remote: Counting objects: 2% (105/5226) 
remote: Counting objects: 3% (157/5226) 
remote: Counting objects: 4% (210/5226) 
remote: Counting objects: 5% (262/5226) 
remote: Counting objects: 6% (314/5226) 
remote: Counting objects: 7% (366/5226) 
remote: Counting objects: 8% (419/5226) 
remote: Counting objects: 9% (471/5226) 
remote: Counting objects: 10% (523/5226) 
remote: Counting objects: 11% (575/5226) 
remote: Counting objects: 12% (628/5226) 
remote: Counting objects: 13% (680/5226) 
remote: Counting objects: 14% (732/5226) 
remote: Counting objects: 15% (784/5226) 
remote: Counting objects: 16% (837/5226) 
remote: Counting objects: 17% (889/5226) 
remote: Counting objects: 18% (941/5226) 
remote: Counting objects: 19% (993/5226) 
remote: Counting objects: 20% (1046/5226) 
remote: Counting objects: 21% (1098/5226) 
remote: Counting objects: 22% (1150/5226) 
remote: Counting objects: 23% (1202/5226) 
remote: Counting objects: 24% (1255/5226) 
remote: Counting objects: 25% (1307/5226) 
remote: Counting objects: 26% (1359/5226) 
remote: Counting objects: 27% (1412/5226) 
remote: Counting objects: 28% (1464/5226) 
remote: Counting objects: 29% (1516/5226) 
remote: Counting objects: 30% (1568/5226) 
remote: Counting objects: 31% (1621/5226) 
remote: Counting objects: 32% (1673/5226) 
remote: Counting objects: 33% (1725/5226) 
remote: Counting objects: 34% (1777/5226) 
remote: Counting objects: 35% (1830/5226) 
remote: Counting objects: 36% (1882/5226) 
remote: Counting objects: 37% (1934/5226) 
remote: Counting objects: 38% (1986/5226) 
remote: Counting objects: 39% (2039/5226) 
remote: Counting objects: 40% (2091/5226) 
remote: Counting objects: 41% (2143/5226) 
remote: Counting objects: 42% (2195/5226) 
remote: Counting objects: 43% (2248/5226) 
remote: Counting objects: 44% (2300/5226) 
remote: Counting objects: 45% (2352/5226) 
remote: Counting objects: 46% (2404/5226) 
remote: Counting objects: 47% (2457/5226) 
remote: Counting objects: 48% (2509/5226) 
remote: Counting objects: 49% (2561/5226) 
remote: Counting objects: 50% (2613/5226) 
remote: Counting objects: 51% (2666/5226) 
remote: Counting objects: 52% (2718/5226) 
remote: Counting objects: 53% (2770/5226) 
remote: Counting objects: 54% (2823/5226) 
remote: Counting objects: 55% (2875/5226) 
remote: Counting objects: 56% (2927/5226) 
remote: Counting objects: 57% (2979/5226) 
remote: Counting objects: 58% (3032/5226) 
remote: Counting objects: 59% (3084/5226) 
remote: Counting objects: 60% (3136/5226) 
remote: Counting objects: 61% (3188/5226) 
remote: Counting objects: 62% (3241/5226) 
remote: Counting objects: 63% (3293/5226) 
remote: Counting objects: 64% (3345/5226) 
remote: Counting objects: 65% (3397/5226) 
remote: Counting objects: 66% (3450/5226) 
remote: Counting objects: 67% (3502/5226) 
remote: Counting objects: 68% (3554/5226) 
remote: Counting objects: 69% (3606/5226) 
remote: Counting objects: 70% (3659/5226) 
remote: Counting objects: 71% (3711/5226) 
remote: Counting objects: 72% (3763/5226) 
remote: Counting objects: 73% (3815/5226) 
remote: Counting objects: 74% (3868/5226) 
remote: Counting objects: 75% (3920/5226) 
remote: Counting objects: 76% (3972/5226) 
remote: Counting objects: 77% (4025/5226) 
remote: Counting objects: 78% (4077/5226) 
remote: Counting objects: 79% (4129/5226) 
remote: Counting objects: 80% (4181/5226) 
remote: Counting objects: 81% (4234/5226) 
remote: Counting objects: 82% (4286/5226) 
remote: Counting objects: 83% (4338/5226) 
remote: Counting objects: 84% (4390/5226) 
remote: Counting objects: 85% (4443/5226) 
remote: Counting objects: 86% (4495/5226) 
remote: Counting objects: 87% (4547/5226) 
remote: Counting objects: 88% (4599/5226) 
remote: Counting objects: 89% (4652/5226) 
remote: Counting objects: 90% (4704/5226) 
remote: Counting objects: 91% (4756/5226) 
remote: Counting objects: 92% (4808/5226) 
remote: Counting objects: 93% (4861/5226) 
remote: Counting objects: 94% (4913/5226) 
remote: Counting objects: 95% (4965/5226) 
remote: Counting objects: 96% (5017/5226) 
remote: Counting objects: 97% (5070/5226) 
remote: Counting objects: 98% (5122/5226) 
remote: Counting objects: 99% (5174/5226) 
remote: Counting objects: 100% (5226/5226) 
remote: Counting objects: 100% (5226/5226), done.
remote: Compressing objects: 0% (1/3889) 
remote: Compressing objects: 1% (39/3889) 
remote: Compressing objects: 2% (78/3889) 
remote: Compressing objects: 3% (117/3889) 
remote: Compressing objects: 4% (156/3889) 
remote: Compressing objects: 5% (195/3889) 
remote: Compressing objects: 6% (234/3889) 
remote: Compressing objects: 7% (273/3889) 
remote: Compressing objects: 8% (312/3889) 
remote: Compressing objects: 9% (351/3889) 
remote: Compressing objects: 10% (389/3889) 
remote: Compressing objects: 11% (428/3889) 
remote: Compressing objects: 12% (467/3889) 
remote: Compressing objects: 13% (506/3889) 
remote: Compressing objects: 14% (545/3889) 
remote: Compressing objects: 15% (584/3889) 
remote: Compressing objects: 16% (623/3889) 
remote: Compressing objects: 17% (662/3889) 
remote: Compressing objects: 18% (701/3889) 
remote: Compressing objects: 19% (739/3889) 
remote: Compressing objects: 20% (778/3889) 
remote: Compressing objects: 21% (817/3889) 
remote: Compressing objects: 22% (856/3889) 
remote: Compressing objects: 23% (895/3889) 
remote: Compressing objects: 24% (934/3889) 
remote: Compressing objects: 25% (973/3889) 
remote: Compressing objects: 26% (1012/3889) 
remote: Compressing objects: 27% (1051/3889) 
remote: Compressing objects: 28% (1089/3889) 
remote: Compressing objects: 29% (1128/3889) 
remote: Compressing objects: 30% (1167/3889) 
remote: Compressing objects: 31% (1206/3889) 
remote: Compressing objects: 32% (1245/3889) 
remote: Compressing objects: 33% (1284/3889) 
remote: Compressing objects: 34% (1323/3889) 
remote: Compressing objects: 35% (1362/3889) 
remote: Compressing objects: 36% (1401/3889) 
remote: Compressing objects: 37% (1439/3889) 
remote: Compressing objects: 38% (1478/3889) 
remote: Compressing objects: 39% (1517/3889) 
remote: Compressing objects: 40% (1556/3889) 
remote: Compressing objects: 41% (1595/3889) 
remote: Compressing objects: 42% (1634/3889) 
remote: Compressing objects: 43% (1673/3889) 
remote: Compressing objects: 44% (1712/3889) 
remote: Compressing objects: 45% (1751/3889) 
remote: Compressing objects: 46% (1789/3889) 
remote: Compressing objects: 47% (1828/3889) 
remote: Compressing objects: 48% (1867/3889) 
remote: Compressing objects: 49% (1906/3889) 
remote: Compressing objects: 50% (1945/3889) 
remote: Compressing objects: 51% (1984/3889) 
remote: Compressing objects: 52% (2023/3889) 
remote: Compressing objects: 53% (2062/3889) 
remote: Compressing objects: 54% (2101/3889) 
remote: Compressing objects: 55% (2139/3889) 
remote: Compressing objects: 56% (2178/3889) 
remote: Compressing objects: 57% (2217/3889) 
remote: Compressing objects: 58% (2256/3889) 
remote: Compressing objects: 59% (2295/3889) 
remote: Compressing objects: 60% (2334/3889) 
remote: Compressing objects: 61% (2373/3889) 
remote: Compressing objects: 62% (2412/3889) 
remote: Compressing objects: 63% (2451/3889) 
remote: Compressing objects: 64% (2489/3889) 
remote: Compressing objects: 65% (2528/3889) 
remote: Compressing objects: 66% (2567/3889) 
remote: Compressing objects: 67% (2606/3889) 
remote: Compressing objects: 68% (2645/3889) 
remote: Compressing objects: 69% (2684/3889) 
remote: Compressing objects: 70% (2723/3889) 
remote: Compressing objects: 71% (2762/3889) 
remote: Compressing objects: 72% (2801/3889) 
remote: Compressing objects: 73% (2839/3889) 
remote: Compressing objects: 74% (2878/3889) 
remote: Compressing objects: 75% (2917/3889) 
remote: Compressing objects: 76% (2956/3889) 
remote: Compressing objects: 77% (2995/3889) 
remote: Compressing objects: 78% (3034/3889) 
remote: Compressing objects: 79% (3073/3889) 
remote: Compressing objects: 80% (3112/3889) 
remote: Compressing objects: 81% (3151/3889) 
remote: Compressing objects: 82% (3189/3889) 
remote: Compressing objects: 83% (3228/3889) 
remote: Compressing objects: 84% (3267/3889) 
remote: Compressing objects: 85% (3306/3889) 
remote: Compressing objects: 86% (3345/3889) 
remote: Compressing objects: 87% (3384/3889) 
remote: Compressing objects: 88% (3423/3889) 
remote: Compressing objects: 89% (3462/3889) 
remote: Compressing objects: 90% (3501/3889) 
remote: Compressing objects: 91% (3539/3889) 
remote: Compressing objects: 92% (3578/3889) 
remote: Compressing objects: 93% (3617/3889) 
remote: Compressing objects: 94% (3656/3889) 
remote: Compressing objects: 95% (3695/3889) 
remote: Compressing objects: 96% (3734/3889) 
remote: Compressing objects: 97% (3773/3889) 
remote: Compressing objects: 98% (3812/3889) 
remote: Compressing objects: 99% (3851/3889) 
remote: Compressing objects: 100% (3889/3889) 
remote: Compressing objects: 100% (3889/3889), done.
Receiving objects: 0% (1/5226)
Receiving objects: 1% (53/5226)
Receiving objects: 2% (105/5226)
Receiving objects: 3% (157/5226)
Receiving objects: 4% (210/5226)
Receiving objects: 5% (262/5226)
Receiving objects: 6% (314/5226)
Receiving objects: 7% (366/5226)
Receiving objects: 8% (419/5226)
Receiving objects: 9% (471/5226)
Receiving objects: 10% (523/5226)
Receiving objects: 11% (575/5226)
Receiving objects: 12% (628/5226)
Receiving objects: 13% (680/5226)
Receiving objects: 14% (732/5226)
Receiving objects: 15% (784/5226)
Receiving objects: 16% (837/5226)
Receiving objects: 17% (889/5226)
Receiving objects: 18% (941/5226)
Receiving objects: 19% (993/5226)
Receiving objects: 20% (1046/5226)
Receiving objects: 21% (1098/5226)
Receiving objects: 22% (1150/5226)
Receiving objects: 23% (1202/5226)
Receiving objects: 24% (1255/5226)
Receiving objects: 25% (1307/5226)
Receiving objects: 26% (1359/5226)
Receiving objects: 27% (1412/5226)
Receiving objects: 28% (1464/5226)
Receiving objects: 29% (1516/5226)
Receiving objects: 30% (1568/5226)
Receiving objects: 31% (1621/5226)
Receiving objects: 32% (1673/5226)
Receiving objects: 33% (1725/5226)
Receiving objects: 34% (1777/5226)
Receiving objects: 35% (1830/5226)
Receiving objects: 36% (1882/5226)
Receiving objects: 37% (1934/5226)
Receiving objects: 38% (1986/5226)
Receiving objects: 39% (2039/5226)
Receiving objects: 40% (2091/5226)
Receiving objects: 41% (2143/5226)
Receiving objects: 42% (2195/5226)
Receiving objects: 43% (2248/5226)
Receiving objects: 44% (2300/5226)
Receiving objects: 45% (2352/5226)
Receiving objects: 46% (2404/5226)
Receiving objects: 47% (2457/5226)
Receiving objects: 48% (2509/5226)
Receiving objects: 49% (2561/5226)
Receiving objects: 50% (2613/5226)
Receiving objects: 51% (2666/5226)
Receiving objects: 52% (2718/5226)
Receiving objects: 53% (2770/5226)
Receiving objects: 54% (2823/5226)
Receiving objects: 55% (2875/5226)
Receiving objects: 56% (2927/5226)
Receiving objects: 57% (2979/5226)
Receiving objects: 58% (3032/5226)
Receiving objects: 59% (3084/5226)
Receiving objects: 60% (3136/5226)
Receiving objects: 61% (3188/5226)
Receiving objects: 62% (3241/5226)
Receiving objects: 63% (3293/5226)
Receiving objects: 64% (3345/5226)
Receiving objects: 65% (3397/5226)
Receiving objects: 66% (3450/5226)
Receiving objects: 67% (3502/5226)
Receiving objects: 68% (3554/5226)
Receiving objects: 69% (3606/5226)
Receiving objects: 70% (3659/5226)
Receiving objects: 71% (3711/5226)
Receiving objects: 72% (3763/5226)
Receiving objects: 73% (3815/5226)
Receiving objects: 74% (3868/5226)
Receiving objects: 75% (3920/5226)
Receiving objects: 76% (3972/5226)
Receiving objects: 77% (4025/5226)
Receiving objects: 78% (4077/5226)
Receiving objects: 79% (4129/5226)
Receiving objects: 80% (4181/5226)
Receiving objects: 81% (4234/5226)
Receiving objects: 82% (4286/5226)
Receiving objects: 83% (4338/5226)
Receiving objects: 84% (4390/5226)
Receiving objects: 85% (4443/5226)
Receiving objects: 86% (4495/5226)
Receiving objects: 87% (4547/5226)
Receiving objects: 88% (4599/5226)
Receiving objects: 89% (4652/5226)
Receiving objects: 90% (4704/5226)
Receiving objects: 91% (4756/5226)
Receiving objects: 92% (4808/5226)
Receiving objects: 93% (4861/5226)
Receiving objects: 94% (4913/5226)
Receiving objects: 95% (4965/5226)
Receiving objects: 96% (5017/5226)
Receiving objects: 97% (5070/5226)
Receiving objects: 98% (5122/5226)
remote: Total 5226 (delta 1167), reused 2840 (delta 639), pack-reused 0
Receiving objects: 99% (5174/5226)
Receiving objects: 100% (5226/5226)
Receiving objects: 100% (5226/5226), 5.08 MiB | 15.59 MiB/s, done.
Resolving deltas: 0% (0/1167)
Resolving deltas: 1% (13/1167)
Resolving deltas: 2% (25/1167)
Resolving deltas: 3% (37/1167)
Resolving deltas: 5% (63/1167)
Resolving deltas: 7% (90/1167)
Resolving deltas: 8% (94/1167)
Resolving deltas: 9% (112/1167)
Resolving deltas: 10% (118/1167)
Resolving deltas: 11% (136/1167)
Resolving deltas: 12% (143/1167)
Resolving deltas: 13% (160/1167)
Resolving deltas: 14% (164/1167)
Resolving deltas: 15% (176/1167)
Resolving deltas: 16% (188/1167)
Resolving deltas: 17% (199/1167)
Resolving deltas: 18% (212/1167)
Resolving deltas: 19% (223/1167)
Resolving deltas: 21% (246/1167)
Resolving deltas: 22% (258/1167)
Resolving deltas: 23% (269/1167)
Resolving deltas: 24% (285/1167)
Resolving deltas: 25% (293/1167)
Resolving deltas: 26% (312/1167)
Resolving deltas: 27% (316/1167)
Resolving deltas: 28% (328/1167)
Resolving deltas: 29% (341/1167)
Resolving deltas: 30% (351/1167)
Resolving deltas: 31% (364/1167)
Resolving deltas: 32% (382/1167)
Resolving deltas: 33% (387/1167)
Resolving deltas: 34% (402/1167)
Resolving deltas: 35% (415/1167)
Resolving deltas: 36% (425/1167)
Resolving deltas: 38% (444/1167)
Resolving deltas: 39% (456/1167)
Resolving deltas: 40% (467/1167)
Resolving deltas: 41% (483/1167)
Resolving deltas: 44% (522/1167)
Resolving deltas: 45% (528/1167)
Resolving deltas: 46% (537/1167)
Resolving deltas: 47% (553/1167)
Resolving deltas: 48% (561/1167)
Resolving deltas: 49% (573/1167)
Resolving deltas: 50% (587/1167)
Resolving deltas: 51% (599/1167)
Resolving deltas: 52% (609/1167)
Resolving deltas: 53% (619/1167)
Resolving deltas: 54% (633/1167)
Resolving deltas: 55% (642/1167)
Resolving deltas: 56% (655/1167)
Resolving deltas: 57% (667/1167)
Resolving deltas: 58% (678/1167)
Resolving deltas: 59% (689/1167)
Resolving deltas: 61% (714/1167)
Resolving deltas: 62% (725/1167)
Resolving deltas: 63% (736/1167)
Resolving deltas: 64% (747/1167)
Resolving deltas: 65% (759/1167)
Resolving deltas: 66% (771/1167)
Resolving deltas: 67% (783/1167)
Resolving deltas: 68% (803/1167)
Resolving deltas: 69% (806/1167)
Resolving deltas: 70% (817/1167)
Resolving deltas: 71% (831/1167)
Resolving deltas: 72% (842/1167)
Resolving deltas: 73% (854/1167)
Resolving deltas: 74% (867/1167)
Resolving deltas: 75% (878/1167)
Resolving deltas: 76% (888/1167)
Resolving deltas: 77% (899/1167)
Resolving deltas: 78% (914/1167)
Resolving deltas: 79% (923/1167)
Resolving deltas: 80% (934/1167)
Resolving deltas: 81% (948/1167)
Resolving deltas: 82% (957/1167)
Resolving deltas: 83% (972/1167)
Resolving deltas: 84% (981/1167)
Resolving deltas: 85% (992/1167)
Resolving deltas: 86% (1004/1167)
Resolving deltas: 87% (1016/1167)
Resolving deltas: 88% (1027/1167)
Resolving deltas: 89% (1039/1167)
Resolving deltas: 90% (1055/1167)
Resolving deltas: 91% (1062/1167)
Resolving deltas: 92% (1074/1167)
Resolving deltas: 93% (1087/1167)
Resolving deltas: 94% (1097/1167)
Resolving deltas: 95% (1109/1167)
Resolving deltas: 96% (1123/1167)
Resolving deltas: 97% (1132/1167)
Resolving deltas: 98% (1144/1167)
Resolving deltas: 99% (1159/1167)
Resolving deltas: 100% (1167/1167)
Resolving deltas: 100% (1167/1167), done.
travis_time:end:0ebead58:start=1561571550921127704,finish=1561571552910332142,duration=1989204438
$ cd pantsbuild/pants
$ git checkout -qf 8634422c52297290e87f8d7a1362ffa964c4a940
travis_fold:end:git.checkout

Setting environment variables from .travis.yml
$ export PANTS_CONFIG_FILES="${TRAVIS_BUILD_DIR}/pants.travis-ci.ini"
$ export LC_ALL="en_US.UTF-8"
$ export BOOTSTRAPPED_PEX_BUCKET=ci-public.pantsbuild.org
$ export BOOTSTRAPPED_PEX_KEY_PREFIX=${TRAVIS_BUILD_NUMBER}/${TRAVIS_BUILD_ID}/pants.pex
$ export BOOTSTRAPPED_PEX_URL_PREFIX=s3://${BOOTSTRAPPED_PEX_BUCKET}/${BOOTSTRAPPED_PEX_KEY_PREFIX}
$ export PYENV_PY27_VERSION=2.7.15
$ export PYENV_PY36_VERSION=3.6.8
$ export PYENV_PY37_VERSION=3.7.2
$ export PYENV_ROOT="${PYENV_ROOT:-${HOME}/.pants_pyenv}"
$ export PATH="${PYENV_ROOT}/shims:${PATH}"
$ export AWS_CLI_ROOT="${HOME}/.aws_cli"
$ export BOOTSTRAPPED_PEX_KEY_SUFFIX=py36.linux
$ export CACHE_NAME=integrationshard6
travis_time:start:0e064144
$ source ~/virtualenv/python2.7/bin/activate
travis_time:end:0e064144:start=1561571553111101081,finish=1561571553119452741,duration=8351660
travis_fold:start:cache.1
Setting up build cache
$ export CASHER_DIR=${TRAVIS_HOME}/.casher
travis_time:start:0874fd16
$ Installing caching utilities
travis_time:end:0874fd16:start=1561571554196825443,finish=1561571554482831844,duration=286006401
travis_time:start:1b9b10c0
travis_time:end:1b9b10c0:start=1561571554489503224,finish=1561571554493069779,duration=3566555
travis_time:start:11dc4f08
attempting to download cache archive
fetching 1.17.x/cache-linux-xenial-4bd8e020abc568499c882b86c76bf2cd2d6d6b85a1d692a127f7cd72190c5a5c--python-2.7.tgz
fetching 1.17.x/cache--python-2.7.tgz
fetching master/cache-linux-xenial-4bd8e020abc568499c882b86c76bf2cd2d6d6b85a1d692a127f7cd72190c5a5c--python-2.7.tgz
found cache
travis_time:end:11dc4f08:start=1561571554497882458,finish=1561571557524089574,duration=3026207116
travis_time:start:281e2ed0
travis_time:end:281e2ed0:start=1561571557529008018,finish=1561571557532642155,duration=3634137
travis_time:start:0347603c
adding /home/travis/.aws_cli to cache
creating directory /home/travis/.aws_cli
adding /opt/pyenv to cache
adding /home/travis/.cache/pants/tools to cache
creating directory /home/travis/.cache/pants/tools
adding /home/travis/.cache/pants/zinc to cache
creating directory /home/travis/.cache/pants/zinc
adding /home/travis/.ivy2/pants to cache
creating directory /home/travis/.ivy2/pants
adding /home/travis/.npm to cache
travis_time:end:0347603c:start=1561571557537252944,finish=1561571564564225871,duration=7026972927
travis_fold:end:cache.1

$ python --version
Python 2.7.15
$ pip --version
pip 19.0.3 from /home/travis/virtualenv/python2.7.15/lib/python2.7/site-packages/pip (python 2.7)
travis_fold:start:before_install.1
travis_time:start:0c2d94d8
$ PATH="/usr/lib/jvm/java-8-openjdk-amd64/jre/bin":$PATH
travis_time:end:0c2d94d8:start=1561571565555432462,finish=1561571565561328375,duration=5895913
travis_fold:end:before_install.1
travis_fold:start:before_install.2
travis_time:start:0350564e
$ JAVA_HOME=/usr/lib/jvm/java-8-openjdk-amd64
travis_time:end:0350564e:start=1561571565566149210,finish=1561571565569495236,duration=3346026
travis_fold:end:before_install.2
travis_fold:start:before_install.3
travis_time:start:01827647
$ sudo sysctl fs.inotify.max_user_watches=524288
fs.inotify.max_user_watches = 524288
travis_time:end:01827647:start=1561571565574286310,finish=1561571565587334396,duration=13048086
travis_fold:end:before_install.3
travis_fold:start:before_install.4
travis_time:start:1443c2c7
$ ./build-support/bin/install_aws_cli_for_ci.sh
travis_time:end:1443c2c7:start=1561571565592501339,finish=1561571566116022070,duration=523520731
travis_fold:end:before_install.4
travis_fold:start:before_install.5
travis_time:start:121c4ff7
$ pyenv global 2.7.15 3.6.7 3.7.1
travis_time:end:121c4ff7:start=1561571566121460637,finish=1561571566140597767,duration=19137130
travis_fold:end:before_install.5
Could not locate requirements.txt. Override the install: key in your .travis.yml to install dependencies.
travis_fold:start:before_script
travis_time:start:037cb337
$ ./build-support/bin/get_ci_bootstrapped_pants_pex.sh ${BOOTSTRAPPED_PEX_BUCKET} ${BOOTSTRAPPED_PEX_KEY_PREFIX}.${BOOTSTRAPPED_PEX_KEY_SUFFIX}
Completed 256.0 KiB/39.5 MiB (1.0 MiB/s) with 1 file(s) remaining
Completed 512.0 KiB/39.5 MiB (1.7 MiB/s) with 1 file(s) remaining
Completed 768.0 KiB/39.5 MiB (2.4 MiB/s) with 1 file(s) remaining
Completed 1.0 MiB/39.5 MiB (2.9 MiB/s) with 1 file(s) remaining
Completed 1.2 MiB/39.5 MiB (3.6 MiB/s) with 1 file(s) remaining
Completed 1.5 MiB/39.5 MiB (4.0 MiB/s) with 1 file(s) remaining
Completed 1.8 MiB/39.5 MiB (4.6 MiB/s) with 1 file(s) remaining
Completed 2.0 MiB/39.5 MiB (5.3 MiB/s) with 1 file(s) remaining
Completed 2.2 MiB/39.5 MiB (5.9 MiB/s) with 1 file(s) remaining
Completed 2.5 MiB/39.5 MiB (6.6 MiB/s) with 1 file(s) remaining
Completed 2.8 MiB/39.5 MiB (7.2 MiB/s) with 1 file(s) remaining
Completed 3.0 MiB/39.5 MiB (7.4 MiB/s) with 1 file(s) remaining
Completed 3.2 MiB/39.5 MiB (8.0 MiB/s) with 1 file(s) remaining
Completed 3.5 MiB/39.5 MiB (8.6 MiB/s) with 1 file(s) remaining
Completed 3.8 MiB/39.5 MiB (9.2 MiB/s) with 1 file(s) remaining
Completed 4.0 MiB/39.5 MiB (9.8 MiB/s) with 1 file(s) remaining
Completed 4.2 MiB/39.5 MiB (10.3 MiB/s) with 1 file(s) remaining
Completed 4.5 MiB/39.5 MiB (10.9 MiB/s) with 1 file(s) remaining
Completed 4.8 MiB/39.5 MiB (11.5 MiB/s) with 1 file(s) remaining
Completed 5.0 MiB/39.5 MiB (12.1 MiB/s) with 1 file(s) remaining
Completed 5.2 MiB/39.5 MiB (12.6 MiB/s) with 1 file(s) remaining
Completed 5.5 MiB/39.5 MiB (12.7 MiB/s) with 1 file(s) remaining
Completed 5.8 MiB/39.5 MiB (13.2 MiB/s) with 1 file(s) remaining
Completed 6.0 MiB/39.5 MiB (13.7 MiB/s) with 1 file(s) remaining
Completed 6.2 MiB/39.5 MiB (14.3 MiB/s) with 1 file(s) remaining
Completed 6.5 MiB/39.5 MiB (14.8 MiB/s) with 1 file(s) remaining
Completed 6.8 MiB/39.5 MiB (15.4 MiB/s) with 1 file(s) remaining
Completed 7.0 MiB/39.5 MiB (15.9 MiB/s) with 1 file(s) remaining
Completed 7.2 MiB/39.5 MiB (16.4 MiB/s) with 1 file(s) remaining
Completed 7.5 MiB/39.5 MiB (16.9 MiB/s) with 1 file(s) remaining
Completed 7.8 MiB/39.5 MiB (17.4 MiB/s) with 1 file(s) remaining
Completed 8.0 MiB/39.5 MiB (17.9 MiB/s) with 1 file(s) remaining
Completed 8.2 MiB/39.5 MiB (17.8 MiB/s) with 1 file(s) remaining
Completed 8.5 MiB/39.5 MiB (18.3 MiB/s) with 1 file(s) remaining
Completed 8.8 MiB/39.5 MiB (18.8 MiB/s) with 1 file(s) remaining
Completed 9.0 MiB/39.5 MiB (19.3 MiB/s) with 1 file(s) remaining
Completed 9.2 MiB/39.5 MiB (19.8 MiB/s) with 1 file(s) remaining
Completed 9.5 MiB/39.5 MiB (20.3 MiB/s) with 1 file(s) remaining
Completed 9.8 MiB/39.5 MiB (20.7 MiB/s) with 1 file(s) remaining
Completed 10.0 MiB/39.5 MiB (21.2 MiB/s) with 1 file(s) remaining
Completed 10.2 MiB/39.5 MiB (21.7 MiB/s) with 1 file(s) remaining
Completed 10.5 MiB/39.5 MiB (22.2 MiB/s) with 1 file(s) remaining
Completed 10.8 MiB/39.5 MiB (22.6 MiB/s) with 1 file(s) remaining
Completed 11.0 MiB/39.5 MiB (23.1 MiB/s) with 1 file(s) remaining
Completed 11.2 MiB/39.5 MiB (22.8 MiB/s) with 1 file(s) remaining
Completed 11.5 MiB/39.5 MiB (23.3 MiB/s) with 1 file(s) remaining
Completed 11.8 MiB/39.5 MiB (23.7 MiB/s) with 1 file(s) remaining
Completed 12.0 MiB/39.5 MiB (24.2 MiB/s) with 1 file(s) remaining
Completed 12.2 MiB/39.5 MiB (24.6 MiB/s) with 1 file(s) remaining
Completed 12.5 MiB/39.5 MiB (25.1 MiB/s) with 1 file(s) remaining
Completed 12.8 MiB/39.5 MiB (25.5 MiB/s) with 1 file(s) remaining
Completed 13.0 MiB/39.5 MiB (25.9 MiB/s) with 1 file(s) remaining
Completed 13.2 MiB/39.5 MiB (26.4 MiB/s) with 1 file(s) remaining
Completed 13.5 MiB/39.5 MiB (26.8 MiB/s) with 1 file(s) remaining
Completed 13.8 MiB/39.5 MiB (27.2 MiB/s) with 1 file(s) remaining
Completed 14.0 MiB/39.5 MiB (26.8 MiB/s) with 1 file(s) remaining
Completed 14.2 MiB/39.5 MiB (27.2 MiB/s) with 1 file(s) remaining
Completed 14.5 MiB/39.5 MiB (27.6 MiB/s) with 1 file(s) remaining
Completed 14.8 MiB/39.5 MiB (28.0 MiB/s) with 1 file(s) remaining
Completed 15.0 MiB/39.5 MiB (28.4 MiB/s) with 1 file(s) remaining
Completed 15.2 MiB/39.5 MiB (28.8 MiB/s) with 1 file(s) remaining
Completed 15.5 MiB/39.5 MiB (29.2 MiB/s) with 1 file(s) remaining
Completed 15.8 MiB/39.5 MiB (29.6 MiB/s) with 1 file(s) remaining
Completed 16.0 MiB/39.5 MiB (30.0 MiB/s) with 1 file(s) remaining
Completed 16.2 MiB/39.5 MiB (30.4 MiB/s) with 1 file(s) remaining
Completed 16.5 MiB/39.5 MiB (30.8 MiB/s) with 1 file(s) remaining
Completed 16.8 MiB/39.5 MiB (31.3 MiB/s) with 1 file(s) remaining
Completed 17.0 MiB/39.5 MiB (30.5 MiB/s) with 1 file(s) remaining
Completed 17.2 MiB/39.5 MiB (30.9 MiB/s) with 1 file(s) remaining
Completed 17.5 MiB/39.5 MiB (31.3 MiB/s) with 1 file(s) remaining
Completed 17.8 MiB/39.5 MiB (31.6 MiB/s) with 1 file(s) remaining
Completed 18.0 MiB/39.5 MiB (32.0 MiB/s) with 1 file(s) remaining
Completed 18.2 MiB/39.5 MiB (32.4 MiB/s) with 1 file(s) remaining
Completed 18.5 MiB/39.5 MiB (32.8 MiB/s) with 1 file(s) remaining
Completed 18.8 MiB/39.5 MiB (33.2 MiB/s) with 1 file(s) remaining
Completed 19.0 MiB/39.5 MiB (33.5 MiB/s) with 1 file(s) remaining
Completed 19.2 MiB/39.5 MiB (33.9 MiB/s) with 1 file(s) remaining
Completed 19.5 MiB/39.5 MiB (34.3 MiB/s) with 1 file(s) remaining
Completed 19.8 MiB/39.5 MiB (33.1 MiB/s) with 1 file(s) remaining
Completed 20.0 MiB/39.5 MiB (33.5 MiB/s) with 1 file(s) remaining
Completed 20.2 MiB/39.5 MiB (33.8 MiB/s) with 1 file(s) remaining
Completed 20.5 MiB/39.5 MiB (34.2 MiB/s) with 1 file(s) remaining
Completed 20.8 MiB/39.5 MiB (34.5 MiB/s) with 1 file(s) remaining
Completed 21.0 MiB/39.5 MiB (34.9 MiB/s) with 1 file(s) remaining
Completed 21.2 MiB/39.5 MiB (35.2 MiB/s) with 1 file(s) remaining
Completed 21.5 MiB/39.5 MiB (35.6 MiB/s) with 1 file(s) remaining
Completed 21.8 MiB/39.5 MiB (35.9 MiB/s) with 1 file(s) remaining
Completed 22.0 MiB/39.5 MiB (36.3 MiB/s) with 1 file(s) remaining
Completed 22.2 MiB/39.5 MiB (36.6 MiB/s) with 1 file(s) remaining
Completed 22.5 MiB/39.5 MiB (37.0 MiB/s) with 1 file(s) remaining
Completed 22.8 MiB/39.5 MiB (36.4 MiB/s) with 1 file(s) remaining
Completed 23.0 MiB/39.5 MiB (36.7 MiB/s) with 1 file(s) remaining
Completed 23.2 MiB/39.5 MiB (37.0 MiB/s) with 1 file(s) remaining
Completed 23.5 MiB/39.5 MiB (37.3 MiB/s) with 1 file(s) remaining
Completed 23.8 MiB/39.5 MiB (37.7 MiB/s) with 1 file(s) remaining
Completed 24.0 MiB/39.5 MiB (38.0 MiB/s) with 1 file(s) remaining
Completed 24.2 MiB/39.5 MiB (38.4 MiB/s) with 1 file(s) remaining
Completed 24.5 MiB/39.5 MiB (38.7 MiB/s) with 1 file(s) remaining
Completed 24.8 MiB/39.5 MiB (38.9 MiB/s) with 1 file(s) remaining
Completed 25.0 MiB/39.5 MiB (39.2 MiB/s) with 1 file(s) remaining
Completed 25.2 MiB/39.5 MiB (39.5 MiB/s) with 1 file(s) remaining
Completed 25.5 MiB/39.5 MiB (39.9 MiB/s) with 1 file(s) remaining
Completed 25.8 MiB/39.5 MiB (39.4 MiB/s) with 1 file(s) remaining
Completed 26.0 MiB/39.5 MiB (39.6 MiB/s) with 1 file(s) remaining
Completed 26.2 MiB/39.5 MiB (39.9 MiB/s) with 1 file(s) remaining
Completed 26.5 MiB/39.5 MiB (40.2 MiB/s) with 1 file(s) remaining
Completed 26.8 MiB/39.5 MiB (40.6 MiB/s) with 1 file(s) remaining
Completed 27.0 MiB/39.5 MiB (40.8 MiB/s) with 1 file(s) remaining
Completed 27.2 MiB/39.5 MiB (41.2 MiB/s) with 1 file(s) remaining
Completed 27.5 MiB/39.5 MiB (41.5 MiB/s) with 1 file(s) remaining
Completed 27.8 MiB/39.5 MiB (41.6 MiB/s) with 1 file(s) remaining
Completed 28.0 MiB/39.5 MiB (41.9 MiB/s) with 1 file(s) remaining
Completed 28.2 MiB/39.5 MiB (42.2 MiB/s) with 1 file(s) remaining
Completed 28.5 MiB/39.5 MiB (41.7 MiB/s) with 1 file(s) remaining
Completed 28.8 MiB/39.5 MiB (42.0 MiB/s) with 1 file(s) remaining
Completed 29.0 MiB/39.5 MiB (42.2 MiB/s) with 1 file(s) remaining
Completed 29.2 MiB/39.5 MiB (42.6 MiB/s) with 1 file(s) remaining
Completed 29.5 MiB/39.5 MiB (42.9 MiB/s) with 1 file(s) remaining
Completed 29.8 MiB/39.5 MiB (43.1 MiB/s) with 1 file(s) remaining
Completed 30.0 MiB/39.5 MiB (43.4 MiB/s) with 1 file(s) remaining
Completed 30.2 MiB/39.5 MiB (43.7 MiB/s) with 1 file(s) remaining
Completed 30.5 MiB/39.5 MiB (44.0 MiB/s) with 1 file(s) remaining
Completed 30.8 MiB/39.5 MiB (44.2 MiB/s) with 1 file(s) remaining
Completed 31.0 MiB/39.5 MiB (44.4 MiB/s) with 1 file(s) remaining
Completed 31.2 MiB/39.5 MiB (43.9 MiB/s) with 1 file(s) remaining
Completed 31.5 MiB/39.5 MiB (44.2 MiB/s) with 1 file(s) remaining
Completed 31.8 MiB/39.5 MiB (44.4 MiB/s) with 1 file(s) remaining
Completed 32.0 MiB/39.5 MiB (44.7 MiB/s) with 1 file(s) remaining
Completed 32.2 MiB/39.5 MiB (44.9 MiB/s) with 1 file(s) remaining
Completed 32.5 MiB/39.5 MiB (45.2 MiB/s) with 1 file(s) remaining
Completed 32.8 MiB/39.5 MiB (45.5 MiB/s) with 1 file(s) remaining
Completed 33.0 MiB/39.5 MiB (45.8 MiB/s) with 1 file(s) remaining
Completed 33.2 MiB/39.5 MiB (46.0 MiB/s) with 1 file(s) remaining
Completed 33.5 MiB/39.5 MiB (46.3 MiB/s) with 1 file(s) remaining
Completed 33.8 MiB/39.5 MiB (46.6 MiB/s) with 1 file(s) remaining
Completed 34.0 MiB/39.5 MiB (46.8 MiB/s) with 1 file(s) remaining
Completed 34.2 MiB/39.5 MiB (46.3 MiB/s) with 1 file(s) remaining
Completed 34.5 MiB/39.5 MiB (46.5 MiB/s) with 1 file(s) remaining
Completed 34.8 MiB/39.5 MiB (46.7 MiB/s) with 1 file(s) remaining
Completed 35.0 MiB/39.5 MiB (46.9 MiB/s) with 1 file(s) remaining
Completed 35.2 MiB/39.5 MiB (47.1 MiB/s) with 1 file(s) remaining
Completed 35.5 MiB/39.5 MiB (47.4 MiB/s) with 1 file(s) remaining
Completed 35.8 MiB/39.5 MiB (47.7 MiB/s) with 1 file(s) remaining
Completed 36.0 MiB/39.5 MiB (47.8 MiB/s) with 1 file(s) remaining
Completed 36.2 MiB/39.5 MiB (48.1 MiB/s) with 1 file(s) remaining
Completed 36.5 MiB/39.5 MiB (48.4 MiB/s) with 1 file(s) remaining
Completed 36.8 MiB/39.5 MiB (48.5 MiB/s) with 1 file(s) remaining
Completed 37.0 MiB/39.5 MiB (48.7 MiB/s) with 1 file(s) remaining
Completed 37.2 MiB/39.5 MiB (48.4 MiB/s) with 1 file(s) remaining
Completed 37.5 MiB/39.5 MiB (48.5 MiB/s) with 1 file(s) remaining
Completed 37.8 MiB/39.5 MiB (48.7 MiB/s) with 1 file(s) remaining
Completed 38.0 MiB/39.5 MiB (48.8 MiB/s) with 1 file(s) remaining
Completed 38.2 MiB/39.5 MiB (49.0 MiB/s) with 1 file(s) remaining
Completed 38.5 MiB/39.5 MiB (49.2 MiB/s) with 1 file(s) remaining
Completed 38.8 MiB/39.5 MiB (49.5 MiB/s) with 1 file(s) remaining
Completed 39.0 MiB/39.5 MiB (49.7 MiB/s) with 1 file(s) remaining
Completed 39.2 MiB/39.5 MiB (49.9 MiB/s) with 1 file(s) remaining
Completed 39.5 MiB/39.5 MiB (50.2 MiB/s) with 1 file(s) remaining
Completed 39.5 MiB/39.5 MiB (50.2 MiB/s) with 1 file(s) remaining
download: s3://ci-public.pantsbuild.org/24923/550918101/pants.pex.py36.linux to ./pants.pex
Archive: pants.pex
inflating: src/python/pants/engine/native_engine.so
travis_time:end:037cb337:start=1561571566146150973,finish=1561571569589185193,duration=3443034220
travis_fold:end:before_script
travis_time:start:08533e10
$ ./build-support/bin/ci.sh -c -i 6/20
[=== 00:00 CI BEGINS ===]
[=== 00:00 Setting interpreter constraints to ['CPython==3.6.*'] ===]
travis_fold:start:IntegrationTests
[=== 00:00 Running Pants Integration tests [shard 6/20] ===]
/home/travis/.pex/install/ansicolors-1.0.2-py3-none-any.whl.0088834e21b2c8f3df9b82794f4dca1c75af4f12/ansicolors-1.0.2-py3-none-any.whl/colors.py:63: DeprecationWarning: invalid escape sequence \[
return re.sub('\x1b\[.+?m', '', s)
17:52:57 [WARN] Globs did not match. Excludes were: []. Unmatched globs were: ["tests/python/pants_test/binaries/test_*_integration.py"].
17:52:55 00:00 [main]
(To run a reporting server: ./pants server)
17:52:56 00:01 [setup]
17:52:59 00:04 [parse]
Executing tasks in goals: jvm-platform-validate -> bootstrap -> imports -> unpack-jars -> unpack-wheels -> deferred-sources -> native-compile -> link -> gen -> resolve -> resources -> compile -> pyprep -> test
17:52:59 00:04 [jvm-platform-validate]
17:52:59 00:04 [jvm-platform-validate]
17:52:59 00:04 [bootstrap]
17:52:59 00:04 [substitute-aliased-targets]
17:52:59 00:04 [jar-dependency-management]
17:52:59 00:04 [bootstrap-jvm-tools]
17:52:59 00:04 [provide-tools-jar]
17:53:00 00:05 [imports]
17:53:00 00:05 [ivy-imports]
17:53:00 00:05 [unpack-jars]
17:53:00 00:05 [unpack-jars]
17:53:00 00:05 [unpack-wheels]
17:53:00 00:05 [unpack-wheels]
17:53:00 00:05 [deferred-sources]
17:53:00 00:05 [deferred-sources]
17:53:00 00:05 [native-compile]
17:53:00 00:05 [conan-prep]
17:53:00 00:05 [conan-fetch]
17:53:00 00:05 [c-for-ctypes]
17:53:00 00:05 [cpp-for-ctypes]
17:53:00 00:05 [link]
17:53:00 00:05 [shared-libraries]
17:53:00 00:05 [gen]
17:53:00 00:05 [antlr-java]
17:53:00 00:05 [antlr-py]
17:53:00 00:05 [jaxb]
17:53:00 00:05 [protoc]
17:53:00 00:05 [ragel]
17:53:00 00:05 [thrift-java]
17:53:00 00:05 [thrift-py]
17:53:00 00:05 [py-thrift-namespace-clash-check]
17:53:00 00:05 [grpcio-prep]
17:53:00 00:05 [grpcio-run]
17:53:00 00:05 [wire]
17:53:00 00:05 [avro-java]
17:53:00 00:05 [go-thrift]
17:53:00 00:05 [go-protobuf]
17:53:00 00:05 [jax-ws]
17:53:00 00:05 [scrooge]
17:53:00 00:05 [thrifty]
17:53:00 00:05 [resolve]
17:53:00 00:05 [ivy]
17:53:00 00:05 [coursier]
17:53:00 00:05 [go]
17:53:00 00:05 [scala-js-compile]
17:53:00 00:05 [scala-js-link]
17:53:00 00:05 [node]
17:53:00 00:05 [resources]
17:53:00 00:05 [prepare]
17:53:00 00:05 [services]
17:53:00 00:05 [compile]
17:53:00 00:05 [node]
17:53:00 00:05 [compile-jvm-prep-command]
17:53:00 00:05 [jvm_prep_command]
17:53:00 00:05 [compile-prep-command]
17:53:00 00:05 [compile]
17:53:00 00:05 [rsc]
17:53:00 00:05 [zinc]
17:53:00 00:05 [javac]
17:53:00 00:05 [cpp]
17:53:00 00:05 [errorprone]
17:53:00 00:05 [findbugs]
17:53:01 00:06 [go]
17:53:01 00:06 [pyprep]
17:53:01 00:06 [interpreter]
Invalidated 391 targets.
17:53:01 00:06 [build-local-dists]
17:53:01 00:06 [requirements]
Invalidated 37 targets.
17:53:38 00:43 [sources]
Invalidated 406 targets.
17:53:40 00:45 [test]
17:53:40 00:45 [test-jvm-prep-command]
17:53:40 00:45 [jvm_prep_command]
17:53:40 00:45 [test-prep-command]
17:53:40 00:45 [legacy]
17:53:40 00:45 [pytest-prep]
Invalidated 445 targets.
17:53:42 00:47 [pytest]
Invalidated 1 target.
17:53:42 00:47 [run]
Only executing 0 of 2 total tests in shard 6 of 20
- generated xml file: /home/travis/build/pantsbuild/pants/.pants.d/test/pytest/src.python.pants.help.integration/junitxml/TEST-src.python.pants.help.integration.xml -
no tests ran in 0.14 seconds

Invalidated 1 target.
Invalidated 1 target.
17:53:45 00:50 [run]
Only executing 0 of 2 total tests in shard 6 of 20
- generated xml file: /home/travis/build/pantsbuild/pants/.pants.d/test/pytest/tests.python.pants_test.backend.jvm.tasks.jvm_compile.javac.javac_compile_integration/junitxml/TEST-tests.python.pants_test.backend.jvm.tasks.jvm_compile.javac.javac_compile_integration.xml -
no tests ran in 0.10 seconds

Invalidated 1 target.
17:53:47 00:52 [run]
Only executing 0 of 2 total tests in shard 6 of 20
- generated xml file: /home/travis/build/pantsbuild/pants/.pants.d/test/pytest/tests.python.pants_test.backend.python.integration/junitxml/TEST-tests.python.pants_test.backend.python.integration.xml -
no tests ran in 0.10 seconds

Invalidated 1 target.
17:53:49 00:54 [run]
Only executing 1 of 15 total tests in shard 6 of 20
. [100%]
- generated xml file: /home/travis/build/pantsbuild/pants/.pants.d/test/pytest/tests.python.pants_test.reporting.reporting_integration/junitxml/TEST-tests.python.pants_test.reporting.reporting_integration.xml -
1 passed in 122.43 seconds

Invalidated 1 target.
17:55:53 02:58 [run]
Only executing 0 of 4 total tests in shard 6 of 20
- generated xml file: /home/travis/build/pantsbuild/pants/.pants.d/test/pytest/tests.python.pants_test.goal.run_tracker_integration/junitxml/TEST-tests.python.pants_test.goal.run_tracker_integration.xml -
no tests ran in 0.10 seconds

Invalidated 1 target.
17:55:55 03:00 [run]
Only executing 0 of 2 total tests in shard 6 of 20
- generated xml file: /home/travis/build/pantsbuild/pants/.pants.d/test/pytest/tests.python.pants_test.backend.codegen.antlr.python.integration/junitxml/TEST-tests.python.pants_test.backend.codegen.antlr.python.integration.xml -
no tests ran in 0.11 seconds

Invalidated 1 target.
17:55:57 03:02 [run]
Only executing 1 of 8 total tests in shard 6 of 20
. [100%]
- generated xml file: /home/travis/build/pantsbuild/pants/.pants.d/test/pytest/tests.python.pants_test.rules.integration/junitxml/TEST-tests.python.pants_test.rules.integration.xml -
1 passed in 12.31 seconds

Invalidated 1 target.
17:56:11 03:16 [run]
Only executing 0 of 2 total tests in shard 6 of 20
- generated xml file: /home/travis/build/pantsbuild/pants/.pants.d/test/pytest/tests.python.pants_test.core_tasks.deferred_sources_mapper_integration/junitxml/TEST-tests.python.pants_test.core_tasks.deferred_sources_mapper_integration.xml -
no tests ran in 0.09 seconds

Invalidated 1 target.
17:56:13 03:18 [run]
Only executing 0 of 3 total tests in shard 6 of 20
- generated xml file: /home/travis/build/pantsbuild/pants/.pants.d/test/pytest/tests.python.pants_test.core_tasks.prep_command_integration/junitxml/TEST-tests.python.pants_test.core_tasks.prep_command_integration.xml -
no tests ran in 0.09 seconds

Invalidated 1 target.
17:56:15 03:20 [run]
Only executing 0 of 4 total tests in shard 6 of 20
- generated xml file: /home/travis/build/pantsbuild/pants/.pants.d/test/pytest/tests.python.pants_test.core_tasks.substitute_target_aliases_integration/junitxml/TEST-tests.python.pants_test.core_tasks.substitute_target_aliases_integration.xml -
no tests ran in 0.08 seconds

Invalidated 1 target.
17:56:17 03:22 [run]
Only executing 0 of 2 total tests in shard 6 of 20
- generated xml file: /home/travis/build/pantsbuild/pants/.pants.d/test/pytest/tests.python.pants_test.engine.scheduler_integration/junitxml/TEST-tests.python.pants_test.engine.scheduler_integration.xml -
no tests ran in 0.09 seconds

Invalidated 1 target.
17:56:19 03:24 [run]
Only executing 2 of 32 total tests in shard 6 of 20
.. [100%]
- generated xml file: /home/travis/build/pantsbuild/pants/.pants.d/test/pytest/tests.python.pants_test.pantsd.pantsd_integration/junitxml/TEST-tests.python.pants_test.pantsd.pantsd_integration.xml -
2 passed in 51.71 seconds

Invalidated 1 target.
17:57:13 04:18 [run]
Only executing 0 of 1 total tests in shard 6 of 20
- generated xml file: /home/travis/build/pantsbuild/pants/.pants.d/test/pytest/tests.python.pants_test.backend.jvm.tasks.benchmark_run_integration/junitxml/TEST-tests.python.pants_test.backend.jvm.tasks.benchmark_run_integration.xml -
no tests ran in 0.09 seconds

Invalidated 1 target.
17:57:15 04:20 [run]
Only executing 0 of 6 total tests in shard 6 of 20
- generated xml file: /home/travis/build/pantsbuild/pants/.pants.d/test/pytest/tests.python.pants_test.backend.jvm.tasks.binary_create_integration/junitxml/TEST-tests.python.pants_test.backend.jvm.tasks.binary_create_integration.xml -
no tests ran in 0.10 seconds

Invalidated 1 target.
17:57:17 04:22 [run]
Only executing 0 of 2 total tests in shard 6 of 20
- generated xml file: /home/travis/build/pantsbuild/pants/.pants.d/test/pytest/tests.python.pants_test.backend.jvm.tasks.bootstrap_jvm_tools_integration/junitxml/TEST-tests.python.pants_test.backend.jvm.tasks.bootstrap_jvm_tools_integration.xml -
no tests ran in 0.09 seconds

Invalidated 1 target.
17:57:19 04:24 [run]
Only executing 1 of 7 total tests in shard 6 of 20
. [100%]
- generated xml file: /home/travis/build/pantsbuild/pants/.pants.d/test/pytest/tests.python.pants_test.backend.jvm.tasks.checkstyle_integration/junitxml/TEST-tests.python.pants_test.backend.jvm.tasks.checkstyle_integration.xml -
1 passed in 18.90 seconds

Invalidated 1 target.
17:57:40 04:45 [run]
Only executing 0 of 5 total tests in shard 6 of 20
- generated xml file: /home/travis/build/pantsbuild/pants/.pants.d/test/pytest/tests.python.pants_test.backend.jvm.tasks.classmap_integration/junitxml/TEST-tests.python.pants_test.backend.jvm.tasks.classmap_integration.xml -
no tests ran in 0.09 seconds

Invalidated 1 target.
17:57:42 04:47 [run]
Only executing 0 of 2 total tests in shard 6 of 20
- generated xml file: /home/travis/build/pantsbuild/pants/.pants.d/test/pytest/tests.python.pants_test.backend.jvm.tasks.coursier_resolve_integration/junitxml/TEST-tests.python.pants_test.backend.jvm.tasks.coursier_resolve_integration.xml -
no tests ran in 0.09 seconds

Invalidated 1 target.
17:57:43 04:48 [run]
Only executing 0 of 2 total tests in shard 6 of 20
- generated xml file: /home/travis/build/pantsbuild/pants/.pants.d/test/pytest/tests.python.pants_test.backend.jvm.tasks.export_classpath_integration/junitxml/TEST-tests.python.pants_test.backend.jvm.tasks.export_classpath_integration.xml -
no tests ran in 0.09 seconds

Invalidated 1 target.
17:57:45 04:50 [run]
Only executing 0 of 3 total tests in shard 6 of 20
- generated xml file: /home/travis/build/pantsbuild/pants/.pants.d/test/pytest/tests.python.pants_test.backend.jvm.tasks.intransitive_integration/junitxml/TEST-tests.python.pants_test.backend.jvm.tasks.intransitive_integration.xml -
no tests ran in 0.09 seconds

Invalidated 1 target.
17:57:47 04:52 [run]
Only executing 0 of 3 total tests in shard 6 of 20
- generated xml file: /home/travis/build/pantsbuild/pants/.pants.d/test/pytest/tests.python.pants_test.backend.jvm.tasks.ivy_outdated_integration/junitxml/TEST-tests.python.pants_test.backend.jvm.tasks.ivy_outdated_integration.xml -
no tests ran in 0.09 seconds

Invalidated 1 target.
17:57:49 04:54 [run]
Only executing 1 of 8 total tests in shard 6 of 20
. [100%]
- generated xml file: /home/travis/build/pantsbuild/pants/.pants.d/test/pytest/tests.python.pants_test.backend.jvm.tasks.ivy_resolve_integration/junitxml/TEST-tests.python.pants_test.backend.jvm.tasks.ivy_resolve_integration.xml -
1 passed in 5.45 seconds

Invalidated 1 target.
17:57:57 05:02 [run]
Only executing 1 of 16 total tests in shard 6 of 20
. [100%]
- generated xml file: /home/travis/build/pantsbuild/pants/.pants.d/test/pytest/tests.python.pants_test.backend.jvm.tasks.jar_publish_integration/junitxml/TEST-tests.python.pants_test.backend.jvm.tasks.jar_publish_integration.xml -
1 passed in 11.55 seconds

Invalidated 1 target.
17:58:10 05:15 [run]
Only executing 1 of 15 total tests in shard 6 of 20
. [100%]
- generated xml file: /home/travis/build/pantsbuild/pants/.pants.d/test/pytest/tests.python.pants_test.backend.jvm.tasks.junit_run_integration/junitxml/TEST-tests.python.pants_test.backend.jvm.tasks.junit_run_integration.xml -
1 passed in 45.11 seconds

Invalidated 1 target.
17:58:57 06:02 [run]
Only executing 1 of 11 total tests in shard 6 of 20
. [100%]
- generated xml file: /home/travis/build/pantsbuild/pants/.pants.d/test/pytest/tests.python.pants_test.backend.jvm.tasks.junit_tests_concurrency_integration/junitxml/TEST-tests.python.pants_test.backend.jvm.tasks.junit_tests_concurrency_integration.xml -
1 passed in 36.73 seconds

Invalidated 1 target.
17:59:36 06:41 [run]
Only executing 1 of 15 total tests in shard 6 of 20
. [100%]
- generated xml file: /home/travis/build/pantsbuild/pants/.pants.d/test/pytest/tests.python.pants_test.backend.jvm.tasks.junit_tests_integration/junitxml/TEST-tests.python.pants_test.backend.jvm.tasks.junit_tests_integration.xml -
1 passed in 19.87 seconds

Invalidated 1 target.
17:59:58 07:03 [run]
Only executing 0 of 2 total tests in shard 6 of 20
- generated xml file: /home/travis/build/pantsbuild/pants/.pants.d/test/pytest/tests.python.pants_test.backend.jvm.tasks.jvm_bundle_integration/junitxml/TEST-tests.python.pants_test.backend.jvm.tasks.jvm_bundle_integration.xml -
no tests ran in 0.09 seconds

Invalidated 1 target.
17:59:59 07:04 [run]
Only executing 0 of 4 total tests in shard 6 of 20
- generated xml file: /home/travis/build/pantsbuild/pants/.pants.d/test/pytest/tests.python.pants_test.backend.jvm.tasks.jvm_dependency_usage_integration/junitxml/TEST-tests.python.pants_test.backend.jvm.tasks.jvm_dependency_usage_integration.xml -
no tests ran in 0.09 seconds

Invalidated 1 target.
18:00:02 07:07 [run]
Only executing 0 of 6 total tests in shard 6 of 20
- generated xml file: /home/travis/build/pantsbuild/pants/.pants.d/test/pytest/tests.python.pants_test.backend.jvm.tasks.jvm_platform_analysis_integration/junitxml/TEST-tests.python.pants_test.backend.jvm.tasks.jvm_platform_analysis_integration.xml -
no tests ran in 0.09 seconds

Invalidated 1 target.
18:00:04 07:09 [run]
Only executing 0 of 3 total tests in shard 6 of 20
- generated xml file: /home/travis/build/pantsbuild/pants/.pants.d/test/pytest/tests.python.pants_test.backend.jvm.tasks.jvm_prep_command_integration/junitxml/TEST-tests.python.pants_test.backend.jvm.tasks.jvm_prep_command_integration.xml -
no tests ran in 0.09 seconds

Invalidated 1 target.
18:00:06 07:11 [run]
Only executing 0 of 6 total tests in shard 6 of 20
- generated xml file: /home/travis/build/pantsbuild/pants/.pants.d/test/pytest/tests.python.pants_test.backend.jvm.tasks.jvm_run_integration/junitxml/TEST-tests.python.pants_test.backend.jvm.tasks.jvm_run_integration.xml -
no tests ran in 0.09 seconds

Invalidated 1 target.
18:00:08 07:13 [run]
Only executing 0 of 4 total tests in shard 6 of 20
- generated xml file: /home/travis/build/pantsbuild/pants/.pants.d/test/pytest/tests.python.pants_test.backend.jvm.tasks.scala_repl_integration/junitxml/TEST-tests.python.pants_test.backend.jvm.tasks.scala_repl_integration.xml -
no tests ran in 0.09 seconds

Invalidated 1 target.
18:00:10 07:15 [run]
Only executing 0 of 2 total tests in shard 6 of 20
- generated xml file: /home/travis/build/pantsbuild/pants/.pants.d/test/pytest/tests.python.pants_test.backend.jvm.tasks.scalafix/junitxml/TEST-tests.python.pants_test.backend.jvm.tasks.scalafix.xml -
no tests ran in 0.09 seconds

Invalidated 1 target.
18:00:12 07:17 [run]
Only executing 1 of 11 total tests in shard 6 of 20
. [100%]
- generated xml file: /home/travis/build/pantsbuild/pants/.pants.d/test/pytest/tests.python.pants_test.backend.jvm.tasks.scope_provided_integration/junitxml/TEST-tests.python.pants_test.backend.jvm.tasks.scope_provided_integration.xml -
1 passed in 17.67 seconds

Invalidated 1 target.
18:00:31 07:36 [run]
Only executing 1 of 10 total tests in shard 6 of 20
. [100%]
- generated xml file: /home/travis/build/pantsbuild/pants/.pants.d/test/pytest/tests.python.pants_test.backend.jvm.tasks.scope_runtime_integration/junitxml/TEST-tests.python.pants_test.backend.jvm.tasks.scope_runtime_integration.xml -
1 passed in 12.36 seconds

Invalidated 1 target.
18:00:45 07:50 [run]
Only executing 0 of 3 total tests in shard 6 of 20
- generated xml file: /home/travis/build/pantsbuild/pants/.pants.d/test/pytest/tests.python.pants_test.backend.jvm.tasks.scope_test_integration/junitxml/TEST-tests.python.pants_test.backend.jvm.tasks.scope_test_integration.xml -
no tests ran in 0.09 seconds

Invalidated 1 target.
18:00:47 07:52 [run]
Only executing 0 of 5 total tests in shard 6 of 20
- generated xml file: /home/travis/build/pantsbuild/pants/.pants.d/test/pytest/tests.python.pants_test.backend.python.tasks.native.integration/junitxml/TEST-tests.python.pants_test.backend.python.tasks.native.integration.xml -
no tests ran in 1.74 seconds

Invalidated 1 target.
18:00:51 07:56 [run]
Only executing 1 of 22 total tests in shard 6 of 20
. [100%]
- generated xml file: /home/travis/build/pantsbuild/pants/.pants.d/test/pytest/tests.python.pants_test.option.options_integration/junitxml/TEST-tests.python.pants_test.option.options_integration.xml -
1 passed in 4.14 seconds

Invalidated 1 target.
18:00:57 08:02 [run]
Only executing 0 of 5 total tests in shard 6 of 20
- generated xml file: /home/travis/build/pantsbuild/pants/.pants.d/test/pytest/tests.python.pants_test.backend.jvm.tasks.jvm_compile.scala.scalac_plugin_integration/junitxml/TEST-tests.python.pants_test.backend.jvm.tasks.jvm_compile.scala.scalac_plugin_integration.xml -
no tests ran in 0.10 seconds

Invalidated 1 target.
18:00:59 08:04 [run]
Only executing 0 of 4 total tests in shard 6 of 20
- generated xml file: /home/travis/build/pantsbuild/pants/.pants.d/test/pytest/tests.python.pants_test.backend.codegen.wire.java.integration/junitxml/TEST-tests.python.pants_test.backend.codegen.wire.java.integration.xml -
no tests ran in 0.09 seconds

Invalidated 1 target.
18:01:01 08:06 [run]
Only executing 0 of 3 total tests in shard 6 of 20
- generated xml file: /home/travis/build/pantsbuild/pants/.pants.d/test/pytest/tests.python.pants_test.targets.jvm_app_integration/junitxml/TEST-tests.python.pants_test.targets.jvm_app_integration.xml -
no tests ran in 0.09 seconds

Invalidated 1 target.
18:01:03 08:08 [run]
Only executing 0 of 1 total tests in shard 6 of 20
- generated xml file: /home/travis/build/pantsbuild/pants/.pants.d/test/pytest/tests.python.pants_test.targets.scala_library_integration/junitxml/TEST-tests.python.pants_test.targets.scala_library_integration.xml -
no tests ran in 0.09 seconds

Invalidated 1 target.
18:01:05 08:10 [run]
Only executing 0 of 2 total tests in shard 6 of 20
- generated xml file: /home/travis/build/pantsbuild/pants/.pants.d/test/pytest/tests.python.pants_test.targets.unknown_arguments_integration/junitxml/TEST-tests.python.pants_test.targets.unknown_arguments_integration.xml -
no tests ran in 0.09 seconds

Invalidated 1 target.
18:01:07 08:12 [run]
Only executing 0 of 4 total tests in shard 6 of 20
- generated xml file: /home/travis/build/pantsbuild/pants/.pants.d/test/pytest/tests.python.pants_test.backend.python.tasks.build_local_python_distributions_integration/junitxml/TEST-tests.python.pants_test.backend.python.tasks.build_local_python_distributions_integration.xml -
no tests ran in 0.09 seconds

Invalidated 1 target.
18:01:09 08:14 [run]
Only executing 0 of 6 total tests in shard 6 of 20
- generated xml file: /home/travis/build/pantsbuild/pants/.pants.d/test/pytest/tests.python.pants_test.backend.python.tasks.interpreter_selection_integration/junitxml/TEST-tests.python.pants_test.backend.python.tasks.interpreter_selection_integration.xml -
no tests ran in 0.25 seconds

Invalidated 1 target.
18:01:11 08:16 [run]
Only executing 0 of 1 total tests in shard 6 of 20
- generated xml file: /home/travis/build/pantsbuild/pants/.pants.d/test/pytest/tests.python.pants_test.backend.python.tasks.isort_run_integration/junitxml/TEST-tests.python.pants_test.backend.python.tasks.isort_run_integration.xml -
no tests ran in 0.60 seconds

Invalidated 1 target.
18:01:14 08:19 [run]
Only executing 1 of 10 total tests in shard 6 of 20
. [100%]
- generated xml file: /home/travis/build/pantsbuild/pants/.pants.d/test/pytest/tests.python.pants_test.backend.python.tasks.pytest_run_integration/junitxml/TEST-tests.python.pants_test.backend.python.tasks.pytest_run_integration.xml -
1 passed in 15.44 seconds

Invalidated 1 target.
18:01:31 08:36 [run]
Only executing 1 of 7 total tests in shard 6 of 20
. [100%]
- generated xml file: /home/travis/build/pantsbuild/pants/.pants.d/test/pytest/tests.python.pants_test.backend.python.tasks.python_binary_integration/junitxml/TEST-tests.python.pants_test.backend.python.tasks.python_binary_integration.xml -
1 passed in 19.47 seconds

Invalidated 1 target.
18:01:53 08:58 [run]
Only executing 0 of 3 total tests in shard 6 of 20
- generated xml file: /home/travis/build/pantsbuild/pants/.pants.d/test/pytest/tests.python.pants_test.backend.python.tasks.python_repl_integration/junitxml/TEST-tests.python.pants_test.backend.python.tasks.python_repl_integration.xml -
no tests ran in 0.09 seconds

Invalidated 1 target.
18:01:55 09:00 [run]
Only executing 1 of 10 total tests in shard 6 of 20
. [100%]
- generated xml file: /home/travis/build/pantsbuild/pants/.pants.d/test/pytest/tests.python.pants_test.backend.python.tasks.python_run_integration/junitxml/TEST-tests.python.pants_test.backend.python.tasks.python_run_integration.xml -
1 passed in 6.74 seconds

Invalidated 1 target.
18:02:03 09:08 [run]
Only executing 0 of 4 total tests in shard 6 of 20
- generated xml file: /home/travis/build/pantsbuild/pants/.pants.d/test/pytest/tests.python.pants_test.backend.python.tasks.setup_py_integration/junitxml/TEST-tests.python.pants_test.backend.python.tasks.setup_py_integration.xml -
no tests ran in 0.09 seconds

Invalidated 1 target.
18:02:05 09:10 [run]
Only executing 0 of 5 total tests in shard 6 of 20
- generated xml file: /home/travis/build/pantsbuild/pants/.pants.d/test/pytest/tests.python.pants_test.backend.codegen.protobuf.java.integration/junitxml/TEST-tests.python.pants_test.backend.codegen.protobuf.java.integration.xml -
no tests ran in 0.10 seconds

Invalidated 1 target.
18:02:07 09:12 [run]
Only executing 0 of 1 total tests in shard 6 of 20
- generated xml file: /home/travis/build/pantsbuild/pants/.pants.d/test/pytest/tests.python.pants_test.backend.jvm.integration/junitxml/TEST-tests.python.pants_test.backend.jvm.integration.xml -
no tests ran in 0.09 seconds

Invalidated 1 target.
18:02:09 09:14 [run]
Only executing 0 of 4 total tests in shard 6 of 20
- generated xml file: /home/travis/build/pantsbuild/pants/.pants.d/test/pytest/tests.python.pants_test.task.goal_options_mixin_integration/junitxml/TEST-tests.python.pants_test.task.goal_options_mixin_integration.xml -
no tests ran in 0.10 seconds

Invalidated 1 target.
18:02:11 09:16 [run]
Only executing 0 of 6 total tests in shard 6 of 20
- generated xml file: /home/travis/build/pantsbuild/pants/.pants.d/test/pytest/tests.python.pants_test.invalidation.strict_deps_invalidation_integration/junitxml/TEST-tests.python.pants_test.invalidation.strict_deps_invalidation_integration.xml -
no tests ran in 0.09 seconds

Invalidated 1 target.
18:02:13 09:18 [run]
Only executing 0 of 3 total tests in shard 6 of 20
- generated xml file: /home/travis/build/pantsbuild/pants/.pants.d/test/pytest/tests.python.pants_test.engine.legacy.build_ignore_integration/junitxml/TEST-tests.python.pants_test.engine.legacy.build_ignore_integration.xml -
no tests ran in 0.09 seconds

Invalidated 1 target.
18:02:16 09:21 [run]
Only executing 1 of 7 total tests in shard 6 of 20
. [100%]
- generated xml file: /home/travis/build/pantsbuild/pants/.pants.d/test/pytest/tests.python.pants_test.engine.legacy.bundle_integration/junitxml/TEST-tests.python.pants_test.engine.legacy.bundle_integration.xml -
1 passed in 12.57 seconds

Invalidated 1 target.
18:02:30 09:35 [run]
Only executing 2 of 32 total tests in shard 6 of 20
.. [100%]
- generated xml file: /home/travis/build/pantsbuild/pants/.pants.d/test/pytest/tests.python.pants_test.engine.legacy.changed_integration/junitxml/TEST-tests.python.pants_test.engine.legacy.changed_integration.xml -
2 passed in 10.85 seconds

Invalidated 1 target.
18:02:43 09:48 [run]
Only executing 0 of 5 total tests in shard 6 of 20
- generated xml file: /home/travis/build/pantsbuild/pants/.pants.d/test/pytest/tests.python.pants_test.engine.legacy.console_rule_integration/junitxml/TEST-tests.python.pants_test.engine.legacy.console_rule_integration.xml -
no tests ran in 0.13 seconds

Invalidated 1 target.
18:02:45 09:50 [run]
Only executing 0 of 4 total tests in shard 6 of 20
- generated xml file: /home/travis/build/pantsbuild/pants/.pants.d/test/pytest/tests.python.pants_test.engine.legacy.dependees_integration/junitxml/TEST-tests.python.pants_test.engine.legacy.dependees_integration.xml -
no tests ran in 0.09 seconds

Invalidated 1 target.
18:02:47 09:52 [run]
Only executing 0 of 4 total tests in shard 6 of 20
- generated xml file: /home/travis/build/pantsbuild/pants/.pants.d/test/pytest/tests.python.pants_test.engine.legacy.dependencies_integration/junitxml/TEST-tests.python.pants_test.engine.legacy.dependencies_integration.xml -
no tests ran in 0.09 seconds

Invalidated 1 target.
18:02:49 09:54 [run]
Only executing 0 of 2 total tests in shard 6 of 20
- generated xml file: /home/travis/build/pantsbuild/pants/.pants.d/test/pytest/tests.python.pants_test.engine.legacy.filedeps_integration/junitxml/TEST-tests.python.pants_test.engine.legacy.filedeps_integration.xml -
no tests ran in 0.09 seconds

Invalidated 1 target.
18:02:51 09:56 [run]
Only executing 1 of 11 total tests in shard 6 of 20
. [100%]
- generated xml file: /home/travis/build/pantsbuild/pants/.pants.d/test/pytest/tests.python.pants_test.engine.legacy.filemap_integration/junitxml/TEST-tests.python.pants_test.engine.legacy.filemap_integration.xml -
1 passed in 3.72 seconds

Invalidated 1 target.
18:02:56 10:01 [run]
Only executing 0 of 6 total tests in shard 6 of 20
- generated xml file: /home/travis/build/pantsbuild/pants/.pants.d/test/pytest/tests.python.pants_test.engine.legacy.graph_integration/junitxml/TEST-tests.python.pants_test.engine.legacy.graph_integration.xml -
no tests ran in 0.09 seconds

Invalidated 1 target.
18:02:58 10:03 [run]
Only executing 0 of 5 total tests in shard 6 of 20
- generated xml file: /home/travis/build/pantsbuild/pants/.pants.d/test/pytest/tests.python.pants_test.engine.legacy.list_integration/junitxml/TEST-tests.python.pants_test.engine.legacy.list_integration.xml -
no tests ran in 0.09 seconds

Invalidated 1 target.
18:03:00 10:05 [run]
Only executing 0 of 4 total tests in shard 6 of 20
- generated xml file: /home/travis/build/pantsbuild/pants/.pants.d/test/pytest/tests.python.pants_test.engine.legacy.owners_integration/junitxml/TEST-tests.python.pants_test.engine.legacy.owners_integration.xml -
no tests ran in 0.09 seconds

Invalidated 1 target.
18:03:02 10:07 [run]
Only executing 0 of 2 total tests in shard 6 of 20
- generated xml file: /home/travis/build/pantsbuild/pants/.pants.d/test/pytest/tests.python.pants_test.logging.test_native_engine_logging/junitxml/TEST-tests.python.pants_test.logging.test_native_engine_logging.xml -
no tests ran in 0.14 seconds

Invalidated 1 target.
18:03:04 10:09 [run]
Only executing 0 of 2 total tests in shard 6 of 20
- generated xml file: /home/travis/build/pantsbuild/pants/.pants.d/test/pytest/tests.python.pants_test.logging.test_workunit_label/junitxml/TEST-tests.python.pants_test.logging.test_workunit_label.xml -
no tests ran in 0.09 seconds

Invalidated 1 target.
18:03:07 10:12 [run]
Only executing 1 of 14 total tests in shard 6 of 20
. [100%]
- generated xml file: /home/travis/build/pantsbuild/pants/.pants.d/test/pytest/tests.python.pants_test.backend.jvm.tasks.jvm_compile.zinc.zinc_compile_integration/junitxml/TEST-tests.python.pants_test.backend.jvm.tasks.jvm_compile.zinc.zinc_compile_integration.xml -
1 passed in 21.58 seconds

Invalidated 1 target.
18:03:30 10:35 [run]
Only executing 1 of 15 total tests in shard 6 of 20
. [100%]
- generated xml file: /home/travis/build/pantsbuild/pants/.pants.d/test/pytest/tests.python.pants_test.backend.jvm.tasks.jvm_compile.zinc.zinc_compile_integration_with_zjars/junitxml/TEST-tests.python.pants_test.backend.jvm.tasks.jvm_compile.zinc.zinc_compile_integration_with_zjars.xml -
1 passed in 28.08 seconds

Invalidated 1 target.
18:04:00 11:05 [run]
Only executing 1 of 7 total tests in shard 6 of 20
. [100%]
- generated xml file: /home/travis/build/pantsbuild/pants/.pants.d/test/pytest/tests.python.pants_test.build_graph.build_graph_integration/junitxml/TEST-tests.python.pants_test.build_graph.build_graph_integration.xml -
1 passed in 8.81 seconds

Invalidated 1 target.
18:04:11 11:16 [run]
Only executing 0 of 4 total tests in shard 6 of 20
- generated xml file: /home/travis/build/pantsbuild/pants/.pants.d/test/pytest/tests.python.pants_test.build_graph.intermediate_target_integration/junitxml/TEST-tests.python.pants_test.build_graph.intermediate_target_integration.xml -
no tests ran in 0.09 seconds

Invalidated 1 target.
18:04:13 11:18 [run]
Only executing 0 of 2 total tests in shard 6 of 20
- generated xml file: /home/travis/build/pantsbuild/pants/.pants.d/test/pytest/tests.python.pants_test.build_graph.subproject_integration/junitxml/TEST-tests.python.pants_test.build_graph.subproject_integration.xml -
no tests ran in 0.09 seconds

Invalidated 1 target.
18:04:15 11:20 [run]
Only executing 0 of 4 total tests in shard 6 of 20
- generated xml file: /home/travis/build/pantsbuild/pants/.pants.d/test/pytest/tests.python.pants_test.help.help_integration/junitxml/TEST-tests.python.pants_test.help.help_integration.xml -
no tests ran in 0.10 seconds

Invalidated 1 target.
18:04:17 11:22 [run]
Only executing 0 of 2 total tests in shard 6 of 20
- generated xml file: /home/travis/build/pantsbuild/pants/.pants.d/test/pytest/tests.python.pants_test.backend.docgen.tasks.markdown_to_html_integration/junitxml/TEST-tests.python.pants_test.backend.docgen.tasks.markdown_to_html_integration.xml -
no tests ran in 0.09 seconds

Invalidated 1 target.
18:04:19 11:24 [run]
Only executing 3 of 65 total tests in shard 6 of 20
F.. [100%]
==================== FAILURES ====================
___ TestProjectsIntegrationTest.test_shard_13 ____
self = <pants_test.projects.test_testprojects_integration.TestProjectsIntegrationTest testMethod=test_shard_13>
 def test_shard_13(self):
> self.run_shard(13)
.pants.d/pyprep/sources/f3c483e09513c9e309ebce1458cc5cd088806436/pants_test/projects/test_testprojects_integration.py:183:
_ _ _ _ _ _ _ _ _ _ _ _ _ _ _ _ _ _ _ _ _ _ _ _ _
.pants.d/pyprep/sources/f3c483e09513c9e309ebce1458cc5cd088806436/pants_test/pants_run_integration_test.py:108: in wrapper
 f(self, *args, **kwargs)
.pants.d/pyprep/sources/f3c483e09513c9e309ebce1458cc5cd088806436/pants_test/projects/test_testprojects_integration.py:136: in run_shard
 self.assert_success(pants_run)
.pants.d/pyprep/sources/f3c483e09513c9e309ebce1458cc5cd088806436/pants_test/pants_run_integration_test.py:483: in assert_success
 self.assert_result(pants_run, PANTS_SUCCEEDED_EXIT_CODE, expected=True, msg=msg)
.pants.d/pyprep/sources/f3c483e09513c9e309ebce1458cc5cd088806436/pants_test/pants_run_integration_test.py:504: in assert_result
 assertion(value, pants_run.returncode, error_msg)
E AssertionError: 0 != 1 : /home/travis/build/pantsbuild/pants/pants --no-pantsrc --pants-workdir=/home/travis/build/pantsbuild/pants/.pants.d/tmp/tmpg8m63mpq.pants.d --kill-nailguns --print-exception-stacktrace=True test examples/tests/python/example_test/hello/greet:greet examples/tests/python/example_test/hello/greet:prep examples/tests/python/example_test/tensorflow_custom_op:tensorflow_custom_op examples/tests/python/example_test/usethriftpy:usethrift examples/tests/scala/org/pantsbuild/example/hello/welcome:welcome examples/tests/scala/org/pantsbuild/example/specs2:specs2 testprojects/3rdparty/checkstyle:checkstyle testprojects/3rdparty/com/google/guava:ancient-guava --jvm-platform-default-platform=java7
E returncode: 1
E stdout:
E 
E 18:04:27 00:00 [main]
E (To run a reporting server: ./pants server)
E 18:04:28 00:01 [setup]
E 18:04:28 00:01 [parse]
E Executing tasks in goals: bootstrap -> imports -> unpack-jars -> unpack-wheels -> deferred-sources -> native-compile -> link -> jvm-platform-validate -> gen -> resolve -> resources -> compile -> pyprep -> test
E 18:04:29 00:02 [bootstrap]
E 18:04:29 00:02 [substitute-aliased-targets]
E 18:04:29 00:02 [jar-dependency-management]
E 18:04:29 00:02 [bootstrap-jvm-tools]
E 18:04:29 00:02 [provide-tools-jar]
E 18:04:29 00:02 [imports]
E 18:04:29 00:02 [ivy-imports]
E 18:04:29 00:02 [unpack-jars]
E 18:04:29 00:02 [unpack-jars]
E 18:04:29 00:02 [unpack-wheels]
E 18:04:29 00:02 [unpack-wheels]
E Invalidated 1 target.
E 18:04:29 00:02 [extract-native-wheels]
E 18:04:41 00:14 [deferred-sources]
E 18:04:41 00:14 [deferred-sources]
E 18:04:47 00:20 [native-compile]
E 18:04:47 00:20 [conan-prep]
E 18:04:47 00:20 [conan-fetch]
E 18:04:47 00:20 [c-for-ctypes]
E 18:04:47 00:20 [cpp-for-ctypes]
E Invalidated 1 target.
E selected compiler exe name: 'g++'
E 18:05:01 00:34 [cpp-compile]
E 
E 18:05:04 00:37 [link]
E 18:05:04 00:37 [shared-libraries]
E Invalidated 1 target.
E selected linker exe name: 'g++'
E 18:05:04 00:37 [link-shared-libraries]
E ==== stdout ====
E 
E ==== stderr ====
E /home/travis/.cache/pants/bin/binutils/linux/x86_64/2.30/binutils/bin/ld: cannot find -ltensorflow_framework
E collect2: error: ld returned 1 exit status
E 
E FAILURE: Error linking native objects with command ['g++', '-shared', '-o', '/home/travis/build/pantsbuild/pants/.pants.d/tmp/tmpg8m63mpq.pants.d/link/shared-libraries/75beb223f481/examples.src.python.example.tensorflow_custom_op.tensorflow-zero-out-op/current/libtensorflow-zero-out-operator.so', '-L/home/travis/build/pantsbuild/pants/.pants.d/tmp/tmpg8m63mpq.pants.d/unpack-wheels/unpack-wheels/252d64521cf9/examples.3rdparty.python.tensorflow-native-libs/current/', '-ltensorflow_framework', '/home/travis/build/pantsbuild/pants/.pants.d/tmp/tmpg8m63mpq.pants.d/native-compile/cpp-for-ctypes/bf77967d723d/examples.src.python.example.tensorflow_custom_op.tensorflow-zero-out-op/current/zero_out_op.o'] and environment {'PATH': '/home/travis/.cache/pants/bin/gcc/linux/x86_64/7.3.0/gcc/bin:/home/travis/.cache/pants/bin/binutils/linux/x86_64/2.30/binutils/bin:/home/travis/.cache/pants/bin/binutils/linux/x86_64/2.30/binutils/bin', 'LD_LIBRARY_PATH': '/home/travis/.cache/pants/bin/gcc/linux/x86_64/7.3.0/gcc/lib64:/home/travis/.cache/pants/bin/gcc/linux/x86_64/7.3.0/gcc/lib:/home/travis/.cache/pants/bin/gcc/linux/x86_64/7.3.0/gcc/lib/gcc:/home/travis/.cache/pants/bin/gcc/linux/x86_64/7.3.0/gcc/lib/gcc/x86_64-pc-linux-gnu/7.3.0', 'LDSHARED': 'g++', 'LIBRARY_PATH': '/usr/lib/x86_64-linux-gnu'} for request LinkSharedLibraryRequest(linker<Exactly(Linker)>=Linker(path_entries=['/home/travis/.cache/pants/bin/gcc/linux/x86_64/7.3.0/gcc/bin', '/home/travis/.cache/pants/bin/binutils/linux/x86_64/2.30/binutils/bin', '/home/travis/.cache/pants/bin/binutils/linux/x86_64/2.30/binutils/bin'], exe_filename=g++, runtime_library_dirs=['/home/travis/.cache/pants/bin/gcc/linux/x86_64/7.3.0/gcc/lib64', '/home/travis/.cache/pants/bin/gcc/linux/x86_64/7.3.0/gcc/lib', '/home/travis/.cache/pants/bin/gcc/linux/x86_64/7.3.0/gcc/lib/gcc', '/home/travis/.cache/pants/bin/gcc/linux/x86_64/7.3.0/gcc/lib/gcc/x86_64-pc-linux-gnu/7.3.0'], linking_library_dirs=[], extra_args=[], extra_object_files=['/usr/lib/x86_64-linux-gnu/crti.o']), object_files<Exactly(tuple)>=('/home/travis/build/pantsbuild/pants/.pants.d/tmp/tmpg8m63mpq.pants.d/native-compile/cpp-for-ctypes/bf77967d723d/examples.src.python.example.tensorflow_custom_op.tensorflow-zero-out-op/current/zero_out_op.o',), native_artifact<Exactly(NativeArtifact)>=NativeArtifact(lib_name=tensorflow-zero-out-operator), output_dir=/home/travis/build/pantsbuild/pants/.pants.d/tmp/tmpg8m63mpq.pants.d/link/shared-libraries/75beb223f481/examples.src.python.example.tensorflow_custom_op.tensorflow-zero-out-op/current, external_lib_dirs<Exactly(tuple)>=('/home/travis/build/pantsbuild/pants/.pants.d/tmp/tmpg8m63mpq.pants.d/unpack-wheels/unpack-wheels/252d64521cf9/examples.3rdparty.python.tensorflow-native-libs/current/',), external_lib_names<Exactly(tuple)>=('tensorflow_framework',)). Exit code was: 1.
E 
E 
E Waiting for background workers to finish.
E 18:05:04 00:37 [complete]
E FAILURE
E stderr:
E 18:04:39 [WARN] /home/travis/.pex/code/0a864aa82eacc3c09f977c66efe901cea6052a36/pants/task/unpack_remote_sources_base.py:85: DeprecationWarning: Flags not at the start of the expression 'include\\/([^/]+/)*([' (truncated)
E compiled_patterns.append(re.compile(fnmatch_translate_extended(p)))
E 
E 18:04:39 [WARN] /home/travis/.pex/code/0a864aa82eacc3c09f977c66efe901cea6052a36/pants/task/unpack_remote_sources_base.py:85: DeprecationWarning: Flags not at the start of the expression '\\.\\/([^/]+)\\.so\\Z(?m' (truncated)
E compiled_patterns.append(re.compile(fnmatch_translate_extended(p)))
E 
E 18:04:47 [INFO] Attempting to fetch gcc.tar.gz binary from: https://binaries.pantsbuild.org/bin/gcc/linux/x86_64/7.3.0/gcc.tar.gz ...
E 
E 2% . 4950 KB
E 4% .. 9890 KB
E 6% ... 14830 KB
E 8% .... 19780 KB
E 10% ..... 24720 KB
E 12% ...... 29660 KB
E 14% ....... 34600 KB
E 16% ........ 39550 KB
E 18% ......... 44490 KB
E 20% .......... 49430 KB
E 22% ........... 54370 KB
E 24% ............ 59320 KB
E 26% ............. 64260 KB
E 28% .............. 69200 KB
E 30% ............... 74140 KB
E 32% ................ 79090 KB
E 34% ................. 84030 KB
E 36% .................. 88970 KB
E 38% ................... 93910 KB
E 40% .................... 98860 KB
E 42% ..................... 103800 KB
E 44% ...................... 108740 KB
E 46% ....................... 113680 KB
E 48% ........................ 118630 KB
E 50% ......................... 123570 KB
E 52% .......................... 128510 KB
E 54% ........................... 133450 KB
E 56% ............................ 138400 KB
E 58% ............................. 143340 KB
E 60% .............................. 148280 KB
E 62% ............................... 153220 KB
E 64% ................................ 158170 KB
E 66% ................................. 163110 KB
E 68% .................................. 168050 KB
E 70% ................................... 172990 KB
E 72% .................................... 177940 KB
E 74% ..................................... 182880 KB
E 76% ...................................... 187820 KB
E 78% ....................................... 192760 KB
E 80% ........................................ 197710 KB
E 82% ......................................... 202650 KB
E 84% .......................................... 207590 KB
E 86% ........................................... 212530 KB
E 88% ............................................ 217480 KB
E 90% ............................................. 222420 KB
E 92% .............................................. 227360 KB
E 94% ............................................... 232300 KB
E 96% ................................................ 237250 KB
E 98% ................................................. 242190 KB 4.226s
E 18:04:52 [INFO] Fetched gcc.tar.gz binary from: https://binaries.pantsbuild.org/bin/gcc/linux/x86_64/7.3.0/gcc.tar.gz .
E 18:04:52 [INFO] Extracting /home/travis/.cache/pants/bin/gcc/linux/x86_64/7.3.0/gcc.tar.gz to /home/travis/.cache/pants/bin/gcc/linux/x86_64/7.3.0/gcc .
E 18:04:59 [INFO] Attempting to fetch binutils.tar.gz binary from: https://binaries.pantsbuild.org/bin/binutils/linux/x86_64/2.30/binutils.tar.gz ...
E 
E 2% . 790 KB
E 4% .. 1570 KB
E 6% ... 2360 KB
E 8% .... 3140 KB
E 10% ..... 3920 KB
E 12% ...... 4710 KB
E 14% ....... 5490 KB
E 16% ........ 6270 KB
E 18% ......... 7060 KB
E 20% .......... 7840 KB
E 22% ........... 8620 KB
E 24% ............ 9410 KB
E 26% ............. 10190 KB
E 28% .............. 10980 KB
E 30% ............... 11760 KB
E 32% ................ 12540 KB
E 34% ................. 13330 KB
E 36% .................. 14110 KB
E 38% ................... 14890 KB
E 40% .................... 15680 KB
E 42% ..................... 16460 KB
E 44% ...................... 17240 KB
E 46% ....................... 18030 KB
E 48% ........................ 18810 KB
E 50% ......................... 19600 KB
E 52% .......................... 20380 KB
E 54% ........................... 21160 KB
E 56% ............................ 21950 KB
E 58% ............................. 22730 KB
E 60% .............................. 23510 KB
E 62% ............................... 24300 KB
E 64% ................................ 25080 KB
E 66% ................................. 25860 KB
E 68% .................................. 26650 KB
E 70% ................................... 27430 KB
E 72% .................................... 28220 KB
E 74% ..................................... 29000 KB
E 76% ...................................... 29780 KB
E 78% ....................................... 30570 KB
E 80% ........................................ 31350 KB
E 82% ......................................... 32130 KB
E 84% .......................................... 32920 KB
E 86% ........................................... 33700 KB
E 88% ............................................ 34480 KB
E 90% ............................................. 35270 KB
E 92% .............................................. 36050 KB
E 94% ............................................... 36840 KB
E 96% ................................................ 37620 KB
E 98% ................................................. 38400 KB
E 100% .................................................. 39181 KB 1.039s
E 18:05:00 [INFO] Fetched binutils.tar.gz binary from: https://binaries.pantsbuild.org/bin/binutils/linux/x86_64/2.30/binutils.tar.gz .
E 18:05:00 [INFO] Extracting /home/travis/.cache/pants/bin/binutils/linux/x86_64/2.30/binutils.tar.gz to /home/travis/.cache/pants/bin/binutils/linux/x86_64/2.30/binutils .
-------------- Captured stdout call --------------
logs/exceptions.log +++
logs/exceptions.log ---
logs/exceptions.7483.log +++
logs/exceptions.7483.log ---
- generated xml file: /home/travis/build/pantsbuild/pants/.pants.d/test/pytest/tests.python.pants_test.projects.testprojects_integration/junitxml/TEST-tests.python.pants_test.projects.testprojects_integration.xml -
============ short test summary info =============
FAIL tests/python/pants_test/projects/test_testprojects_integration.py::TestProjectsIntegrationTest::test_shard_13
1 failed, 2 passed in 241.50 seconds

Invalidated 1 target.
18:08:22 15:27 [run]
Only executing 0 of 6 total tests in shard 6 of 20
- generated xml file: /home/travis/build/pantsbuild/pants/.pants.d/test/pytest/tests.python.pants_test.bin.integration/junitxml/TEST-tests.python.pants_test.bin.integration.xml -
no tests ran in 0.11 seconds

Invalidated 1 target.
18:08:24 15:29 [run]
Only executing 1 of 15 total tests in shard 6 of 20
. [100%]
- generated xml file: /home/travis/build/pantsbuild/pants/.pants.d/test/pytest/tests.python.pants_test.backend.project_info.tasks.export_integration/junitxml/TEST-tests.python.pants_test.backend.project_info.tasks.export_integration.xml -
1 passed in 20.26 seconds

Invalidated 1 target.
18:08:47 15:52 [run]
Only executing 0 of 6 total tests in shard 6 of 20
- generated xml file: /home/travis/build/pantsbuild/pants/.pants.d/test/pytest/tests.python.pants_test.backend.project_info.tasks.idea_plugin_integration/junitxml/TEST-tests.python.pants_test.backend.project_info.tasks.idea_plugin_integration.xml -
no tests ran in 0.62 seconds

Invalidated 1 target.
18:08:49 15:54 [run]
Only executing 0 of 1 total tests in shard 6 of 20
- generated xml file: /home/travis/build/pantsbuild/pants/.pants.d/test/pytest/tests.python.pants_test.releases.releases/junitxml/TEST-tests.python.pants_test.releases.releases.xml -
no tests ran in 0.43 seconds

Invalidated 1 target.
18:08:52 15:57 [run]
Only executing 0 of 1 total tests in shard 6 of 20
- generated xml file: /home/travis/build/pantsbuild/pants/.pants.d/test/pytest/tests.python.pants_test.tasks.bootstrap_jvm_tools_integration/junitxml/TEST-tests.python.pants_test.tasks.bootstrap_jvm_tools_integration.xml -
no tests ran in 0.10 seconds

Invalidated 1 target.
18:08:54 15:59 [run]
Only executing 0 of 2 total tests in shard 6 of 20
- generated xml file: /home/travis/build/pantsbuild/pants/.pants.d/test/pytest/tests.python.pants_test.tasks.changed_target_integration/junitxml/TEST-tests.python.pants_test.tasks.changed_target_integration.xml -
no tests ran in 0.13 seconds

Invalidated 1 target.
18:08:56 16:01 [run]
Only executing 0 of 4 total tests in shard 6 of 20
- generated xml file: /home/travis/build/pantsbuild/pants/.pants.d/test/pytest/tests.python.pants_test.tasks.clean_all_integration/junitxml/TEST-tests.python.pants_test.tasks.clean_all_integration.xml -
no tests ran in 0.09 seconds

Invalidated 1 target.
18:08:58 16:03 [run]
Only executing 0 of 2 total tests in shard 6 of 20
- generated xml file: /home/travis/build/pantsbuild/pants/.pants.d/test/pytest/tests.python.pants_test.tasks.scalastyle_integration/junitxml/TEST-tests.python.pants_test.tasks.scalastyle_integration.xml -
no tests ran in 0.10 seconds

Invalidated 1 target.
18:09:00 16:05 [run]
Only executing 1 of 8 total tests in shard 6 of 20
. [100%]
- generated xml file: /home/travis/build/pantsbuild/pants/.pants.d/test/pytest/tests.python.pants_test.backend.jvm.subsystems.incomplete_custom_scala/junitxml/TEST-tests.python.pants_test.backend.jvm.subsystems.incomplete_custom_scala.xml -
1 passed in 111.28 seconds

Invalidated 1 target.
18:10:53 17:58 [run]
Only executing 1 of 18 total tests in shard 6 of 20
. [100%]
- generated xml file: /home/travis/build/pantsbuild/pants/.pants.d/test/pytest/tests.python.pants_test.backend.jvm.subsystems.jar_dependency_management_integration/junitxml/TEST-tests.python.pants_test.backend.jvm.subsystems.jar_dependency_management_integration.xml -
1 passed in 106.84 seconds

Invalidated 1 target.
18:12:42 19:47 [run]
Only executing 0 of 4 total tests in shard 6 of 20
- generated xml file: /home/travis/build/pantsbuild/pants/.pants.d/test/pytest/tests.python.pants_test.backend.jvm.subsystems.shader_integration/junitxml/TEST-tests.python.pants_test.backend.jvm.subsystems.shader_integration.xml -
no tests ran in 0.22 seconds

Invalidated 1 target.
18:12:45 19:50 [run]
Only executing 0 of 2 total tests in shard 6 of 20
- generated xml file: /home/travis/build/pantsbuild/pants/.pants.d/test/pytest/tests.python.pants_test.backend.codegen.antlr.java.integration/junitxml/TEST-tests.python.pants_test.backend.codegen.antlr.java.integration.xml -
no tests ran in 0.09 seconds

Invalidated 1 target.
18:12:47 19:52 [run]
Only executing 0 of 1 total tests in shard 6 of 20
- generated xml file: /home/travis/build/pantsbuild/pants/.pants.d/test/pytest/tests.python.pants_test.backend.graph_info.tasks.cloc_integration/junitxml/TEST-tests.python.pants_test.backend.graph_info.tasks.cloc_integration.xml -
no tests ran in 0.09 seconds

Invalidated 1 target.
18:12:49 19:54 [run]
Only executing 0 of 2 total tests in shard 6 of 20
- generated xml file: /home/travis/build/pantsbuild/pants/.pants.d/test/pytest/tests.python.pants_test.backend.graph_info.tasks.paths_integration/junitxml/TEST-tests.python.pants_test.backend.graph_info.tasks.paths_integration.xml -
no tests ran in 0.25 seconds

Invalidated 1 target.
18:12:51 19:56 [run]
Only executing 0 of 3 total tests in shard 6 of 20
- generated xml file: /home/travis/build/pantsbuild/pants/.pants.d/test/pytest/tests.python.pants_test.cache.cache_cleanup_integration/junitxml/TEST-tests.python.pants_test.cache.cache_cleanup_integration.xml -
no tests ran in 0.09 seconds

Invalidated 1 target.
18:12:53 19:58 [run]
Only executing 1 of 7 total tests in shard 6 of 20
. [100%]
- generated xml file: /home/travis/build/pantsbuild/pants/.pants.d/test/pytest/tests.python.pants_test.base.exception_sink_integration/junitxml/TEST-tests.python.pants_test.base.exception_sink_integration.xml -
1 passed in 7.55 seconds

Invalidated 1 target.
18:13:02 20:07 [run]
Only executing 1 of 7 total tests in shard 6 of 20
. [100%]
- generated xml file: /home/travis/build/pantsbuild/pants/.pants.d/test/pytest/tests.python.pants_test.base.exclude_target_regexp_integration/junitxml/TEST-tests.python.pants_test.base.exclude_target_regexp_integration.xml -
1 passed in 13.75 seconds

Invalidated 1 target.
18:13:18 20:23 [run]
Only executing 0 of 1 total tests in shard 6 of 20
- generated xml file: /home/travis/build/pantsbuild/pants/.pants.d/test/pytest/tests.python.pants_test.base.exiter_integration/junitxml/TEST-tests.python.pants_test.base.exiter_integration.xml -
no tests ran in 0.09 seconds

Invalidated 1 target.
18:13:20 20:25 [run]
Only executing 0 of 3 total tests in shard 6 of 20
- generated xml file: /home/travis/build/pantsbuild/pants/.pants.d/test/pytest/tests.python.pants_test.backend.jvm.tasks.jvm_compile.rsc.rsc_compile_integration/junitxml/TEST-tests.python.pants_test.backend.jvm.tasks.jvm_compile.rsc.rsc_compile_integration.xml -
no tests ran in 0.66 seconds

Invalidated 1 target.
18:13:23 20:28 [run]
Only executing 1 of 13 total tests in shard 6 of 20
s [100%]
- generated xml file: /home/travis/build/pantsbuild/pants/.pants.d/test/pytest/tests.python.pants_test.java.distribution.distribution_integration/junitxml/TEST-tests.python.pants_test.java.distribution.distribution_integration.xml -
============ short test summary info =============
SKIP [1] .pants.d/pyprep/sources/f3c483e09513c9e309ebce1458cc5cd088806436/pants_test/java/distribution/test_distribution_integration.py:63: Could not find java 7 and java 8 jvms to test with.
1 skipped in 1.17 seconds

Invalidated 1 target.
18:13:26 20:31 [run]
Only executing 0 of 5 total tests in shard 6 of 20
- generated xml file: /home/travis/build/pantsbuild/pants/.pants.d/test/pytest/tests.python.pants_test.backend.jvm.tasks.jvm_compile.declared_deps_integration/junitxml/TEST-tests.python.pants_test.backend.jvm.tasks.jvm_compile.declared_deps_integration.xml -
no tests ran in 0.10 seconds

Invalidated 1 target.
18:13:28 20:33 [run]
Only executing 0 of 4 total tests in shard 6 of 20
- generated xml file: /home/travis/build/pantsbuild/pants/.pants.d/test/pytest/tests.python.pants_test.backend.jvm.tasks.jvm_compile.dep_exports_integration/junitxml/TEST-tests.python.pants_test.backend.jvm.tasks.jvm_compile.dep_exports_integration.xml -
no tests ran in 0.10 seconds

Invalidated 1 target.
18:13:30 20:35 [run]
Only executing 0 of 3 total tests in shard 6 of 20
- generated xml file: /home/travis/build/pantsbuild/pants/.pants.d/test/pytest/tests.python.pants_test.backend.jvm.tasks.jvm_compile.missing_dependency_finder_integration/junitxml/TEST-tests.python.pants_test.backend.jvm.tasks.jvm_compile.missing_dependency_finder_integration.xml -
no tests ran in 0.09 seconds

Invalidated 1 target.
18:13:32 20:37 [run]
Only executing 0 of 2 total tests in shard 6 of 20
- generated xml file: /home/travis/build/pantsbuild/pants/.pants.d/test/pytest/tests.python.pants_test.java.nailgun_integration/junitxml/TEST-tests.python.pants_test.java.nailgun_integration.xml -
no tests ran in 0.09 seconds

Invalidated 1 target.
18:13:34 20:39 [run]
Only executing 1 of 10 total tests in shard 6 of 20
. [100%]
- generated xml file: /home/travis/build/pantsbuild/pants/.pants.d/test/pytest/tests.python.pants_test.backend.jvm.tasks.jvm_compile.java.cache_compile_integration/junitxml/TEST-tests.python.pants_test.backend.jvm.tasks.jvm_compile.java.cache_compile_integration.xml -
1 passed in 43.23 seconds

Invalidated 1 target.
18:14:20 21:25 [run]
Only executing 1 of 14 total tests in shard 6 of 20
. [100%]
- generated xml file: /home/travis/build/pantsbuild/pants/.pants.d/test/pytest/tests.python.pants_test.backend.jvm.tasks.jvm_compile.java.java_compile_integration/junitxml/TEST-tests.python.pants_test.backend.jvm.tasks.jvm_compile.java.java_compile_integration.xml -
1 passed in 14.54 seconds

Invalidated 1 target.
18:14:36 21:41 [run]
Only executing 0 of 4 total tests in shard 6 of 20
- generated xml file: /home/travis/build/pantsbuild/pants/.pants.d/test/pytest/tests.python.pants_test.backend.jvm.tasks.jvm_compile.java.javac_plugin_integration/junitxml/TEST-tests.python.pants_test.backend.jvm.tasks.jvm_compile.java.javac_plugin_integration.xml -
no tests ran in 0.30 seconds

Invalidated 1 target.
18:14:38 21:43 [run]
Only executing 1 of 21 total tests in shard 6 of 20
. [100%]
- generated xml file: /home/travis/build/pantsbuild/pants/.pants.d/test/pytest/tests.python.pants_test.backend.jvm.tasks.jvm_compile.java.zinc_compile_integration/junitxml/TEST-tests.python.pants_test.backend.jvm.tasks.jvm_compile.java.zinc_compile_integration.xml -
1 passed in 6.30 seconds

Invalidated 1 target.
18:14:47 21:52 [run]
Only executing 1 of 8 total tests in shard 6 of 20
. [100%]
- generated xml file: /home/travis/build/pantsbuild/pants/.pants.d/test/pytest/tests.python.pants_test.backend.jvm.tasks.jvm_compile.java.zinc_compile_jvm_platform_integration/junitxml/TEST-tests.python.pants_test.backend.jvm.tasks.jvm_compile.java.zinc_compile_jvm_platform_integration.xml -
1 passed in 16.64 seconds

Invalidated 1 target.
18:15:05 22:10 [run]
Only executing 0 of 1 total tests in shard 6 of 20
- generated xml file: /home/travis/build/pantsbuild/pants/.pants.d/test/pytest/tests.python.pants_test.backend.jvm.targets.jar_dependency_integration/junitxml/TEST-tests.python.pants_test.backend.jvm.targets.jar_dependency_integration.xml -
no tests ran in 0.09 seconds

src/python/pants/help:integration ..... SUCCESS
tests/python/pants_test/backend/codegen/antlr/java:integration ..... SUCCESS
tests/python/pants_test/backend/codegen/antlr/python:integration ..... SUCCESS
tests/python/pants_test/backend/codegen/protobuf/java:integration ..... SUCCESS
tests/python/pants_test/backend/codegen/wire/java:integration ..... SUCCESS
tests/python/pants_test/backend/docgen/tasks:markdown_to_html_integration ..... SUCCESS
tests/python/pants_test/backend/graph_info/tasks:cloc_integration ..... SUCCESS
tests/python/pants_test/backend/graph_info/tasks:paths_integration ..... SUCCESS
tests/python/pants_test/backend/jvm:integration ..... SUCCESS
tests/python/pants_test/backend/jvm/subsystems:incomplete_custom_scala ..... SUCCESS
tests/python/pants_test/backend/jvm/subsystems:jar_dependency_management_integration..... SUCCESS
tests/python/pants_test/backend/jvm/subsystems:shader_integration ..... SUCCESS
tests/python/pants_test/backend/jvm/targets:jar_dependency_integration ..... SUCCESS
tests/python/pants_test/backend/jvm/tasks:benchmark_run_integration ..... SUCCESS
tests/python/pants_test/backend/jvm/tasks:binary_create_integration ..... SUCCESS
tests/python/pants_test/backend/jvm/tasks:bootstrap_jvm_tools_integration ..... SUCCESS
tests/python/pants_test/backend/jvm/tasks:checkstyle_integration ..... SUCCESS
tests/python/pants_test/backend/jvm/tasks:classmap_integration ..... SUCCESS
tests/python/pants_test/backend/jvm/tasks:coursier_resolve_integration ..... SUCCESS
tests/python/pants_test/backend/jvm/tasks:export_classpath_integration ..... SUCCESS
tests/python/pants_test/backend/jvm/tasks:intransitive_integration ..... SUCCESS
tests/python/pants_test/backend/jvm/tasks:ivy_outdated_integration ..... SUCCESS
tests/python/pants_test/backend/jvm/tasks:ivy_resolve_integration ..... SUCCESS
tests/python/pants_test/backend/jvm/tasks:jar_publish_integration ..... SUCCESS
tests/python/pants_test/backend/jvm/tasks:junit_run_integration ..... SUCCESS
tests/python/pants_test/backend/jvm/tasks:junit_tests_concurrency_integration ..... SUCCESS
tests/python/pants_test/backend/jvm/tasks:junit_tests_integration ..... SUCCESS
tests/python/pants_test/backend/jvm/tasks:jvm_bundle_integration ..... SUCCESS
tests/python/pants_test/backend/jvm/tasks:jvm_dependency_usage_integration ..... SUCCESS
tests/python/pants_test/backend/jvm/tasks:jvm_platform_analysis_integration ..... SUCCESS
tests/python/pants_test/backend/jvm/tasks:jvm_prep_command_integration ..... SUCCESS
tests/python/pants_test/backend/jvm/tasks:jvm_run_integration ..... SUCCESS
tests/python/pants_test/backend/jvm/tasks:scala_repl_integration ..... SUCCESS
tests/python/pants_test/backend/jvm/tasks:scalafix ..... SUCCESS
tests/python/pants_test/backend/jvm/tasks:scope_provided_integration ..... SUCCESS
tests/python/pants_test/backend/jvm/tasks:scope_runtime_integration ..... SUCCESS
tests/python/pants_test/backend/jvm/tasks:scope_test_integration ..... SUCCESS
tests/python/pants_test/backend/jvm/tasks/jvm_compile:declared_deps_integration ..... SUCCESS
tests/python/pants_test/backend/jvm/tasks/jvm_compile:dep_exports_integration ..... SUCCESS
tests/python/pants_test/backend/jvm/tasks/jvm_compile:missing_dependency_finder_integration..... SUCCESS
tests/python/pants_test/backend/jvm/tasks/jvm_compile/java:cache_compile_integration..... SUCCESS
tests/python/pants_test/backend/jvm/tasks/jvm_compile/java:java_compile_integration..... SUCCESS
tests/python/pants_test/backend/jvm/tasks/jvm_compile/java:javac_plugin_integration..... SUCCESS
tests/python/pants_test/backend/jvm/tasks/jvm_compile/java:zinc_compile_integration..... SUCCESS
tests/python/pants_test/backend/jvm/tasks/jvm_compile/java:zinc_compile_jvm_platform_integration..... SUCCESS
tests/python/pants_test/backend/jvm/tasks/jvm_compile/javac:javac_compile_integration..... SUCCESS
tests/python/pants_test/backend/jvm/tasks/jvm_compile/rsc:rsc_compile_integration..... SUCCESS
tests/python/pants_test/backend/jvm/tasks/jvm_compile/scala:scalac_plugin_integration..... SUCCESS
tests/python/pants_test/backend/jvm/tasks/jvm_compile/zinc:zinc_compile_integration..... SUCCESS
tests/python/pants_test/backend/jvm/tasks/jvm_compile/zinc:zinc_compile_integration_with_zjars..... SUCCESS
tests/python/pants_test/backend/project_info/tasks:export_integration ..... SUCCESS
tests/python/pants_test/backend/project_info/tasks:idea_plugin_integration ..... SUCCESS
tests/python/pants_test/backend/python:integration ..... SUCCESS
tests/python/pants_test/backend/python/tasks:build_local_python_distributions_integration..... SUCCESS
tests/python/pants_test/backend/python/tasks:interpreter_selection_integration ..... SUCCESS
tests/python/pants_test/backend/python/tasks:isort_run_integration ..... SUCCESS
tests/python/pants_test/backend/python/tasks:pytest_run_integration ..... SUCCESS
tests/python/pants_test/backend/python/tasks:python_binary_integration ..... SUCCESS
tests/python/pants_test/backend/python/tasks:python_repl_integration ..... SUCCESS
tests/python/pants_test/backend/python/tasks:python_run_integration ..... SUCCESS
tests/python/pants_test/backend/python/tasks:setup_py_integration ..... SUCCESS
tests/python/pants_test/backend/python/tasks/native:integration ..... SUCCESS
tests/python/pants_test/base:exception_sink_integration ..... SUCCESS
tests/python/pants_test/base:exclude_target_regexp_integration ..... SUCCESS
tests/python/pants_test/base:exiter_integration ..... SUCCESS
tests/python/pants_test/bin:integration ..... SUCCESS
tests/python/pants_test/binaries:integration ..... SUCCESS
tests/python/pants_test/build_graph:build_graph_integration ..... SUCCESS
tests/python/pants_test/build_graph:intermediate_target_integration ..... SUCCESS
tests/python/pants_test/build_graph:subproject_integration ..... SUCCESS
tests/python/pants_test/cache:cache_cleanup_integration ..... SUCCESS
tests/python/pants_test/core_tasks:deferred_sources_mapper_integration ..... SUCCESS
tests/python/pants_test/core_tasks:prep_command_integration ..... SUCCESS
tests/python/pants_test/core_tasks:substitute_target_aliases_integration ..... SUCCESS
tests/python/pants_test/engine:scheduler_integration ..... SUCCESS
tests/python/pants_test/engine/legacy:build_ignore_integration ..... SUCCESS
tests/python/pants_test/engine/legacy:bundle_integration ..... SUCCESS
tests/python/pants_test/engine/legacy:changed_integration ..... SUCCESS
tests/python/pants_test/engine/legacy:console_rule_integration ..... SUCCESS
tests/python/pants_test/engine/legacy:dependees_integration ..... SUCCESS
tests/python/pants_test/engine/legacy:dependencies_integration ..... SUCCESS
tests/python/pants_test/engine/legacy:filedeps_integration ..... SUCCESS
tests/python/pants_test/engine/legacy:filemap_integration ..... SUCCESS
tests/python/pants_test/engine/legacy:graph_integration ..... SUCCESS
tests/python/pants_test/engine/legacy:list_integration ..... SUCCESS
tests/python/pants_test/engine/legacy:owners_integration ..... SUCCESS
tests/python/pants_test/goal:run_tracker_integration ..... SUCCESS
tests/python/pants_test/help:help_integration ..... SUCCESS
tests/python/pants_test/invalidation:strict_deps_invalidation_integration ..... SUCCESS
tests/python/pants_test/java:nailgun_integration ..... SUCCESS
tests/python/pants_test/java/distribution:distribution_integration ..... SUCCESS
tests/python/pants_test/logging:test_native_engine_logging ..... SUCCESS
tests/python/pants_test/logging:test_workunit_label ..... SUCCESS
tests/python/pants_test/option:options_integration ..... SUCCESS
tests/python/pants_test/pantsd:pantsd_integration ..... SUCCESS
tests/python/pants_test/projects:testprojects_integration ..... FAILURE
tests/python/pants_test/releases ..... SUCCESS
tests/python/pants_test/reporting:reporting_integration ..... SUCCESS
tests/python/pants_test/rules:integration ..... SUCCESS
tests/python/pants_test/targets:jvm_app_integration ..... SUCCESS
tests/python/pants_test/targets:scala_library_integration ..... SUCCESS
tests/python/pants_test/targets:unknown_arguments_integration ..... SUCCESS
tests/python/pants_test/task:goal_options_mixin_integration ..... SUCCESS
tests/python/pants_test/tasks:bootstrap_jvm_tools_integration ..... SUCCESS
tests/python/pants_test/tasks:changed_target_integration ..... SUCCESS
tests/python/pants_test/tasks:clean_all_integration ..... SUCCESS
tests/python/pants_test/tasks:scalastyle_integration ..... SUCCESS
FAILURE: FAILURE

Waiting for background workers to finish.
18:15:08 22:13 [complete]
FAILURE
Pants Integration test failure
travis_time:end:08533e10:start=1561571569594552828,finish=1561572908717379323,duration=1339122826495
The command "./build-support/bin/ci.sh -c -i 6/20" exited with 1.
travis_fold:start:before_cache.1
travis_time:start:0121b968
$ sudo chown -R travis:travis "${HOME}" "${TRAVIS_BUILD_DIR}"
travis_time:end:0121b968:start=1561572908722980079,finish=1561572913705045314,duration=4982065235
travis_fold:end:before_cache.1
travis_fold:start:before_cache.2
travis_time:start:09c78414
$ find ${HOME}/.ivy2/pants -type f -name "ivydata-*.properties" -delete
travis_time:end:09c78414:start=1561572913711048234,finish=1561572913731353131,duration=20304897
travis_fold:end:before_cache.2
travis_fold:start:before_cache.3
travis_time:start:2c2a80a6
$ rm -f ${HOME}/.ivy2/pants/*.{css,properties,xml,xsl}
travis_time:end:2c2a80a6:start=1561572913736622143,finish=1561572913745966907,duration=9344764
travis_fold:end:before_cache.3
travis_fold:start:before_cache.4
travis_time:start:0729ce70
$ rm -rf ${HOME}/.ivy2/pants/com.example
travis_time:end:0729ce70:start=1561572913751460285,finish=1561572913755939171,duration=4478886
travis_fold:end:before_cache.4
travis_fold:start:before_cache.5
travis_time:start:15bab406
$ du -m -d2 ${HOME}/.cache/pants | sort -r -n
2068 /home/travis/.cache/pants
1116 /home/travis/.cache/pants/bin
934 /home/travis/.cache/pants/bin/gcc
377 /home/travis/.cache/pants/lmdb_store
373 /home/travis/.cache/pants/lmdb_store/files
194 /home/travis/.cache/pants/artifact_cache
178 /home/travis/.cache/pants/python_cache/requirements
178 /home/travis/.cache/pants/python_cache
131 /home/travis/.cache/pants/bin/binutils
116 /home/travis/.cache/pants/python/CPython-3.6.7
116 /home/travis/.cache/pants/python
108 /home/travis/.cache/pants/artifact_cache/1388c9ccf34e0c6d2cd51df88d8880c439e15440
87 /home/travis/.cache/pants/artifact_cache/57a7f2e04485368292a0fe4d43852de958ab0505
62 /home/travis/.cache/pants/coursier/https
62 /home/travis/.cache/pants/coursier
34 /home/travis/.cache/pants/bin/watchman
28 /home/travis/.cache/pants/tools/jvm
28 /home/travis/.cache/pants/tools
18 /home/travis/.cache/pants/bin/protoc
4 /home/travis/.cache/pants/lmdb_store/directories
2 /home/travis/.cache/pants/zinc/compiler-bridge
2 /home/travis/.cache/pants/zinc
1 /home/travis/.cache/pants/python_cache/interpreters
travis_time:end:15bab406:start=1561572913761253371,finish=1561572913781483244,duration=20229873
travis_fold:end:before_cache.5
travis_fold:start:cache.2
store build cache
travis_time:start:09cb1b58
travis_time:end:09cb1b58:start=1561572913787050627,finish=1561572913790840231,duration=3789604
travis_time:start:0f0aa5aa
changes detected (content changed, file is created, or file is deleted):\n/home/travis/.cache/pants/zinc/compiler-bridge/0801a14c9c52/scala-compiler-bridge.jar
/home/travis/.cache/pants/zinc/compiler-bridge/158f8600af3c/scala-compiler-bridge.jar
/home/travis/.cache/pants/zinc/compiler-bridge/b3f8f2b845aa/scala-compiler-bridge.jar
/home/travis/.cache/pants/zinc/compiler-bridge/caad17045450/scala-compiler-bridge.jar
/home/travis/.ivy2/pants/com.eed3si9n/gigahorse-core_2.11/ivy-0.3.0.xml
/home/travis/.ivy2/pants/com.eed3si9n/gigahorse-core_2.11/ivy-0.3.0.xml.original
/home/travis/.ivy2/pants/com.eed3si9n/gigahorse-core_2.11/jars/gigahorse-core_2.11-0.3.0.jar
/home/travis/.ivy2/pants/com.eed3si9n/gigahorse-okhttp_2.11/ivy-0.3.0.xml
/home/travis/.ivy2/pants/com.eed3si9n/gigahorse-okhttp_2.11/ivy-0.3.0.xml.original
/home/travis/.ivy2/pants/com.eed3si9n/gigahorse-okhttp_2.11/jars/gigahorse-okhttp_2.11-0.3.0.jar
/home/travis/.ivy2/pants/com.eed3si9n/shaded-scalajson_2.11/ivy-1.0.0-M4.xml
/home/travis/.ivy2/pants/com.eed3si9n/shaded-scalajson_2.11/ivy-1.0.0-M4.xml.or\n...
changes detected, packing new archive
uploading 1.17.x/cache-linux-xenial-4bd8e020abc568499c882b86c76bf2cd2d6d6b85a1d692a127f7cd72190c5a5c--python-2.7.tgz
cache uploaded
travis_time:end:0f0aa5aa:start=1561572913795522972,finish=1561572933498722856,duration=19703199884
travis_fold:end:cache.2

travis_fold:start:after_failure
travis_time:start:0942275a
$ ./build-support/bin/ci-failure.sh
travis_time:end:0942275a:start=1561572933504215899,finish=1561572933510425560,duration=6209661
travis_fold:end:after_failure

Done. Your build exited with 1.
Sign up for free to join this conversation on GitHub. Already have an account? Sign in to comment
You can’t perform that action at this time.