public
Created

  • Download Gist
gistfile1.txt
1 2 3 4 5 6 7 8 9 10 11 12 13 14 15 16 17 18 19 20 21 22 23 24 25 26 27 28 29 30 31 32 33 34 35 36 37 38 39 40 41 42 43 44 45 46 47 48 49 50 51 52 53 54 55 56 57 58 59 60
make
gcc -c -I. -Iproto -DHAVE_CONFIG_H -DMACOS_X_UNIX -no-cpp-precomp -g -O2 -D_FORTIFY_SOURCE=1 -o objects/os_macosx.o os_macosx.m
In file included from /System/Library/Frameworks/AppKit.framework/Headers/AppKit.h:148,
from /System/Library/Frameworks/Cocoa.framework/Headers/Cocoa.h:13,
from os_macosx.m:24:
/System/Library/Frameworks/AppKit.framework/Headers/NSOpenGL.h:9:27: error: OpenGL/gltypes.h: No such file or directory
In file included from /System/Library/Frameworks/AppKit.framework/Headers/AppKit.h:148,
from /System/Library/Frameworks/Cocoa.framework/Headers/Cocoa.h:13,
from os_macosx.m:24:
/System/Library/Frameworks/AppKit.framework/Headers/NSOpenGL.h:33: error: expected declaration specifiers or ‘...’ before ‘GLint’
/System/Library/Frameworks/AppKit.framework/Headers/NSOpenGL.h:34: error: expected declaration specifiers or ‘...’ before ‘GLint’
/System/Library/Frameworks/AppKit.framework/Headers/NSOpenGL.h:39: error: expected ‘)’ before ‘*’ token
/System/Library/Frameworks/AppKit.framework/Headers/NSOpenGL.h:130: error: expected ‘)’ before ‘GLint’
/System/Library/Frameworks/AppKit.framework/Headers/NSOpenGL.h:130: error: expected ‘)’ before ‘GLint’
/System/Library/Frameworks/AppKit.framework/Headers/NSOpenGL.h:131: error: expected ‘)’ before ‘GLint’
/System/Library/Frameworks/AppKit.framework/Headers/NSOpenGL.h:159: error: expected ‘)’ before ‘GLenum’
/System/Library/Frameworks/AppKit.framework/Headers/NSOpenGL.h:159: error: expected ‘)’ before ‘GLenum’
/System/Library/Frameworks/AppKit.framework/Headers/NSOpenGL.h:159: error: expected ‘)’ before ‘GLint’
/System/Library/Frameworks/AppKit.framework/Headers/NSOpenGL.h:159: error: expected ‘)’ before ‘GLsizei’
/System/Library/Frameworks/AppKit.framework/Headers/NSOpenGL.h:159: error: expected ‘)’ before ‘GLsizei’
/System/Library/Frameworks/AppKit.framework/Headers/NSOpenGL.h:162: error: expected ‘)’ before ‘GLsizei’
/System/Library/Frameworks/AppKit.framework/Headers/NSOpenGL.h:163: error: expected ‘)’ before ‘GLsizei’
/System/Library/Frameworks/AppKit.framework/Headers/NSOpenGL.h:164: error: expected ‘)’ before ‘GLenum’
/System/Library/Frameworks/AppKit.framework/Headers/NSOpenGL.h:165: error: expected ‘)’ before ‘GLenum’
/System/Library/Frameworks/AppKit.framework/Headers/NSOpenGL.h:166: error: expected ‘)’ before ‘GLint’
/System/Library/Frameworks/AppKit.framework/Headers/NSOpenGL.h:219: error: expected ‘)’ before ‘GLsizei’
/System/Library/Frameworks/AppKit.framework/Headers/NSOpenGL.h:219: error: expected ‘)’ before ‘GLsizei’
/System/Library/Frameworks/AppKit.framework/Headers/NSOpenGL.h:219: error: expected ‘)’ before ‘GLint’
/System/Library/Frameworks/AppKit.framework/Headers/NSOpenGL.h:233: error: expected ‘)’ before ‘GLbitfield’
/System/Library/Frameworks/AppKit.framework/Headers/NSOpenGL.h:236: error: expected ‘)’ before ‘GLint’
/System/Library/Frameworks/AppKit.framework/Headers/NSOpenGL.h:237: error: expected ‘)’ before ‘GLint’
/System/Library/Frameworks/AppKit.framework/Headers/NSOpenGL.h:241: error: expected ‘)’ before ‘GLint’
/System/Library/Frameworks/AppKit.framework/Headers/NSOpenGL.h:242: error: expected ‘)’ before ‘GLint’
/System/Library/Frameworks/AppKit.framework/Headers/NSOpenGL.h:245: error: expected ‘)’ before ‘GLenum’
/System/Library/Frameworks/AppKit.framework/Headers/NSOpenGL.h:245: error: expected ‘)’ before ‘GLenum’
/System/Library/Frameworks/AppKit.framework/Headers/NSOpenGL.h:261: error: expected ‘)’ before ‘GLenum’
/System/Library/Frameworks/AppKit.framework/Headers/NSOpenGL.h:261: error: expected ‘)’ before ‘GLint’
/System/Library/Frameworks/AppKit.framework/Headers/NSOpenGL.h:261: error: expected ‘)’ before ‘GLint’
/System/Library/Frameworks/AppKit.framework/Headers/NSOpenGL.h:263: error: expected ‘)’ before ‘GLenum’
/System/Library/Frameworks/AppKit.framework/Headers/NSOpenGL.h:264: error: expected ‘)’ before ‘GLint’
/System/Library/Frameworks/AppKit.framework/Headers/NSOpenGL.h:273: error: expected ‘)’ before ‘GLenum’
In file included from /System/Library/Frameworks/AppKit.framework/Headers/NSOpenGLLayer.h:10,
from /System/Library/Frameworks/AppKit.framework/Headers/AppKit.h:149,
from /System/Library/Frameworks/Cocoa.framework/Headers/Cocoa.h:13,
from os_macosx.m:24:
/System/Library/Frameworks/QuartzCore.framework/Headers/CAOpenGLLayer.h:8:26: error: OpenGL/OpenGL.h: No such file or directory
In file included from /System/Library/Frameworks/AppKit.framework/Headers/NSOpenGLLayer.h:10,
from /System/Library/Frameworks/AppKit.framework/Headers/AppKit.h:149,
from /System/Library/Frameworks/Cocoa.framework/Headers/Cocoa.h:13,
from os_macosx.m:24:
/System/Library/Frameworks/QuartzCore.framework/Headers/CAOpenGLLayer.h:28: error: expected ‘)’ before ‘CGLContextObj’
/System/Library/Frameworks/QuartzCore.framework/Headers/CAOpenGLLayer.h:29: error: expected ‘)’ before ‘CGLPixelFormatObj’
/System/Library/Frameworks/QuartzCore.framework/Headers/CAOpenGLLayer.h:39: error: expected ‘)’ before ‘CGLContextObj’
/System/Library/Frameworks/QuartzCore.framework/Headers/CAOpenGLLayer.h:39: error: expected ‘)’ before ‘CGLPixelFormatObj’
/System/Library/Frameworks/QuartzCore.framework/Headers/CAOpenGLLayer.h:49: error: expected ‘)’ before ‘CGLPixelFormatObj’
/System/Library/Frameworks/QuartzCore.framework/Headers/CAOpenGLLayer.h:55: error: expected ‘)’ before ‘CGLPixelFormatObj’
/System/Library/Frameworks/QuartzCore.framework/Headers/CAOpenGLLayer.h:62: error: expected ‘)’ before ‘CGLContextObj’
/System/Library/Frameworks/QuartzCore.framework/Headers/CAOpenGLLayer.h:62: error: expected ‘)’ before ‘CGLPixelFormatObj’
/System/Library/Frameworks/QuartzCore.framework/Headers/CAOpenGLLayer.h:67: error: expected ‘)’ before ‘CGLContextObj’
make: *** [objects/os_macosx.o] Error 1

Please sign in to comment on this gist.

Something went wrong with that request. Please try again.