View helper.py
1 2 3 4 5 6 7 8 9
import re
 
def oimaptransfolder_qmx(foldername):
if(foldername == "INBOX"):
retval = "qmx"
else:
retval = "qmx." + re.sub('^INBOX\.', '', foldername)
retval = re.sub("/", ".", retval)
return retval
View .gitignore
1 2 3 4 5 6 7
specs.4.8
prerelease_specs.4.8
versions.list
names.list
specs
deps
gems
View grab_authors
1 2 3 4 5 6 7 8 9
#!/bin/sh
 
ITEMS=$(find . | grep implementors | grep ref | cut -f 4,5 -d/)
 
for i in $ITEMS; do
echo $i:
cat ./src/libsodium/$i/ref/implementors
echo
done
View dynjs-linker.log
1 2 3 4 5 6 7 8 9 10
JavascriptObjectLinkStrategy: >>>> START REQUEST
JavascriptObjectLinkStrategy: Attempt: GET_PROPERTY:null
JavascriptObjectLinkStrategy: [GET_PROPERTY] receiver=[Reference: name=obj; base=[ObjectEnvironmentRecord: object=org.dynjs.runtime.GlobalObject@67bba966] (org.dynjs.runtime.ObjectEnvironmentRecord)]; propName=obj
JavascriptObjectLinkStrategy: <<< END REQUEST: true
JavascriptObjectLinkStrategy: >>>> START REQUEST
JavascriptObjectLinkStrategy: Attempt: GET_PROPERTY:null
JavascriptObjectLinkStrategy: [GET_PROPERTY] receiver=[Reference: name=dynjs; base=[JavaPackage: org] (org.dynjs.runtime.java.JavaPackage)]; propName=dynjs
JavascriptObjectLinkStrategy: <<< END REQUEST: true
JavascriptObjectLinkStrategy: >>>> START REQUEST
JavascriptObjectLinkStrategy: Attempt: GET_PROPERTY:null
View configure.loooog
1 2 3 4 5 6 7 8 9 10
checking build system type... x86_64-apple-darwin12.2.0
checking host system type... x86_64-apple-darwin12.2.0
checking for a BSD-compatible install... /usr/bin/install -c
checking whether build environment is sane... yes
checking for a thread-safe mkdir -p... libltdl/config/install-sh -c -d
checking for gawk... no
checking for mawk... no
checking for nawk... no
checking for awk... awk
checking whether make sets $(MAKE)... yes
View org.dynjs.runtime.InvokeDynamicTest.txt
1 2 3 4 5 6 7 8 9 10
-------------------------------------------------------------------------------
Test set: org.dynjs.runtime.InvokeDynamicTest
-------------------------------------------------------------------------------
Tests run: 11, Failures: 0, Errors: 2, Skipped: 0, Time elapsed: 0.201 sec <<< FAILURE!
testSystemClass_becauseLanceBreaksStuff(org.dynjs.runtime.InvokeDynamicTest) Time elapsed: 0.035 sec <<< ERROR!
java.lang.NoSuchMethodError: fusion:getProperty|getMethod: [[Reference: name=out; base=class java.lang.System (java.lang.Class)], org.dynjs.runtime.ExecutionContext@229fb9a2, out]
at org.projectodd.linkfusion.FusionLinker.linkInvocation(FusionLinker.java:55)
at org.dynjs.gen.ProgramBody2.call(Unknown Source)
at org.dynjs.runtime.wrapper.JavascriptProgram.execute(JavascriptProgram.java:37)
at org.dynjs.runtime.ExecutionContext.eval(ExecutionContext.java:148)
View org.dynjs.runtime.InvokeDynamicTest.txt
1 2 3 4 5 6 7 8 9 10
-------------------------------------------------------------------------------
Test set: org.dynjs.runtime.InvokeDynamicTest
-------------------------------------------------------------------------------
Tests run: 11, Failures: 0, Errors: 2, Skipped: 0, Time elapsed: 0.132 sec <<< FAILURE!
testSystemClass_becauseLanceBreaksStuff(org.dynjs.runtime.InvokeDynamicTest) Time elapsed: 0.029 sec <<< ERROR!
org.dynjs.exception.ThrowException: java.lang.NoSuchMethodError: fusion:getProperty|getMethod
at <global>.<eval>(<eval>:1)
at <global>.<eval>(Unknown Source)
at org.dynjs.runtime.interp.InvokeDynamicInterpretingVisitor.getValue(InvokeDynamicInterpretingVisitor.java:133)
at org.dynjs.runtime.interp.BasicInterpretingVisitor.visit(BasicInterpretingVisitor.java:436)
View AsyncPagedResult.java
1 2 3 4 5 6 7 8 9 10
public interface AsyncPagedResult<T> {
 
void next(Callback<List<T>> callback);
 
void prev(Callback<List<T>> callback);
 
void page(int offset, int limit, Callback<List<T>> callback);
public static interface Callback<U> {
public void onResult(U result);
View gist:4410049
1 2 3 4 5
/V/v/g/j/spec git:master ❯❯❯ pwd
/Volumes/v2/git/jruby/spec
/V/v/g/j/spec git:master ❯❯❯ ../bin/jruby mspec/bin/mspec -B jruby.1.9.mspec ruby/core
jruby 1.7.2.dev (1.9.3p327) 2012-12-29 2846144 on OpenJDK 64-Bit Server VM 1.8.0-internal-qmx_2012_12_29_09_08-b00 +indy [darwin-x86_64]
.F........................................................................E.........................F......................FE..E........E..........F..................F.F.F.............................F........................F..................F.........EE...E...F.....F....E.........
View apt-init.pp
1 2 3 4 5
class apt-get::update {
exec { "apt-get update":
command => "apt-get update"
}
}
Something went wrong with that request. Please try again.