Skip to content

Instantly share code, notes, and snippets.

Avatar
☠️
game over

silent27 silent27121984

☠️
game over
View GitHub Profile
View RR-redmi4x-logcat
This file has been truncated, but you can view the full file.
* daemon not running. starting it now on port 5037 *
* daemon started successfully *
--------- beginning of main
01-05 15:00:28.450 387 387 W auditd : type=2000 audit(0.0:1): initialized
--------- beginning of system
01-05 15:00:32.893 393 393 I vold : Vold 3.0 (the awakening) firing up
View RR-redmi4x-dmesg
[ 0.000000] Initializing cgroup subsys cpuset
[ 0.000000] Initializing cgroup subsys cpu
[ 0.000000] Initializing cgroup subsys cpuacct
[ 0.000000] Linux version 3.18.24-g049d49c (builder@c3-miui-ota-bd52.bj) (gcc version 4.9.x-google 20140827 (prerelease) (GCC) ) #1 SMP PREEMPT Thu Mar 30 12:46:25 CST 2017
[ 0.000000] CPU: AArch64 Processor [410fd034] revision 4
View mk-redmi4x
CC lib/lcm.o
unrecognized ELF data encoding 0: drivers/staging/prima/CORE/SVC/src/logging/wlan_logging_sock_svc.o
/home/silent27/MK/kernel/xiaomi/msm8937/scripts/Makefile.build:257: ошибка выполнения рецепта для цели «drivers/staging/prima/CORE/SVC/src/logging/wlan_logging_sock_svc.o»
make[4]: *** [drivers/staging/prima/CORE/SVC/src/logging/wlan_logging_sock_svc.o] Ошибка 1
/home/silent27/MK/kernel/xiaomi/msm8937/scripts/Makefile.build:402: ошибка выполнения рецепта для цели «drivers/staging/prima»
make[3]: *** [drivers/staging/prima] Ошибка 2
/home/silent27/MK/kernel/xiaomi/msm8937/scripts/Makefile.build:402: ошибка выполнения рецепта для цели «drivers/staging»
make[2]: *** [drivers/staging] Ошибка 2
/home/silent27/MK/kernel/xiaomi/msm8937/Makefile:946: ошибка выполнения рецепта для цели «drivers»
make[1]: *** [drivers] Ошибка 2
View O
[ 9% 7308/73843] Building bootanimation
FAILED: /home/silent27/MK8/out/target/product/santoni/obj/BOOTANIMATION/bootanimation.zip
/bin/bash -c "sh vendor/mk/bootanimation/generate-bootanimation.sh 720 1280"
vendor/mk/bootanimation/generate-bootanimation.sh: 51: [: Linux: unexpected operator
/home/silent27/MK8/vendor/mk/prebuilt/host/darwin-x86/ziptime: 1: /home/silent27/MK8/vendor/mk/prebuilt/host/darwin-x86/ziptime: �����x�!H__PAGEZERO�__TEXT: not found
/home/silent27/MK8/vendor/mk/prebuilt/host/darwin-x86/ziptime: 7: /home/silent27/MK8/vendor/mk/prebuilt/host/darwin-x86/ziptime: �F
�: not found
/home/silent27/MK8/vendor/mk/prebuilt/host/darwin-x86/ziptime: 27: /home/silent27/MK8/vendor/mk/prebuilt/host/darwin-x86/ziptime: Syntax error: ")" unexpected
[ 9% 7311/73843] Building Kernel
FAILED: TARGET_KERNEL_BINARIES
View LineageOS-15
[ 2% 94/3369] target SharedLib: andro...D/android.hardware.health@1.0-impl.so)
FAILED: /home/silent27-4pda/8/out/target/product/santoni/obj/SHARED_LIBRARIES/android.hardware.health@1.0-impl_intermediates/LINKED/android.hardware.health@1.0-impl.so
/bin/bash -c "/usr/bin/ccache prebuilts/clang/host/linux-x86/clang-3859424/bin/clang++ -nostdlib -Wl,-soname,android.hardware.health@1.0-impl.so -Wl,--gc-sections -shared /home/silent27-4pda/8/out/target/product/santoni/obj/lib/crtbegin_so.o /home/silent27-4pda/8/out/target/product/santoni/obj/SHARED_LIBRARIES/android.hardware.health@1.0-impl_intermediates/Health.o -Wl,--whole-archive -Wl,--no-whole-archive /home/silent27-4pda/8/out/target/product/santoni/obj/STATIC_LIBRARIES/android.hardware.health@1.0-convert_intermediates/android.hardware.health@1.0-convert.a /home/silent27-4pda/8/out/target/product/santoni/obj/STATIC_LIBRARIES/libhealthd.lineage_intermediates/libhealthd.lineage.a /home/silent27-4pda/8/out/target/product/santoni/obj/STATIC_LIBRARIES/libcomp
View PE_Treble
[ 99% 87953/87954] build /home/silent2...antoni/aosp_santoni-ota-9de86ed947.zip
FAILED: /home/silent27-4pda/pe/out/target/product/santoni/aosp_santoni-ota-9de86ed947.zip
/bin/bash -c "(echo \"Package OTA: /home/silent27-4pda/pe/out/target/product/santoni/aosp_santoni-ota-9de86ed947.zip\" ) && (PATH=/home/silent27-4pda/pe/out/host/linux-x86/bin/:\$PATH MKBOOTIMG=/home/silent27-4pda/pe/out/host/linux-x86/bin/mkbootimg ./build/tools/releasetools/ota_from_target_files -v --block --extracted_input_target_files /home/silent27-4pda/pe/out/target/product/santoni/obj/PACKAGING/target_files_intermediates/aosp_santoni-target_files-9de86ed947 -p /home/silent27-4pda/pe/out/host/linux-x86 -k build/target/product/security/testkey --backup=true /home/silent27-4pda/pe/out/target/product/santoni/obj/PACKAGING/target_files_intermediates/aosp_santoni-target_files-9de86ed947.zip /home/silent27-4pda/pe/out/target/product/santoni/aosp_santoni-ota-9de86ed947.zip )"
Package OTA: /home/silent27-4pda/p
View pix
[ 7% 6019/75834] bc: libclcore.bc_32 ...frameworks/rs/driver/runtime/rs_core.c
FAILED: /home/silent27-4pda/pix/out/target/product/santoni/obj_arm/RENDERSCRIPT_BITCODE/libclcore.bc_intermediates/rs_core.bc
/bin/bash -c "PWD=/proc/self/cwd prebuilts/clang/host/linux-x86/clang-3289846/bin/clang -Iframeworks/rs/script_api/include -Iexternal/clang/lib/Headers -MD -DRS_VERSION=24 -std=c99 -c -O3 -fno-builtin -emit-llvm -target renderscript32-linux-androideabi -fsigned-char -Wno-deprecated -Werror -Werror -Wall -Wextra -Iframeworks/rs/cpu_ref -DRS_DECLARE_EXPIRED_APIS -x renderscript frameworks/rs/driver/runtime/rs_core.c -o /home/silent27-4pda/pix/out/target/product/santoni/obj_arm/RENDERSCRIPT_BITCODE/libclcore.bc_intermediates/rs_core.bc"
prebuilts/clang/host/linux-x86/clang-3289846/bin/clang.real: error while loading shared libraries: libncurses.so.5: cannot open shared object file: No such file or directory
[ 7% 6020/75834] bc: libclcore.bc_32 ...meworks/rs/driver/runtime/rs_element.c
FAILED: /home/silent
View nos
[ 99% 93559/93792] target dex2oat: /home/silent27-...santoni/dex_bootjars/system/framework/arm/boot.art
FAILED: /home/silent27-4pda/n/out/target/product/santoni/dex_bootjars/system/framework/arm/boot.art
/bin/bash -c "(mkdir -p /home/silent27-4pda/n/out/target/product/santoni/symbols/system/framework/arm/ ) && (rm -f /home/silent27-4pda/n/out/target/product/santoni/dex_bootjars/system/framework/arm//*.art /home/silent27-4pda/n/out/target/product/santoni/dex_bootjars/system/framework/arm//*.oat /home/silent27-4pda/n/out/target/product/santoni/dex_bootjars/system/framework/arm//*.art.rel ) && (rm -f /home/silent27-4pda/n/out/target/product/santoni/symbols/system/framework/arm//*.art ) && (rm -f /home/silent27-4pda/n/out/target/product/santoni/symbols/system/framework/arm//*.oat ) && (rm -f /home/silent27-4pda/n/out/target/product/santoni/symbols/system/framework/arm//*.art.rel ) && (ANDROID_LOG_TAGS=\"*:e\" /home/silent27-4pda/n/out/host/linux-x86/bin/dex2oatd --runtime-arg -Xms64m --runtime-arg -Xmx64m --co
View maru
1 warning generated.
[ 74% 71944/96087] //hardware/interfaces/cas/native/1.0:android.hardware.cas.native...rdware.cas.native@1.0_genc++/gen/android/hardware/cas/native/1.0/DescramblerAll.cpp
FAILED: /home/silent27-4pda/mt/out/soong/.intermediates/hardware/interfaces/cas/native/1.0/android.hardware.cas.native@1.0/android_arm64_armv8-a_cortex-a53_static_core/obj/android/hardware/cas/native/1.0/DescramblerAll.o
PWD=/proc/self/cwd /usr/bin/ccache prebuilts/clang/host/linux-x86/clang-4053586/bin/clang++ -c -Ihardware/interfaces/cas/native/1.0 -fno-exceptions -Wno-multichar -fno-strict-aliasing -fstack-protector-strong -ffunction-sections -fdata-sections -funwind-tables -Wa,--noexecstack -Werror=format-security -D_FORTIFY_SOURCE=2 -fno-short-enums -no-canonical-prefixes -Werror=pointer-to-int-cast -Werror=int-to-pointer-cast -Werror=implicit-function-declaration -DNDEBUG -O2 -g -Wstrict-aliasing=2 -DANDROID -fmessage-length=0 -W -Wall -Wno-unused -Winit-self -Wpointer-arith -DNDEBUG -UDEBUG -fdebug-prefix-map=/pr
View m
* daemon not running. starting it now on port 5037 *
* daemon started successfully *
--------- beginning of system
05-15 00:18:43.341 472 472 I vold : Vold 3.0 (the awakening) firing up
05-15 00:18:43.342 472 472 V vold : Detected support for: exfat ext4 f2fs ntfs vfat
05-15 00:18:43.354 472 485 D vold : e4crypt_init_user0
05-15 00:18:43.355 472 485 D vold : e4crypt_prepare_user_storage for volume null, user 0, serial 0, flags 1
05-15 00:18:43.355 472 485 D vold : Preparing: /data/system/users/0
05-15 00:18:43.355 472 485 D vold : Preparing: /data/misc/profiles/cur/0
05-15 00:18:43.356 472 485 D vold : Preparing: /data/system_de/0