public
Created

openmpi-1.6.0 make V=1 check - OSX Lion 10.7.4 using clang-3.1 and gfortran showing test failures

  • Download Gist
make.check.out
1 2 3 4 5 6 7 8 9 10 11 12 13 14 15 16 17 18 19 20 21 22 23 24 25 26 27 28 29 30 31 32 33 34 35 36 37 38 39 40 41 42 43 44 45 46 47 48 49 50 51 52 53 54 55 56 57 58 59 60 61 62 63 64 65 66 67 68 69 70 71 72 73 74 75 76 77 78 79 80 81 82 83 84 85 86 87 88 89 90 91 92 93 94 95 96 97 98 99 100 101 102 103 104 105 106 107 108 109 110 111 112 113 114 115 116 117 118 119 120 121 122 123 124 125 126 127 128 129 130 131 132 133 134 135 136 137 138 139 140 141 142 143 144 145 146 147 148 149 150 151 152 153 154 155 156 157 158 159 160 161 162 163 164 165 166 167 168 169 170 171 172 173 174 175 176 177 178 179 180 181 182 183 184 185 186 187 188 189 190 191 192 193 194 195 196 197 198 199 200 201 202 203 204 205 206 207 208 209 210 211 212 213 214 215 216 217 218 219 220 221 222 223 224 225 226 227 228 229 230 231 232 233 234 235 236 237 238 239 240 241 242 243 244 245 246 247 248 249 250 251 252 253 254 255 256 257 258 259 260 261 262 263 264 265 266 267 268 269 270 271 272 273 274 275 276 277 278 279 280 281 282 283 284 285 286 287 288 289 290 291 292 293 294 295 296 297 298 299 300 301 302 303 304 305 306 307 308 309 310 311 312 313 314 315 316 317 318 319 320 321 322 323 324 325 326 327 328 329 330 331 332 333 334 335 336 337 338 339 340 341 342 343 344 345 346 347 348 349 350 351 352 353 354 355 356 357 358 359 360 361 362 363 364 365 366 367 368 369 370 371 372 373 374 375 376 377 378 379 380 381 382 383 384 385 386 387 388 389 390 391 392 393 394 395 396 397 398 399 400 401 402 403 404 405 406 407 408 409 410 411 412 413 414 415 416 417 418 419 420 421 422 423 424 425 426 427 428 429 430 431 432 433 434 435 436 437 438 439 440 441 442 443 444 445 446 447 448 449 450 451 452 453 454 455 456 457 458 459 460 461 462 463 464 465 466 467 468 469 470 471 472 473 474 475 476 477 478 479 480 481 482 483 484 485 486 487 488 489 490 491 492 493 494 495 496 497 498 499 500 501 502 503 504 505 506 507 508 509 510 511 512 513 514 515 516 517 518 519 520 521 522 523 524 525 526 527 528 529 530 531 532 533 534 535 536 537 538 539 540 541 542 543 544 545 546 547 548 549 550 551 552 553 554 555 556 557 558 559 560 561 562 563 564 565 566 567 568 569 570 571 572 573 574 575 576 577 578 579 580 581 582 583 584 585 586 587 588 589 590 591 592 593 594 595 596 597 598 599 600 601 602 603 604 605 606 607 608 609 610 611 612 613 614 615 616 617 618 619 620 621 622 623 624 625 626 627 628 629 630 631 632 633 634 635 636 637 638 639 640 641 642 643 644 645 646 647 648 649 650 651 652 653 654 655 656 657 658 659 660 661 662 663 664 665 666 667 668 669 670 671 672 673 674 675 676 677 678 679 680 681 682 683 684 685 686 687 688 689 690 691 692 693 694 695 696 697 698 699 700 701 702 703 704 705 706 707 708 709 710 711 712 713 714 715 716 717 718 719 720 721 722 723 724 725 726 727 728 729 730 731 732 733 734 735 736 737 738 739 740 741 742 743 744 745 746 747 748 749 750 751 752 753 754 755 756 757 758 759 760 761 762 763 764 765 766 767 768 769 770 771 772 773 774 775 776 777 778 779 780 781 782 783 784 785 786 787 788 789 790 791 792 793 794 795 796 797 798 799 800 801 802 803 804 805 806 807 808 809 810 811 812 813 814 815 816 817 818 819 820 821 822 823 824 825 826 827 828 829 830 831 832 833 834 835 836 837 838 839 840 841 842 843 844 845 846 847 848 849 850 851 852 853 854 855 856 857 858 859 860 861 862 863 864 865 866 867 868 869 870 871 872 873 874 875 876 877 878 879 880 881 882 883 884 885 886 887 888 889 890 891 892 893 894 895 896 897 898 899 900 901 902 903 904 905 906 907 908 909 910 911 912 913 914 915 916 917 918 919 920 921 922 923 924 925 926 927 928 929 930 931 932 933
$ make -j1 V=1 check
Making check in config
make[1]: Nothing to be done for `check'.
Making check in contrib
make[1]: Nothing to be done for `check'.
Making check in opal
Making check in include
make[2]: Nothing to be done for `check'.
Making check in libltdl
make check-am
make[3]: Nothing to be done for `check-am'.
Making check in asm
make[2]: Nothing to be done for `check'.
Making check in datatype
make[2]: Nothing to be done for `check'.
Making check in etc
make[2]: Nothing to be done for `check'.
Making check in event
Making check in compat
Making check in sys
make[4]: Nothing to be done for `check'.
make[4]: Nothing to be done for `check-am'.
make[3]: Nothing to be done for `check-am'.
Making check in util
Making check in keyval
make[3]: Nothing to be done for `check'.
make[3]: Nothing to be done for `check-am'.
Making check in mca/base
make[2]: Nothing to be done for `check'.
Making check in mca/backtrace
make[2]: Nothing to be done for `check'.
Making check in mca/carto
make[2]: Nothing to be done for `check'.
Making check in mca/crs
make[2]: Nothing to be done for `check'.
Making check in mca/hwloc
make[2]: Nothing to be done for `check'.
Making check in mca/installdirs
make[2]: Nothing to be done for `check'.
Making check in mca/maffinity
make[2]: Nothing to be done for `check'.
Making check in mca/memchecker
make[2]: Nothing to be done for `check'.
Making check in mca/memcpy
make[2]: Nothing to be done for `check'.
Making check in mca/memory
make[2]: Nothing to be done for `check'.
Making check in mca/paffinity
make[2]: Nothing to be done for `check'.
Making check in mca/pstat
make[2]: Nothing to be done for `check'.
Making check in mca/shmem
make[2]: Nothing to be done for `check'.
Making check in mca/sysinfo
make[2]: Nothing to be done for `check'.
Making check in mca/timer
make[2]: Nothing to be done for `check'.
Making check in mca/backtrace/execinfo
make[2]: Nothing to be done for `check'.
Making check in mca/hwloc/hwloc132
Making check in hwloc
Making check in src
make[4]: Nothing to be done for `check'.
Making check in include
make[4]: Nothing to be done for `check'.
make[4]: Nothing to be done for `check-am'.
make[3]: Nothing to be done for `check-am'.
Making check in mca/installdirs/env
make[2]: Nothing to be done for `check'.
Making check in mca/installdirs/config
make[2]: Nothing to be done for `check'.
Making check in mca/timer/darwin
make[2]: Nothing to be done for `check'.
Making check in .
make[2]: Nothing to be done for `check-am'.
Making check in mca/carto/auto_detect
make[2]: Nothing to be done for `check'.
Making check in mca/carto/file
make[2]: Nothing to be done for `check'.
Making check in mca/crs/none
make[2]: Nothing to be done for `check'.
Making check in mca/maffinity/first_use
make[2]: Nothing to be done for `check'.
Making check in mca/maffinity/hwloc
make[2]: Nothing to be done for `check'.
Making check in mca/paffinity/hwloc
make[2]: Nothing to be done for `check'.
Making check in mca/pstat/darwin
make[2]: Nothing to be done for `check'.
Making check in mca/shmem/mmap
make[2]: Nothing to be done for `check'.
Making check in mca/shmem/posix
make[2]: Nothing to be done for `check'.
Making check in mca/shmem/sysv
make[2]: Nothing to be done for `check'.
Making check in mca/sysinfo/darwin
make[2]: Nothing to be done for `check'.
Making check in tools/wrappers
make[2]: Nothing to be done for `check'.
Making check in orte
Making check in include
make[2]: Nothing to be done for `check'.
Making check in mca/errmgr
make[2]: Nothing to be done for `check'.
Making check in mca/ess
make[2]: Nothing to be done for `check'.
Making check in mca/filem
make[2]: Nothing to be done for `check'.
Making check in mca/grpcomm
make[2]: Nothing to be done for `check'.
Making check in mca/iof
make[2]: Nothing to be done for `check'.
Making check in mca/notifier
make[2]: Nothing to be done for `check'.
Making check in mca/odls
make[2]: Nothing to be done for `check'.
Making check in mca/oob
make[2]: Nothing to be done for `check'.
Making check in mca/plm
make[2]: Nothing to be done for `check'.
Making check in mca/ras
make[2]: Nothing to be done for `check'.
Making check in mca/rmaps
make[2]: Nothing to be done for `check'.
Making check in mca/rmcast
make[2]: Nothing to be done for `check'.
Making check in mca/rml
make[2]: Nothing to be done for `check'.
Making check in mca/routed
make[2]: Nothing to be done for `check'.
Making check in mca/snapc
make[2]: Nothing to be done for `check'.
Making check in etc
make[2]: Nothing to be done for `check'.
Making check in .
make[2]: Nothing to be done for `check-am'.
Making check in mca/errmgr/default
make[2]: Nothing to be done for `check'.
Making check in mca/ess/env
make[2]: Nothing to be done for `check'.
Making check in mca/ess/hnp
make[2]: Nothing to be done for `check'.
Making check in mca/ess/singleton
make[2]: Nothing to be done for `check'.
Making check in mca/ess/slave
make[2]: Nothing to be done for `check'.
Making check in mca/ess/slurm
make[2]: Nothing to be done for `check'.
Making check in mca/ess/slurmd
make[2]: Nothing to be done for `check'.
Making check in mca/ess/tool
make[2]: Nothing to be done for `check'.
Making check in mca/filem/rsh
make[2]: Nothing to be done for `check'.
Making check in mca/grpcomm/bad
make[2]: Nothing to be done for `check'.
Making check in mca/grpcomm/basic
make[2]: Nothing to be done for `check'.
Making check in mca/grpcomm/hier
make[2]: Nothing to be done for `check'.
Making check in mca/iof/hnp
make[2]: Nothing to be done for `check'.
Making check in mca/iof/orted
make[2]: Nothing to be done for `check'.
Making check in mca/iof/tool
make[2]: Nothing to be done for `check'.
Making check in mca/notifier/command
make[2]: Nothing to be done for `check'.
Making check in mca/notifier/syslog
make[2]: Nothing to be done for `check'.
Making check in mca/odls/default
make[2]: Nothing to be done for `check'.
Making check in mca/oob/tcp
make[2]: Nothing to be done for `check'.
Making check in mca/plm/rsh
make[2]: Nothing to be done for `check'.
Making check in mca/plm/slurm
make[2]: Nothing to be done for `check'.
Making check in mca/ras/cm
make[2]: Nothing to be done for `check'.
Making check in mca/ras/slurm
make[2]: Nothing to be done for `check'.
Making check in mca/rmaps/load_balance
make[2]: Nothing to be done for `check'.
Making check in mca/rmaps/rank_file
make[2]: Nothing to be done for `check'.
Making check in mca/rmaps/resilient
make[2]: Nothing to be done for `check'.
Making check in mca/rmaps/round_robin
make[2]: Nothing to be done for `check'.
Making check in mca/rmaps/seq
make[2]: Nothing to be done for `check'.
Making check in mca/rmaps/topo
make[2]: Nothing to be done for `check'.
Making check in mca/rmcast/tcp
make[2]: Nothing to be done for `check'.
Making check in mca/rmcast/udp
make[2]: Nothing to be done for `check'.
Making check in mca/rml/oob
make[2]: Nothing to be done for `check'.
Making check in mca/routed/binomial
make[2]: Nothing to be done for `check'.
Making check in mca/routed/cm
make[2]: Nothing to be done for `check'.
Making check in mca/routed/direct
make[2]: Nothing to be done for `check'.
Making check in mca/routed/linear
make[2]: Nothing to be done for `check'.
Making check in mca/routed/radix
make[2]: Nothing to be done for `check'.
Making check in mca/routed/slave
make[2]: Nothing to be done for `check'.
Making check in tools/orte-bootproxy
make[2]: Nothing to be done for `check'.
Making check in tools/orte-checkpoint
make[2]: Nothing to be done for `check'.
Making check in tools/orte-clean
make[2]: Nothing to be done for `check'.
Making check in tools/orte-iof
make[2]: Nothing to be done for `check'.
Making check in tools/orte-ps
make[2]: Nothing to be done for `check'.
Making check in tools/orte-restart
make[2]: Nothing to be done for `check'.
Making check in tools/orted
make[2]: Nothing to be done for `check'.
Making check in tools/orterun
make[2]: Nothing to be done for `check'.
Making check in tools/wrappers
make[2]: Nothing to be done for `check'.
Making check in tools/orte-top
make[2]: Nothing to be done for `check'.
Making check in ompi
Making check in include
make[2]: Nothing to be done for `check'.
Making check in datatype
make[2]: Nothing to be done for `check'.
Making check in debuggers
make predefined_gap_test dlopen_test
/usr/bin/clang -DHAVE_CONFIG_H -I. -I../../opal/include -I../../orte/include -I../../ompi/include -I../../opal/mca/hwloc/hwloc132/hwloc/include/private/autogen -I../../opal/mca/hwloc/hwloc132/hwloc/include/hwloc/autogen -I../.. -D_REENTRANT -I/private/tmp/homebrew-open-mpi-1.6-trJD/openmpi-1.6/opal/mca/hwloc/hwloc132/hwloc/include -I/usr/include/infiniband -I/usr/include/infiniband -DNDEBUG -fno-strict-aliasing -g -c -o predefined_gap_test.o predefined_gap_test.c
/bin/sh ../../libtool --tag=CC --mode=link /usr/bin/clang -DNDEBUG -fno-strict-aliasing -g -export-dynamic -o predefined_gap_test predefined_gap_test.o ../../ompi/libmpi.la
libtool: link: /usr/bin/clang -DNDEBUG -fno-strict-aliasing -g -o .libs/predefined_gap_test predefined_gap_test.o ../../ompi/.libs/libmpi.dylib -L/private/tmp/homebrew-open-mpi-1.6-trJD/openmpi-1.6/opal/mca/hwloc/hwloc132/hwloc/src -lm
/usr/bin/clang -DHAVE_CONFIG_H -I. -I../../opal/include -I../../orte/include -I../../ompi/include -I../../opal/mca/hwloc/hwloc132/hwloc/include/private/autogen -I../../opal/mca/hwloc/hwloc132/hwloc/include/hwloc/autogen -I../../opal/libltdl -I../.. -D_REENTRANT -I/private/tmp/homebrew-open-mpi-1.6-trJD/openmpi-1.6/opal/mca/hwloc/hwloc132/hwloc/include -I/usr/include/infiniband -I/usr/include/infiniband -DNDEBUG -fno-strict-aliasing -g -c -o dlopen_test-dlopen_test.o `test -f 'dlopen_test.c' || echo './'`dlopen_test.c
/bin/sh ../../libtool --tag=CC --mode=link /usr/bin/clang -DNDEBUG -fno-strict-aliasing -g -export-dynamic -o dlopen_test dlopen_test-dlopen_test.o ../../opal/libltdl/libltdlc.la
libtool: link: /usr/bin/clang -DNDEBUG -fno-strict-aliasing -g -o dlopen_test dlopen_test-dlopen_test.o /private/tmp/homebrew-open-mpi-1.6-trJD/openmpi-1.6/opal/libltdl/./.libs/dlopen.a ../../opal/libltdl/.libs/libltdlc.a
make check-TESTS
ompi_predefined_communicator_t = 1024 bytes
ompi_communicator_t = 560 bytes
c_base = 0, 16
c_lock = 16, 88
c_name = 104, 64
c_contextid = 168, 4
c_my_rank = 172, 4
c_flags = 176, 4
c_id_available = 180, 4
c_id_start_index = 184, 4
c_remote_group = 200, 8
c_local_comm = 208, 8
c_keyhash = 216, 8
c_cube_dim = 224, 4
c_topo_component = 232, 8 ***
c_topo = 240, 8
c_topo_comm = 248, 8
c_topo_module = 256, 8
c_f_to_c_index = 264, 4
c_peruse_handles = 272, 8 ***
error_handler = 280, 8
errhandler_type = 288, 4
c_pml_comm = 296, 8 ***
c_coll = 304, 256
=============================================
ompi_predefined_group_t = 256 bytes
ompi_group_t = 72 bytes
grp_proc_count = 16, 4
grp_my_rank = 20, 4
grp_f_to_c_index = 24, 4
grp_proc_pointers = 32, 8 ***
grp_flags = 40, 4
grp_parent_group_ptr = 48, 8 ***
=============================================
ompi_predefined_request_t = 256 bytes
ompi_request_t = 136 bytes
super = 0, 56
req_type = 56, 4
req_status = 64, 24 ***
req_complete = 88, 1
req_state = 92, 4 ***
req_persistent = 96, 1
req_f_to_c_index = 100, 4 ***
req_free = 104, 8
=============================================
ompi_predefined_op_t = 2048 bytes
ompi_op_t = 1400 bytes
super = 0, 16
o_name = 16, 64
o_flags = 80, 4
o_f_to_c_index = 84, 4
o_func = 88, 656
o_3buff_instrinsic = 744, 656
=============================================
ompi_predefined_datatype_t = 512 bytes
ompi_datatype_t = 448 bytes
=============================================
ompi_predefined_win_t = 512 bytes
ompi_win_t = 248 bytes
w_base = 0, 16
w_lock = 16, 88
w_name = 104, 64
w_group = 168, 8
w_flags = 176, 2
w_keyhash = 184, 8 ***
w_f_to_c_index = 192, 4
error_handler = 200, 8 ***
errhandler_type = 208, 4
w_disp_unit = 212, 4
w_baseptr = 216, 8
w_size = 224, 8
w_mode = 232, 2
w_osc_module = 240, 8 ***
=============================================
ompi_predefined_info_t = 256 bytes
ompi_info_t = 88 bytes
super = 0, 64
i_f_to_c_index = 64, 4
i_lock = 72, 8 ***
i_freed = 80, 1
=============================================
ompi_predefined_file_t = 1536 bytes
ompi_file_t = 768 bytes
super = 0, 16
f_comm = 16, 8
f_filename = 24, 8
f_amode = 32, 4
f_info = 40, 8 ***
f_flags = 48, 4
f_f_to_c_index = 52, 4
error_handler = 56, 8
errhandler_type = 64, 4
f_io_version = 68, 4
f_io_selected_component = 72, 296
f_io_selected_module = 368, 392
f_io_selected_data = 760, 8
PASS: predefined_gap_test
Trying to lt_dlopen file with dladvise_local: ./libompi_dbg_msgq
File opened with dladvise_local, all passed
PASS: dlopen_test
==================
All 2 tests passed
==================
Making check in etc
make[2]: Nothing to be done for `check'.
Making check in mpi/c
Making check in profile
make[3]: Nothing to be done for `check'.
make[3]: Nothing to be done for `check-am'.
Making check in mpiext
make[2]: Nothing to be done for `check'.
Making check in mca/common
make[2]: Nothing to be done for `check'.
Making check in mca/allocator
make[2]: Nothing to be done for `check'.
Making check in mca/bml
make[2]: Nothing to be done for `check'.
Making check in mca/btl
make[2]: Nothing to be done for `check'.
Making check in mca/coll
make[2]: Nothing to be done for `check'.
Making check in mca/crcp
make[2]: Nothing to be done for `check'.
Making check in mca/dpm
make[2]: Nothing to be done for `check'.
Making check in mca/io
make[2]: Nothing to be done for `check'.
Making check in mca/mpool
make[2]: Nothing to be done for `check'.
Making check in mca/mtl
make[2]: Nothing to be done for `check'.
Making check in mca/op
make[2]: Nothing to be done for `check'.
Making check in mca/osc
make[2]: Nothing to be done for `check'.
Making check in mca/pml
make[2]: Nothing to be done for `check'.
Making check in mca/pubsub
make[2]: Nothing to be done for `check'.
Making check in mca/rcache
make[2]: Nothing to be done for `check'.
Making check in mca/topo
make[2]: Nothing to be done for `check'.
Making check in .
make[2]: Nothing to be done for `check-am'.
Making check in mpi/cxx
make[2]: Nothing to be done for `check'.
Making check in mpi/f77
Making check in profile
make[3]: Nothing to be done for `check'.
make[3]: Nothing to be done for `check-am'.
Making check in mpi/f90
make check-recursive
Making check in scripts
make[4]: Nothing to be done for `check'.
make[4]: Nothing to be done for `check-am'.
Making check in mca/common/sm
if test -z "libmca_common_sm.la"; then \
rm -f "libmca_common_sm.la"; \
ln -s "libmca_common_sm_noinst.la" "libmca_common_sm.la"; \
fi
Making check in mca/allocator/basic
make[2]: Nothing to be done for `check'.
Making check in mca/allocator/bucket
make[2]: Nothing to be done for `check'.
Making check in mca/bml/r2
make[2]: Nothing to be done for `check'.
Making check in mca/btl/self
make[2]: Nothing to be done for `check'.
Making check in mca/btl/sm
make[2]: Nothing to be done for `check'.
Making check in mca/btl/tcp
make[2]: Nothing to be done for `check'.
Making check in mca/coll/basic
make[2]: Nothing to be done for `check'.
Making check in mca/coll/hierarch
make[2]: Nothing to be done for `check'.
Making check in mca/coll/inter
make[2]: Nothing to be done for `check'.
Making check in mca/coll/self
make[2]: Nothing to be done for `check'.
Making check in mca/coll/sm
make[2]: Nothing to be done for `check'.
Making check in mca/coll/sync
make[2]: Nothing to be done for `check'.
Making check in mca/coll/tuned
make[2]: Nothing to be done for `check'.
Making check in mca/dpm/orte
make[2]: Nothing to be done for `check'.
Making check in mca/io/romio
Making check in romio
Making check in include
make[4]: Nothing to be done for `check'.
Making check in adio
Making check in common
make[5]: Nothing to be done for `check'.
Making check in include
make[5]: Nothing to be done for `check'.
Making check in ad_nfs
make[5]: Nothing to be done for `check'.
Making check in ad_testfs
make[5]: Nothing to be done for `check'.
Making check in ad_ufs
make[5]: Nothing to be done for `check'.
make[5]: Nothing to be done for `check-am'.
Making check in mpi-io
Making check in glue/openmpi
make[5]: Nothing to be done for `check'.
make[5]: Nothing to be done for `check-am'.
make[4]: Nothing to be done for `check-am'.
make[3]: Nothing to be done for `check-am'.
Making check in mca/mpool/fake
make[2]: Nothing to be done for `check'.
Making check in mca/mpool/rdma
make[2]: Nothing to be done for `check'.
Making check in mca/mpool/sm
make[2]: Nothing to be done for `check'.
Making check in mca/osc/pt2pt
make[2]: Nothing to be done for `check'.
Making check in mca/osc/rdma
make[2]: Nothing to be done for `check'.
Making check in mca/pml/bfo
make[2]: Nothing to be done for `check'.
Making check in mca/pml/cm
make[2]: Nothing to be done for `check'.
Making check in mca/pml/csum
make[2]: Nothing to be done for `check'.
Making check in mca/pml/ob1
make[2]: Nothing to be done for `check'.
Making check in mca/pml/v
Making check in mca/vprotocol
make[3]: Nothing to be done for `check'.
Making check in mca/vprotocol/pessimist
make[3]: Nothing to be done for `check'.
make[3]: Nothing to be done for `check-am'.
Making check in mca/pubsub/orte
make[2]: Nothing to be done for `check'.
Making check in mca/rcache/vma
make[2]: Nothing to be done for `check'.
Making check in mca/topo/unity
make[2]: Nothing to be done for `check'.
Making check in contrib/libompitrace
make[2]: Nothing to be done for `check'.
Making check in contrib/vt
Making check in vt
Making check in extlib
Making check in otf
Making check in vendor/jenkins_hash
make[6]: Nothing to be done for `check'.
Making check in otflib
make[6]: Nothing to be done for `check'.
Making check in otfauxlib
make[6]: Nothing to be done for `check'.
Making check in tools
Making check in otfaux
make[7]: Nothing to be done for `check'.
Making check in otfconfig
make[7]: Nothing to be done for `check'.
Making check in otfdump
make[7]: Nothing to be done for `check'.
Making check in otfinfo
make[7]: Nothing to be done for `check'.
Making check in otfmerge
Making check in .
make[8]: Nothing to be done for `check-am'.
Making check in mpi
make[8]: Nothing to be done for `check'.
Making check in otfprofile
Making check in .
make[8]: Nothing to be done for `check-am'.
Making check in mpi
make[8]: Nothing to be done for `check'.
Making check in otfshrink
make[7]: Nothing to be done for `check'.
Making check in otfcompress
make[7]: Nothing to be done for `check'.
make[7]: Nothing to be done for `check-am'.
Making check in tests
Making check in hello
make otf_hello
/usr/bin/clang -DHAVE_CONFIG_H -I. -I../.. -I../../otflib -I../../otflib -DINSIDE_OPENMPI -D_REENTRANT -I/private/tmp/homebrew-open-mpi-1.6-trJD/openmpi-1.6/opal/mca/hwloc/hwloc132/hwloc/include -I/usr/include/infiniband -I/usr/include/infiniband -I/private/tmp/homebrew-open-mpi-1.6-trJD/openmpi-1.6/ompi/contrib/vt/vt/../../../include -I/private/tmp/homebrew-open-mpi-1.6-trJD/openmpi-1.6/ompi/contrib/vt/vt/../../../include -DNDEBUG -g -O2 -finline-functions -fno-strict-aliasing -MT otf_hello-hello.o -MD -MP -MF .deps/otf_hello-hello.Tpo -c -o otf_hello-hello.o `test -f 'hello.c' || echo './'`hello.c
mv -f .deps/otf_hello-hello.Tpo .deps/otf_hello-hello.Po
/bin/sh ../../libtool --tag=CC --mode=link /usr/bin/clang -DNDEBUG -g -O2 -finline-functions -fno-strict-aliasing -L/private/tmp/homebrew-open-mpi-1.6-trJD/openmpi-1.6/ompi/contrib/vt/vt/../../../.libs -o otf_hello otf_hello-hello.o ../../otflib/libotf.la
libtool: link: /usr/bin/clang -DNDEBUG -g -O2 -finline-functions -fno-strict-aliasing -o .libs/otf_hello otf_hello-hello.o -L/private/tmp/homebrew-open-mpi-1.6-trJD/openmpi-1.6/ompi/contrib/vt/vt/../../../.libs ../../otflib/.libs/libotf.dylib -lz
Making check in generic_streams
make
make[8]: Nothing to be done for `all'.
Making check in generic_streams-mpi
make
make[8]: Nothing to be done for `all'.
Making check in progress
make otf_progress
/usr/bin/clang -DHAVE_CONFIG_H -I. -I../.. -I../../otflib -I../../otflib -DINSIDE_OPENMPI -D_REENTRANT -I/private/tmp/homebrew-open-mpi-1.6-trJD/openmpi-1.6/opal/mca/hwloc/hwloc132/hwloc/include -I/usr/include/infiniband -I/usr/include/infiniband -I/private/tmp/homebrew-open-mpi-1.6-trJD/openmpi-1.6/ompi/contrib/vt/vt/../../../include -I/private/tmp/homebrew-open-mpi-1.6-trJD/openmpi-1.6/ompi/contrib/vt/vt/../../../include -DNDEBUG -g -O2 -finline-functions -fno-strict-aliasing -MT otf_progress-progress.o -MD -MP -MF .deps/otf_progress-progress.Tpo -c -o otf_progress-progress.o `test -f 'progress.c' || echo './'`progress.c
mv -f .deps/otf_progress-progress.Tpo .deps/otf_progress-progress.Po
/bin/sh ../../libtool --tag=CC --mode=link /usr/bin/clang -DNDEBUG -g -O2 -finline-functions -fno-strict-aliasing -L/private/tmp/homebrew-open-mpi-1.6-trJD/openmpi-1.6/ompi/contrib/vt/vt/../../../.libs -o otf_progress otf_progress-progress.o ../../otflib/libotf.la
libtool: link: /usr/bin/clang -DNDEBUG -g -O2 -finline-functions -fno-strict-aliasing -o .libs/otf_progress otf_progress-progress.o -L/private/tmp/homebrew-open-mpi-1.6-trJD/openmpi-1.6/ompi/contrib/vt/vt/../../../.libs ../../otflib/.libs/libotf.dylib -lz
Making check in read_from_buffer
make otf_read_from_buffer
/usr/bin/clang -DHAVE_CONFIG_H -I. -I../.. -I../../otflib -I../../otflib -DINSIDE_OPENMPI -D_REENTRANT -I/private/tmp/homebrew-open-mpi-1.6-trJD/openmpi-1.6/opal/mca/hwloc/hwloc132/hwloc/include -I/usr/include/infiniband -I/usr/include/infiniband -I/private/tmp/homebrew-open-mpi-1.6-trJD/openmpi-1.6/ompi/contrib/vt/vt/../../../include -I/private/tmp/homebrew-open-mpi-1.6-trJD/openmpi-1.6/ompi/contrib/vt/vt/../../../include -DNDEBUG -g -O2 -finline-functions -fno-strict-aliasing -MT otf_read_from_buffer-read_from_buffer.o -MD -MP -MF .deps/otf_read_from_buffer-read_from_buffer.Tpo -c -o otf_read_from_buffer-read_from_buffer.o `test -f 'read_from_buffer.c' || echo './'`read_from_buffer.c
mv -f .deps/otf_read_from_buffer-read_from_buffer.Tpo .deps/otf_read_from_buffer-read_from_buffer.Po
/bin/sh ../../libtool --tag=CC --mode=link /usr/bin/clang -DNDEBUG -g -O2 -finline-functions -fno-strict-aliasing -L/private/tmp/homebrew-open-mpi-1.6-trJD/openmpi-1.6/ompi/contrib/vt/vt/../../../.libs -o otf_read_from_buffer otf_read_from_buffer-read_from_buffer.o ../../otflib/libotf.la
libtool: link: /usr/bin/clang -DNDEBUG -g -O2 -finline-functions -fno-strict-aliasing -o .libs/otf_read_from_buffer otf_read_from_buffer-read_from_buffer.o -L/private/tmp/homebrew-open-mpi-1.6-trJD/openmpi-1.6/ompi/contrib/vt/vt/../../../.libs ../../otflib/.libs/libotf.dylib -lz
Making check in thumbnail
make otf_thumbnail
/usr/bin/clang -DHAVE_CONFIG_H -I. -I../.. -I../../otflib -I../../otflib -I../../otfauxlib -DINSIDE_OPENMPI -D_REENTRANT -I/private/tmp/homebrew-open-mpi-1.6-trJD/openmpi-1.6/opal/mca/hwloc/hwloc132/hwloc/include -I/usr/include/infiniband -I/usr/include/infiniband -I/private/tmp/homebrew-open-mpi-1.6-trJD/openmpi-1.6/ompi/contrib/vt/vt/../../../include -I/private/tmp/homebrew-open-mpi-1.6-trJD/openmpi-1.6/ompi/contrib/vt/vt/../../../include -DNDEBUG -g -O2 -finline-functions -fno-strict-aliasing -MT otf_thumbnail-thumbnail.o -MD -MP -MF .deps/otf_thumbnail-thumbnail.Tpo -c -o otf_thumbnail-thumbnail.o `test -f 'thumbnail.c' || echo './'`thumbnail.c
thumbnail.c:18:16: warning: conversion specifies type 'unsigned long' but the argument has type 'uint64_t' (aka 'unsigned long long') [-Wformat]
printf( "%lx: %x/%x\n", process, start_pixel, function );
~~^ ~~~~~~~
%llx
1 warning generated.
mv -f .deps/otf_thumbnail-thumbnail.Tpo .deps/otf_thumbnail-thumbnail.Po
/bin/sh ../../libtool --tag=CC --mode=link /usr/bin/clang -DNDEBUG -g -O2 -finline-functions -fno-strict-aliasing -L/private/tmp/homebrew-open-mpi-1.6-trJD/openmpi-1.6/ompi/contrib/vt/vt/../../../.libs -o otf_thumbnail otf_thumbnail-thumbnail.o ../../otfauxlib/libotfaux.la ../../otflib/libotf.la
libtool: link: /usr/bin/clang -DNDEBUG -g -O2 -finline-functions -fno-strict-aliasing -o .libs/otf_thumbnail otf_thumbnail-thumbnail.o -L/private/tmp/homebrew-open-mpi-1.6-trJD/openmpi-1.6/ompi/contrib/vt/vt/../../../.libs ../../otfauxlib/.libs/libotfaux.dylib ../../otflib/.libs/libotf.dylib -lz
make[7]: Nothing to be done for `check-am'.
Making check in docu
make[6]: Nothing to be done for `check'.
make[6]: Nothing to be done for `check-am'.
make[5]: Nothing to be done for `check-am'.
Making check in util
make[4]: Nothing to be done for `check'.
Making check in rfg
make[4]: Nothing to be done for `check'.
Making check in vtlib
make[4]: Nothing to be done for `check'.
Making check in tools
Making check in vtfilter
Making check in .
make[6]: Nothing to be done for `check-am'.
Making check in mpi
make[6]: Nothing to be done for `check'.
Making check in vtrun
make[5]: Nothing to be done for `check'.
Making check in vtsetup
Making check in .
make[6]: Nothing to be done for `check-am'.
Making check in doc
make[6]: Nothing to be done for `check'.
Making check in vtunify
Making check in .
make[6]: Nothing to be done for `check-am'.
Making check in mpi
make[6]: Nothing to be done for `check'.
Making check in vtwrapper
make[5]: Nothing to be done for `check'.
make[5]: Nothing to be done for `check-am'.
Making check in include
make[4]: Nothing to be done for `check'.
Making check in doc
make[4]: Nothing to be done for `check'.
Making check in etc
make[4]: Nothing to be done for `check'.
make[4]: Nothing to be done for `check-am'.
Making check in wrappers
make[3]: Nothing to be done for `check'.
make[3]: Nothing to be done for `check-am'.
Making check in tools/ompi_info
make[2]: Nothing to be done for `check'.
Making check in tools/wrappers
make[2]: Nothing to be done for `check'.
Making check in tools/ortetools
make[2]: Nothing to be done for `check'.
Making check in tools/ompi-server
make[2]: Nothing to be done for `check'.
Making check in tools/ompi-probe
make[2]: Nothing to be done for `check'.
Making check in tools/ompi-profiler
make[2]: Nothing to be done for `check'.
Making check in test
Making check in support
make libsupport.a
/usr/bin/clang -DHAVE_CONFIG_H -I. -I../../opal/include -I../../orte/include -I../../ompi/include -I../../opal/mca/hwloc/hwloc132/hwloc/include/private/autogen -I../../opal/mca/hwloc/hwloc132/hwloc/include/hwloc/autogen -I../../opal/libltdl -DBUILDDIR=\"/private/tmp/homebrew-open-mpi-1.6-trJD/openmpi-1.6\" -DSRCDIR=\"/private/tmp/homebrew-open-mpi-1.6-trJD/openmpi-1.6\" -I../.. -D_REENTRANT -I/private/tmp/homebrew-open-mpi-1.6-trJD/openmpi-1.6/opal/mca/hwloc/hwloc132/hwloc/include -I/usr/include/infiniband -I/usr/include/infiniband -DNDEBUG -g -O2 -finline-functions -fno-strict-aliasing -c -o components.o components.c
/usr/bin/clang -DHAVE_CONFIG_H -I. -I../../opal/include -I../../orte/include -I../../ompi/include -I../../opal/mca/hwloc/hwloc132/hwloc/include/private/autogen -I../../opal/mca/hwloc/hwloc132/hwloc/include/hwloc/autogen -I../../opal/libltdl -DBUILDDIR=\"/private/tmp/homebrew-open-mpi-1.6-trJD/openmpi-1.6\" -DSRCDIR=\"/private/tmp/homebrew-open-mpi-1.6-trJD/openmpi-1.6\" -I../.. -D_REENTRANT -I/private/tmp/homebrew-open-mpi-1.6-trJD/openmpi-1.6/opal/mca/hwloc/hwloc132/hwloc/include -I/usr/include/infiniband -I/usr/include/infiniband -DNDEBUG -g -O2 -finline-functions -fno-strict-aliasing -c -o support.o support.c
rm -f libsupport.a
ar cru libsupport.a components.o support.o
ranlib libsupport.a
Making check in asm
make atomic_barrier atomic_barrier_noinline atomic_spinlock atomic_spinlock_noinline atomic_math atomic_math_noinline atomic_cmpset atomic_cmpset_noinline
/usr/bin/clang -DHAVE_CONFIG_H -I. -I../../opal/include -I../../orte/include -I../../ompi/include -I../../opal/mca/hwloc/hwloc132/hwloc/include/private/autogen -I../../opal/mca/hwloc/hwloc132/hwloc/include/hwloc/autogen -I../.. -D_REENTRANT -I/private/tmp/homebrew-open-mpi-1.6-trJD/openmpi-1.6/opal/mca/hwloc/hwloc132/hwloc/include -I/usr/include/infiniband -I/usr/include/infiniband -DNDEBUG -g -O2 -finline-functions -fno-strict-aliasing -c -o atomic_barrier.o atomic_barrier.c
/bin/sh ../../libtool --tag=CC --mode=link /usr/bin/clang -DNDEBUG -g -O2 -finline-functions -fno-strict-aliasing -export-dynamic -o atomic_barrier atomic_barrier.o ../../opal/asm/libasm.la
libtool: link: /usr/bin/clang -DNDEBUG -g -O2 -finline-functions -fno-strict-aliasing -o atomic_barrier atomic_barrier.o ../../opal/asm/.libs/libasm.a
/usr/bin/clang -DHAVE_CONFIG_H -I. -I../../opal/include -I../../orte/include -I../../ompi/include -I../../opal/mca/hwloc/hwloc132/hwloc/include/private/autogen -I../../opal/mca/hwloc/hwloc132/hwloc/include/hwloc/autogen -I../.. -D_REENTRANT -I/private/tmp/homebrew-open-mpi-1.6-trJD/openmpi-1.6/opal/mca/hwloc/hwloc132/hwloc/include -I/usr/include/infiniband -I/usr/include/infiniband -DOMPI_DISABLE_INLINE_ASM -DNDEBUG -g -O2 -finline-functions -fno-strict-aliasing -c -o atomic_barrier_noinline-atomic_barrier_noinline.o `test -f 'atomic_barrier_noinline.c' || echo './'`atomic_barrier_noinline.c
/bin/sh ../../libtool --tag=CC --mode=link /usr/bin/clang -DOMPI_DISABLE_INLINE_ASM -DNDEBUG -g -O2 -finline-functions -fno-strict-aliasing -export-dynamic -o atomic_barrier_noinline atomic_barrier_noinline-atomic_barrier_noinline.o ../../opal/asm/libasm.la
libtool: link: /usr/bin/clang -DOMPI_DISABLE_INLINE_ASM -DNDEBUG -g -O2 -finline-functions -fno-strict-aliasing -o atomic_barrier_noinline atomic_barrier_noinline-atomic_barrier_noinline.o ../../opal/asm/.libs/libasm.a
/usr/bin/clang -DHAVE_CONFIG_H -I. -I../../opal/include -I../../orte/include -I../../ompi/include -I../../opal/mca/hwloc/hwloc132/hwloc/include/private/autogen -I../../opal/mca/hwloc/hwloc132/hwloc/include/hwloc/autogen -I../.. -D_REENTRANT -I/private/tmp/homebrew-open-mpi-1.6-trJD/openmpi-1.6/opal/mca/hwloc/hwloc132/hwloc/include -I/usr/include/infiniband -I/usr/include/infiniband -DNDEBUG -g -O2 -finline-functions -fno-strict-aliasing -c -o atomic_spinlock.o atomic_spinlock.c
/bin/sh ../../libtool --tag=CC --mode=link /usr/bin/clang -DNDEBUG -g -O2 -finline-functions -fno-strict-aliasing -export-dynamic -o atomic_spinlock atomic_spinlock.o ../../opal/asm/libasm.la
libtool: link: /usr/bin/clang -DNDEBUG -g -O2 -finline-functions -fno-strict-aliasing -o atomic_spinlock atomic_spinlock.o ../../opal/asm/.libs/libasm.a
/usr/bin/clang -DHAVE_CONFIG_H -I. -I../../opal/include -I../../orte/include -I../../ompi/include -I../../opal/mca/hwloc/hwloc132/hwloc/include/private/autogen -I../../opal/mca/hwloc/hwloc132/hwloc/include/hwloc/autogen -I../.. -D_REENTRANT -I/private/tmp/homebrew-open-mpi-1.6-trJD/openmpi-1.6/opal/mca/hwloc/hwloc132/hwloc/include -I/usr/include/infiniband -I/usr/include/infiniband -DOMPI_DISABLE_INLINE_ASM -DNDEBUG -g -O2 -finline-functions -fno-strict-aliasing -c -o atomic_spinlock_noinline-atomic_spinlock_noinline.o `test -f 'atomic_spinlock_noinline.c' || echo './'`atomic_spinlock_noinline.c
/bin/sh ../../libtool --tag=CC --mode=link /usr/bin/clang -DOMPI_DISABLE_INLINE_ASM -DNDEBUG -g -O2 -finline-functions -fno-strict-aliasing -export-dynamic -o atomic_spinlock_noinline atomic_spinlock_noinline-atomic_spinlock_noinline.o ../../opal/asm/libasm.la
libtool: link: /usr/bin/clang -DOMPI_DISABLE_INLINE_ASM -DNDEBUG -g -O2 -finline-functions -fno-strict-aliasing -o atomic_spinlock_noinline atomic_spinlock_noinline-atomic_spinlock_noinline.o ../../opal/asm/.libs/libasm.a
/usr/bin/clang -DHAVE_CONFIG_H -I. -I../../opal/include -I../../orte/include -I../../ompi/include -I../../opal/mca/hwloc/hwloc132/hwloc/include/private/autogen -I../../opal/mca/hwloc/hwloc132/hwloc/include/hwloc/autogen -I../.. -D_REENTRANT -I/private/tmp/homebrew-open-mpi-1.6-trJD/openmpi-1.6/opal/mca/hwloc/hwloc132/hwloc/include -I/usr/include/infiniband -I/usr/include/infiniband -DNDEBUG -g -O2 -finline-functions -fno-strict-aliasing -c -o atomic_math.o atomic_math.c
/bin/sh ../../libtool --tag=CC --mode=link /usr/bin/clang -DNDEBUG -g -O2 -finline-functions -fno-strict-aliasing -export-dynamic -o atomic_math atomic_math.o ../../opal/asm/libasm.la
libtool: link: /usr/bin/clang -DNDEBUG -g -O2 -finline-functions -fno-strict-aliasing -o atomic_math atomic_math.o ../../opal/asm/.libs/libasm.a
/usr/bin/clang -DHAVE_CONFIG_H -I. -I../../opal/include -I../../orte/include -I../../ompi/include -I../../opal/mca/hwloc/hwloc132/hwloc/include/private/autogen -I../../opal/mca/hwloc/hwloc132/hwloc/include/hwloc/autogen -I../.. -D_REENTRANT -I/private/tmp/homebrew-open-mpi-1.6-trJD/openmpi-1.6/opal/mca/hwloc/hwloc132/hwloc/include -I/usr/include/infiniband -I/usr/include/infiniband -DOMPI_DISABLE_INLINE_ASM -DNDEBUG -g -O2 -finline-functions -fno-strict-aliasing -c -o atomic_math_noinline-atomic_math_noinline.o `test -f 'atomic_math_noinline.c' || echo './'`atomic_math_noinline.c
/bin/sh ../../libtool --tag=CC --mode=link /usr/bin/clang -DOMPI_DISABLE_INLINE_ASM -DNDEBUG -g -O2 -finline-functions -fno-strict-aliasing -export-dynamic -o atomic_math_noinline atomic_math_noinline-atomic_math_noinline.o ../../opal/asm/libasm.la
libtool: link: /usr/bin/clang -DOMPI_DISABLE_INLINE_ASM -DNDEBUG -g -O2 -finline-functions -fno-strict-aliasing -o atomic_math_noinline atomic_math_noinline-atomic_math_noinline.o ../../opal/asm/.libs/libasm.a
/usr/bin/clang -DHAVE_CONFIG_H -I. -I../../opal/include -I../../orte/include -I../../ompi/include -I../../opal/mca/hwloc/hwloc132/hwloc/include/private/autogen -I../../opal/mca/hwloc/hwloc132/hwloc/include/hwloc/autogen -I../.. -D_REENTRANT -I/private/tmp/homebrew-open-mpi-1.6-trJD/openmpi-1.6/opal/mca/hwloc/hwloc132/hwloc/include -I/usr/include/infiniband -I/usr/include/infiniband -DNDEBUG -g -O2 -finline-functions -fno-strict-aliasing -c -o atomic_cmpset.o atomic_cmpset.c
/bin/sh ../../libtool --tag=CC --mode=link /usr/bin/clang -DNDEBUG -g -O2 -finline-functions -fno-strict-aliasing -export-dynamic -o atomic_cmpset atomic_cmpset.o ../../opal/asm/libasm.la
libtool: link: /usr/bin/clang -DNDEBUG -g -O2 -finline-functions -fno-strict-aliasing -o atomic_cmpset atomic_cmpset.o ../../opal/asm/.libs/libasm.a
/usr/bin/clang -DHAVE_CONFIG_H -I. -I../../opal/include -I../../orte/include -I../../ompi/include -I../../opal/mca/hwloc/hwloc132/hwloc/include/private/autogen -I../../opal/mca/hwloc/hwloc132/hwloc/include/hwloc/autogen -I../.. -D_REENTRANT -I/private/tmp/homebrew-open-mpi-1.6-trJD/openmpi-1.6/opal/mca/hwloc/hwloc132/hwloc/include -I/usr/include/infiniband -I/usr/include/infiniband -DOMPI_DISABLE_INLINE_ASM -DNDEBUG -g -O2 -finline-functions -fno-strict-aliasing -c -o atomic_cmpset_noinline-atomic_cmpset_noinline.o `test -f 'atomic_cmpset_noinline.c' || echo './'`atomic_cmpset_noinline.c
/bin/sh ../../libtool --tag=CC --mode=link /usr/bin/clang -DOMPI_DISABLE_INLINE_ASM -DNDEBUG -g -O2 -finline-functions -fno-strict-aliasing -export-dynamic -o atomic_cmpset_noinline atomic_cmpset_noinline-atomic_cmpset_noinline.o ../../opal/asm/libasm.la
libtool: link: /usr/bin/clang -DOMPI_DISABLE_INLINE_ASM -DNDEBUG -g -O2 -finline-functions -fno-strict-aliasing -o atomic_cmpset_noinline atomic_cmpset_noinline-atomic_cmpset_noinline.o ../../opal/asm/.libs/libasm.a
make check-TESTS
--> Testing atomic_barrier
- 1 threads: Passed
- 2 threads: Passed
- 4 threads: Passed
- 5 threads: Passed
- 8 threads: Passed
PASS: atomic_barrier
--> Testing atomic_barrier_noinline
- 1 threads: Passed
- 2 threads: Passed
- 4 threads: Passed
- 5 threads: Passed
- 8 threads: Passed
PASS: atomic_barrier_noinline
--> Testing atomic_spinlock
- 1 threads: Passed
- 2 threads: Passed
- 4 threads: Passed
- 5 threads: Passed
- 8 threads: Passed
PASS: atomic_spinlock
--> Testing atomic_spinlock_noinline
- 1 threads: Passed
- 2 threads: Passed
- 4 threads: Passed
- 5 threads: Passed
- 8 threads: Passed
PASS: atomic_spinlock_noinline
--> Testing atomic_math
- 1 threads: Passed
- 2 threads: Passed
- 4 threads: Passed
- 5 threads: Passed
- 8 threads: Passed
PASS: atomic_math
--> Testing atomic_math_noinline
- 1 threads: Passed
- 2 threads: Passed
- 4 threads: Passed
- 5 threads: Passed
- 8 threads: Passed
PASS: atomic_math_noinline
--> Testing atomic_cmpset
- 1 threads: Passed
- 2 threads: Passed
- 4 threads: Passed
- 5 threads: Passed
- 8 threads: Passed
PASS: atomic_cmpset
--> Testing atomic_cmpset_noinline
- 1 threads: Passed
- 2 threads: Passed
- 4 threads: Passed
- 5 threads: Passed
- 8 threads: Passed
PASS: atomic_cmpset_noinline
==================
All 8 tests passed
==================
Making check in class
make ompi_rb_tree opal_bitmap opal_hash_table opal_list opal_value_array opal_pointer_array
/usr/bin/clang -DHAVE_CONFIG_H -I. -I../../opal/include -I../../orte/include -I../../ompi/include -I../../opal/mca/hwloc/hwloc132/hwloc/include/private/autogen -I../../opal/mca/hwloc/hwloc132/hwloc/include/hwloc/autogen "-I../../test/support" -I../.. -D_REENTRANT -I/private/tmp/homebrew-open-mpi-1.6-trJD/openmpi-1.6/opal/mca/hwloc/hwloc132/hwloc/include -I/usr/include/infiniband -I/usr/include/infiniband -DNDEBUG -g -O2 -finline-functions -fno-strict-aliasing -c -o ompi_rb_tree.o ompi_rb_tree.c
/bin/sh ../../libtool --tag=CC --mode=link /usr/bin/clang -DNDEBUG -g -O2 -finline-functions -fno-strict-aliasing -export-dynamic -o ompi_rb_tree ompi_rb_tree.o ../../ompi/libmpi.la ../../test/support/libsupport.a
libtool: link: /usr/bin/clang -DNDEBUG -g -O2 -finline-functions -fno-strict-aliasing -o .libs/ompi_rb_tree ompi_rb_tree.o ../../ompi/.libs/libmpi.dylib -L/private/tmp/homebrew-open-mpi-1.6-trJD/openmpi-1.6/opal/mca/hwloc/hwloc132/hwloc/src -lm ../../test/support/libsupport.a
/usr/bin/clang -DHAVE_CONFIG_H -I. -I../../opal/include -I../../orte/include -I../../ompi/include -I../../opal/mca/hwloc/hwloc132/hwloc/include/private/autogen -I../../opal/mca/hwloc/hwloc132/hwloc/include/hwloc/autogen "-I../../test/support" -I../.. -D_REENTRANT -I/private/tmp/homebrew-open-mpi-1.6-trJD/openmpi-1.6/opal/mca/hwloc/hwloc132/hwloc/include -I/usr/include/infiniband -I/usr/include/infiniband -DNDEBUG -g -O2 -finline-functions -fno-strict-aliasing -c -o opal_bitmap.o opal_bitmap.c
/bin/sh ../../libtool --tag=CC --mode=link /usr/bin/clang -DNDEBUG -g -O2 -finline-functions -fno-strict-aliasing -export-dynamic -o opal_bitmap opal_bitmap.o ../../opal/libopen-pal.la ../../test/support/libsupport.a
libtool: link: /usr/bin/clang -DNDEBUG -g -O2 -finline-functions -fno-strict-aliasing -o .libs/opal_bitmap opal_bitmap.o ../../opal/.libs/libopen-pal.dylib -L/private/tmp/homebrew-open-mpi-1.6-trJD/openmpi-1.6/opal/mca/hwloc/hwloc132/hwloc/src -lm ../../test/support/libsupport.a
/usr/bin/clang -DHAVE_CONFIG_H -I. -I../../opal/include -I../../orte/include -I../../ompi/include -I../../opal/mca/hwloc/hwloc132/hwloc/include/private/autogen -I../../opal/mca/hwloc/hwloc132/hwloc/include/hwloc/autogen "-I../../test/support" -I../.. -D_REENTRANT -I/private/tmp/homebrew-open-mpi-1.6-trJD/openmpi-1.6/opal/mca/hwloc/hwloc132/hwloc/include -I/usr/include/infiniband -I/usr/include/infiniband -DNDEBUG -g -O2 -finline-functions -fno-strict-aliasing -c -o opal_hash_table.o opal_hash_table.c
/bin/sh ../../libtool --tag=CC --mode=link /usr/bin/clang -DNDEBUG -g -O2 -finline-functions -fno-strict-aliasing -export-dynamic -o opal_hash_table opal_hash_table.o ../../opal/libopen-pal.la ../../test/support/libsupport.a
libtool: link: /usr/bin/clang -DNDEBUG -g -O2 -finline-functions -fno-strict-aliasing -o .libs/opal_hash_table opal_hash_table.o ../../opal/.libs/libopen-pal.dylib -L/private/tmp/homebrew-open-mpi-1.6-trJD/openmpi-1.6/opal/mca/hwloc/hwloc132/hwloc/src -lm ../../test/support/libsupport.a
/usr/bin/clang -DHAVE_CONFIG_H -I. -I../../opal/include -I../../orte/include -I../../ompi/include -I../../opal/mca/hwloc/hwloc132/hwloc/include/private/autogen -I../../opal/mca/hwloc/hwloc132/hwloc/include/hwloc/autogen "-I../../test/support" -I../.. -D_REENTRANT -I/private/tmp/homebrew-open-mpi-1.6-trJD/openmpi-1.6/opal/mca/hwloc/hwloc132/hwloc/include -I/usr/include/infiniband -I/usr/include/infiniband -DNDEBUG -g -O2 -finline-functions -fno-strict-aliasing -c -o opal_list.o opal_list.c
/bin/sh ../../libtool --tag=CC --mode=link /usr/bin/clang -DNDEBUG -g -O2 -finline-functions -fno-strict-aliasing -export-dynamic -o opal_list opal_list.o ../../opal/libopen-pal.la ../../test/support/libsupport.a
libtool: link: /usr/bin/clang -DNDEBUG -g -O2 -finline-functions -fno-strict-aliasing -o .libs/opal_list opal_list.o ../../opal/.libs/libopen-pal.dylib -L/private/tmp/homebrew-open-mpi-1.6-trJD/openmpi-1.6/opal/mca/hwloc/hwloc132/hwloc/src -lm ../../test/support/libsupport.a
/usr/bin/clang -DHAVE_CONFIG_H -I. -I../../opal/include -I../../orte/include -I../../ompi/include -I../../opal/mca/hwloc/hwloc132/hwloc/include/private/autogen -I../../opal/mca/hwloc/hwloc132/hwloc/include/hwloc/autogen "-I../../test/support" -I../.. -D_REENTRANT -I/private/tmp/homebrew-open-mpi-1.6-trJD/openmpi-1.6/opal/mca/hwloc/hwloc132/hwloc/include -I/usr/include/infiniband -I/usr/include/infiniband -DNDEBUG -g -O2 -finline-functions -fno-strict-aliasing -c -o opal_value_array.o opal_value_array.c
/bin/sh ../../libtool --tag=CC --mode=link /usr/bin/clang -DNDEBUG -g -O2 -finline-functions -fno-strict-aliasing -export-dynamic -o opal_value_array opal_value_array.o ../../opal/libopen-pal.la ../../test/support/libsupport.a
libtool: link: /usr/bin/clang -DNDEBUG -g -O2 -finline-functions -fno-strict-aliasing -o .libs/opal_value_array opal_value_array.o ../../opal/.libs/libopen-pal.dylib -L/private/tmp/homebrew-open-mpi-1.6-trJD/openmpi-1.6/opal/mca/hwloc/hwloc132/hwloc/src -lm ../../test/support/libsupport.a
/usr/bin/clang -DHAVE_CONFIG_H -I. -I../../opal/include -I../../orte/include -I../../ompi/include -I../../opal/mca/hwloc/hwloc132/hwloc/include/private/autogen -I../../opal/mca/hwloc/hwloc132/hwloc/include/hwloc/autogen "-I../../test/support" -I../.. -D_REENTRANT -I/private/tmp/homebrew-open-mpi-1.6-trJD/openmpi-1.6/opal/mca/hwloc/hwloc132/hwloc/include -I/usr/include/infiniband -I/usr/include/infiniband -DNDEBUG -g -O2 -finline-functions -fno-strict-aliasing -c -o opal_pointer_array.o opal_pointer_array.c
/bin/sh ../../libtool --tag=CC --mode=link /usr/bin/clang -DNDEBUG -g -O2 -finline-functions -fno-strict-aliasing -export-dynamic -o opal_pointer_array opal_pointer_array.o ../../opal/libopen-pal.la ../../test/support/libsupport.a
libtool: link: /usr/bin/clang -DNDEBUG -g -O2 -finline-functions -fno-strict-aliasing -o .libs/opal_pointer_array opal_pointer_array.o ../../opal/.libs/libopen-pal.dylib -L/private/tmp/homebrew-open-mpi-1.6-trJD/openmpi-1.6/opal/mca/hwloc/hwloc132/hwloc/src -lm ../../test/support/libsupport.a
make check-TESTS
==================
All 0 tests passed
==================
Making check in threads
make opal_thread opal_condition
/usr/bin/clang -DHAVE_CONFIG_H -I. -I../../opal/include -I../../orte/include -I../../ompi/include -I../../opal/mca/hwloc/hwloc132/hwloc/include/private/autogen -I../../opal/mca/hwloc/hwloc132/hwloc/include/hwloc/autogen -I../../test/support -I../.. -D_REENTRANT -I/private/tmp/homebrew-open-mpi-1.6-trJD/openmpi-1.6/opal/mca/hwloc/hwloc132/hwloc/include -I/usr/include/infiniband -I/usr/include/infiniband -DNDEBUG -g -O2 -finline-functions -fno-strict-aliasing -c -o opal_thread.o opal_thread.c
/bin/sh ../../libtool --tag=CC --mode=link /usr/bin/clang -DNDEBUG -g -O2 -finline-functions -fno-strict-aliasing -lpthread -export-dynamic -o opal_thread opal_thread.o ../../test/support/libsupport.a ../../opal/libopen-pal.la
libtool: link: /usr/bin/clang -DNDEBUG -g -O2 -finline-functions -fno-strict-aliasing -o .libs/opal_thread opal_thread.o -lpthread ../../test/support/libsupport.a ../../opal/.libs/libopen-pal.dylib -L/private/tmp/homebrew-open-mpi-1.6-trJD/openmpi-1.6/opal/mca/hwloc/hwloc132/hwloc/src -lm
/usr/bin/clang -DHAVE_CONFIG_H -I. -I../../opal/include -I../../orte/include -I../../ompi/include -I../../opal/mca/hwloc/hwloc132/hwloc/include/private/autogen -I../../opal/mca/hwloc/hwloc132/hwloc/include/hwloc/autogen -I../../test/support -I../.. -D_REENTRANT -I/private/tmp/homebrew-open-mpi-1.6-trJD/openmpi-1.6/opal/mca/hwloc/hwloc132/hwloc/include -I/usr/include/infiniband -I/usr/include/infiniband -DNDEBUG -g -O2 -finline-functions -fno-strict-aliasing -c -o opal_condition.o opal_condition.c
/bin/sh ../../libtool --tag=CC --mode=link /usr/bin/clang -DNDEBUG -g -O2 -finline-functions -fno-strict-aliasing -lpthread -export-dynamic -o opal_condition opal_condition.o ../../test/support/libsupport.a ../../opal/libopen-pal.la
libtool: link: /usr/bin/clang -DNDEBUG -g -O2 -finline-functions -fno-strict-aliasing -o .libs/opal_condition opal_condition.o -lpthread ../../test/support/libsupport.a ../../opal/.libs/libopen-pal.dylib -L/private/tmp/homebrew-open-mpi-1.6-trJD/openmpi-1.6/opal/mca/hwloc/hwloc132/hwloc/src -lm
make check-TESTS
==================
All 0 tests passed
==================
Making check in datatype
make opal_datatype_test checksum position ddt_test ddt_raw to_self ddt_pack
/usr/bin/clang -DHAVE_CONFIG_H -I. -I../../opal/include -I../../orte/include -I../../ompi/include -I../../opal/mca/hwloc/hwloc132/hwloc/include/private/autogen -I../../opal/mca/hwloc/hwloc132/hwloc/include/hwloc/autogen -I../.. -D_REENTRANT -I/private/tmp/homebrew-open-mpi-1.6-trJD/openmpi-1.6/opal/mca/hwloc/hwloc132/hwloc/include -I/usr/include/infiniband -I/usr/include/infiniband -DNDEBUG -g -O2 -finline-functions -fno-strict-aliasing -c -o opal_datatype_test.o opal_datatype_test.c
opal_datatype_test.c:431:9: warning: assigning to 'opal_datatype_t *' (aka 'struct opal_datatype_t *') from 'const opal_datatype_t *'
(aka 'const struct opal_datatype_t *') discards qualifiers [-Wincompatible-pointer-types]
pdt = &opal_datatype_float8;
^ ~~~~~~~~~~~~~~~~~~~~~
opal_datatype_test.c:533:37: warning: passing 'const opal_datatype_t *' (aka 'const struct opal_datatype_t *') to parameter of type 'opal_datatype_t *'
(aka 'struct opal_datatype_t *') discards qualifiers [-Wincompatible-pointer-types]
pdt1 = test_create_blacs_type1( &opal_datatype_int4 );
^~~~~~~~~~~~~~~~~~~
./opal_ddt_lib.h:45:67: note: passing argument to parameter 'base_type' here
extern opal_datatype_t* test_create_blacs_type1( opal_datatype_t* base_type );
^
opal_datatype_test.c:534:37: warning: passing 'const opal_datatype_t *' (aka 'const struct opal_datatype_t *') to parameter of type 'opal_datatype_t *'
(aka 'struct opal_datatype_t *') discards qualifiers [-Wincompatible-pointer-types]
pdt2 = test_create_blacs_type2( &opal_datatype_int4 );
^~~~~~~~~~~~~~~~~~~
./opal_ddt_lib.h:46:67: note: passing argument to parameter 'base_type' here
extern opal_datatype_t* test_create_blacs_type2( opal_datatype_t* base_type );
^
3 warnings generated.
/usr/bin/clang -DHAVE_CONFIG_H -I. -I../../opal/include -I../../orte/include -I../../ompi/include -I../../opal/mca/hwloc/hwloc132/hwloc/include/private/autogen -I../../opal/mca/hwloc/hwloc132/hwloc/include/hwloc/autogen -I../.. -D_REENTRANT -I/private/tmp/homebrew-open-mpi-1.6-trJD/openmpi-1.6/opal/mca/hwloc/hwloc132/hwloc/include -I/usr/include/infiniband -I/usr/include/infiniband -DNDEBUG -g -O2 -finline-functions -fno-strict-aliasing -c -o opal_ddt_lib.o opal_ddt_lib.c
opal_ddt_lib.c:155:52: warning: passing 'const opal_datatype_t *[3]' to parameter of type 'opal_datatype_t *const *' (aka 'struct opal_datatype_t *const *')
discards qualifiers in nested pointer types [-Wincompatible-pointer-types]
opal_datatype_create_struct( 3, lengths, disp, types, &pdt );
^~~~~
opal_ddt_lib.c:37:70: note: passing argument to parameter 'pTypes' here
opal_datatype_t* const * pTypes, opal_datatype_t** newType );
^
opal_ddt_lib.c:772:4: warning: array index of '2' indexes past the end of an array (that contains 2 elements) [-Warray-bounds]
blocklen[2] = 1;
^ ~
opal_ddt_lib.c:764:4: note: array 'blocklen' declared here
int blocklen[2], err = 0, idisp[3];
^
2 warnings generated.
/bin/sh ../../libtool --tag=CC --mode=link /usr/bin/clang -DNDEBUG -g -O2 -finline-functions -fno-strict-aliasing -export-dynamic -o opal_datatype_test opal_datatype_test.o opal_ddt_lib.o ../../opal/libopen-pal.la
libtool: link: /usr/bin/clang -DNDEBUG -g -O2 -finline-functions -fno-strict-aliasing -o .libs/opal_datatype_test opal_datatype_test.o opal_ddt_lib.o ../../opal/.libs/libopen-pal.dylib -L/private/tmp/homebrew-open-mpi-1.6-trJD/openmpi-1.6/opal/mca/hwloc/hwloc132/hwloc/src -lm
/usr/bin/clang -DHAVE_CONFIG_H -I. -I../../opal/include -I../../orte/include -I../../ompi/include -I../../opal/mca/hwloc/hwloc132/hwloc/include/private/autogen -I../../opal/mca/hwloc/hwloc132/hwloc/include/hwloc/autogen -I../.. -D_REENTRANT -I/private/tmp/homebrew-open-mpi-1.6-trJD/openmpi-1.6/opal/mca/hwloc/hwloc132/hwloc/include -I/usr/include/infiniband -I/usr/include/infiniband -DNDEBUG -g -O2 -finline-functions -fno-strict-aliasing -c -o checksum.o checksum.c
/bin/sh ../../libtool --tag=CC --mode=link /usr/bin/clang -DNDEBUG -g -O2 -finline-functions -fno-strict-aliasing -export-dynamic -o checksum checksum.o ../../ompi/libmpi.la
libtool: link: /usr/bin/clang -DNDEBUG -g -O2 -finline-functions -fno-strict-aliasing -o .libs/checksum checksum.o ../../ompi/.libs/libmpi.dylib -L/private/tmp/homebrew-open-mpi-1.6-trJD/openmpi-1.6/opal/mca/hwloc/hwloc132/hwloc/src -lm
/usr/bin/clang -DHAVE_CONFIG_H -I. -I../../opal/include -I../../orte/include -I../../ompi/include -I../../opal/mca/hwloc/hwloc132/hwloc/include/private/autogen -I../../opal/mca/hwloc/hwloc132/hwloc/include/hwloc/autogen -I../.. -D_REENTRANT -I/private/tmp/homebrew-open-mpi-1.6-trJD/openmpi-1.6/opal/mca/hwloc/hwloc132/hwloc/include -I/usr/include/infiniband -I/usr/include/infiniband -DNDEBUG -g -O2 -finline-functions -fno-strict-aliasing -c -o position.o position.c
/bin/sh ../../libtool --tag=CC --mode=link /usr/bin/clang -DNDEBUG -g -O2 -finline-functions -fno-strict-aliasing -export-dynamic -o position position.o ../../ompi/libmpi.la
libtool: link: /usr/bin/clang -DNDEBUG -g -O2 -finline-functions -fno-strict-aliasing -o .libs/position position.o ../../ompi/.libs/libmpi.dylib -L/private/tmp/homebrew-open-mpi-1.6-trJD/openmpi-1.6/opal/mca/hwloc/hwloc132/hwloc/src -lm
/usr/bin/clang -DHAVE_CONFIG_H -I. -I../../opal/include -I../../orte/include -I../../ompi/include -I../../opal/mca/hwloc/hwloc132/hwloc/include/private/autogen -I../../opal/mca/hwloc/hwloc132/hwloc/include/hwloc/autogen -I../.. -D_REENTRANT -I/private/tmp/homebrew-open-mpi-1.6-trJD/openmpi-1.6/opal/mca/hwloc/hwloc132/hwloc/include -I/usr/include/infiniband -I/usr/include/infiniband -DNDEBUG -g -O2 -finline-functions -fno-strict-aliasing -c -o ddt_test.o ddt_test.c
/usr/bin/clang -DHAVE_CONFIG_H -I. -I../../opal/include -I../../orte/include -I../../ompi/include -I../../opal/mca/hwloc/hwloc132/hwloc/include/private/autogen -I../../opal/mca/hwloc/hwloc132/hwloc/include/hwloc/autogen -I../.. -D_REENTRANT -I/private/tmp/homebrew-open-mpi-1.6-trJD/openmpi-1.6/opal/mca/hwloc/hwloc132/hwloc/include -I/usr/include/infiniband -I/usr/include/infiniband -DNDEBUG -g -O2 -finline-functions -fno-strict-aliasing -c -o ddt_lib.o ddt_lib.c
ddt_lib.c:220:4: warning: array index of '2' indexes past the end of an array (that contains 2 elements) [-Warray-bounds]
blocklen[2] = 1;
^ ~
ddt_lib.c:212:4: note: array 'blocklen' declared here
int blocklen[2], err = 0, idisp[3];
^
1 warning generated.
/bin/sh ../../libtool --tag=CC --mode=link /usr/bin/clang -DNDEBUG -g -O2 -finline-functions -fno-strict-aliasing -export-dynamic -o ddt_test ddt_test.o ddt_lib.o ../../ompi/libmpi.la
libtool: link: /usr/bin/clang -DNDEBUG -g -O2 -finline-functions -fno-strict-aliasing -o .libs/ddt_test ddt_test.o ddt_lib.o ../../ompi/.libs/libmpi.dylib -L/private/tmp/homebrew-open-mpi-1.6-trJD/openmpi-1.6/opal/mca/hwloc/hwloc132/hwloc/src -lm
/usr/bin/clang -DHAVE_CONFIG_H -I. -I../../opal/include -I../../orte/include -I../../ompi/include -I../../opal/mca/hwloc/hwloc132/hwloc/include/private/autogen -I../../opal/mca/hwloc/hwloc132/hwloc/include/hwloc/autogen -I../.. -D_REENTRANT -I/private/tmp/homebrew-open-mpi-1.6-trJD/openmpi-1.6/opal/mca/hwloc/hwloc132/hwloc/include -I/usr/include/infiniband -I/usr/include/infiniband -DNDEBUG -g -O2 -finline-functions -fno-strict-aliasing -c -o ddt_raw.o ddt_raw.c
/bin/sh ../../libtool --tag=CC --mode=link /usr/bin/clang -DNDEBUG -g -O2 -finline-functions -fno-strict-aliasing -export-dynamic -o ddt_raw ddt_raw.o ddt_lib.o ../../ompi/libmpi.la
libtool: link: /usr/bin/clang -DNDEBUG -g -O2 -finline-functions -fno-strict-aliasing -o .libs/ddt_raw ddt_raw.o ddt_lib.o ../../ompi/.libs/libmpi.dylib -L/private/tmp/homebrew-open-mpi-1.6-trJD/openmpi-1.6/opal/mca/hwloc/hwloc132/hwloc/src -lm
/usr/bin/clang -DHAVE_CONFIG_H -I. -I../../opal/include -I../../orte/include -I../../ompi/include -I../../opal/mca/hwloc/hwloc132/hwloc/include/private/autogen -I../../opal/mca/hwloc/hwloc132/hwloc/include/hwloc/autogen -I../.. -D_REENTRANT -I/private/tmp/homebrew-open-mpi-1.6-trJD/openmpi-1.6/opal/mca/hwloc/hwloc132/hwloc/include -I/usr/include/infiniband -I/usr/include/infiniband -DNDEBUG -g -O2 -finline-functions -fno-strict-aliasing -c -o to_self.o to_self.c
/bin/sh ../../libtool --tag=CC --mode=link /usr/bin/clang -DNDEBUG -g -O2 -finline-functions -fno-strict-aliasing -export-dynamic -o to_self to_self.o ../../ompi/libmpi.la
libtool: link: /usr/bin/clang -DNDEBUG -g -O2 -finline-functions -fno-strict-aliasing -o .libs/to_self to_self.o ../../ompi/.libs/libmpi.dylib -L/private/tmp/homebrew-open-mpi-1.6-trJD/openmpi-1.6/opal/mca/hwloc/hwloc132/hwloc/src -lm
/usr/bin/clang -DHAVE_CONFIG_H -I. -I../../opal/include -I../../orte/include -I../../ompi/include -I../../opal/mca/hwloc/hwloc132/hwloc/include/private/autogen -I../../opal/mca/hwloc/hwloc132/hwloc/include/hwloc/autogen -I../.. -D_REENTRANT -I/private/tmp/homebrew-open-mpi-1.6-trJD/openmpi-1.6/opal/mca/hwloc/hwloc132/hwloc/include -I/usr/include/infiniband -I/usr/include/infiniband -DNDEBUG -g -O2 -finline-functions -fno-strict-aliasing -c -o ddt_pack.o ddt_pack.c
/bin/sh ../../libtool --tag=CC --mode=link /usr/bin/clang -DNDEBUG -g -O2 -finline-functions -fno-strict-aliasing -export-dynamic -o ddt_pack ddt_pack.o ../../ompi/libmpi.la
libtool: link: /usr/bin/clang -DNDEBUG -g -O2 -finline-functions -fno-strict-aliasing -o .libs/ddt_pack ddt_pack.o ../../ompi/.libs/libmpi.dylib -L/private/tmp/homebrew-open-mpi-1.6-trJD/openmpi-1.6/opal/mca/hwloc/hwloc132/hwloc/src -lm
make check-TESTS
 
 
#
* TEST CREATE CONTIGUOUS
#
 
 
 
#
* TEST STRANGE DATATYPE
#
 
 
Strange datatype BEFORE COMMIT
 
Strange datatype AFTER COMMIT
 
 
#
* TEST UPPER TRIANGULAR MATRIX (size 100)
#
 
Example 3.26 type1 correct
Example 3.26 type1 correct
Example 3.26 type2 correct
type3 correct
hindexed ok
indexed ok
hvector ok
vector ok
/bin/sh: line 1: 80901 Abort trap: 6 ${dir}$tst
FAIL: opal_datatype_test
contiguous checksum 7b05ddd7
packed checksum 7b05ddd7
sparse checksum 7b05ddd7
COOL the 3 checksum match
manual checksum 7b05ddd7
PASS: checksum
Found 0 errors
PASS: position
 
 
#
* TEST INVERSED VECTOR
#
 
direct local copy in 8 microsec
copying same data-type using convertors in 21 microsec
unpack in 13 microsec [pack in 8 microsec]
 
 
#
* TEST STRANGE DATATYPE
#
 
 
Strange datatype BEFORE COMMIT
 
Strange datatype AFTER COMMIT
direct local copy in 3 microsec
copying same data-type using convertors in 9 microsec
unpack in 5 microsec [pack in 4 microsec]
 
 
#
* TEST UPPER TRIANGULAR MATRIX (size 100)
#
 
direct local copy in 5 microsec
copying same data-type using convertors in 164 microsec
unpack in 80 microsec [pack in 84 microsec]
Example 3.26 type1 correct
Example 3.26 type1 correct
Example 3.26 type2 correct
type3 correct
hindexed ok
indexed ok
hvector ok
vector ok
/bin/sh: line 1: 80952 Abort trap: 6 ${dir}$tst
FAIL: ddt_test
 
 
#
* TEST INVERSED VECTOR
#
 
raw extraction in 8 microsec
 
 
#
* TEST STRANGE DATATYPE
#
 
 
Strange datatype BEFORE COMMIT
 
Strange datatype AFTER COMMIT
raw extraction in 2 microsec
 
 
#
* TEST UPPER TRIANGULAR MATRIX (size 100)
#
 
raw extraction in 1 microsec
Example 3.26 type1 correct
Example 3.26 type1 correct
Example 3.26 type2 correct
type3 correct
hindexed ok
indexed ok
hvector ok
vector ok
/bin/sh: line 1: 80970 Abort trap: 6 ${dir}$tst
FAIL: ddt_raw
========================================================
3 of 5 tests failed
Please report to http://www.open-mpi.org/community/help/
========================================================
make[3]: *** [check-TESTS] Error 1
make[2]: *** [check-am] Error 2
make[1]: *** [check-recursive] Error 1
make: *** [check-recursive] Error 1

Please sign in to comment on this gist.

Something went wrong with that request. Please try again.