Skip to content

Embed URL

HTTPS clone URL

Subversion checkout URL

You can clone with
or
.
Download ZIP
make check
Making check in config
make[1]: Nothing to be done for `check'.
Making check in contrib
make[1]: Nothing to be done for `check'.
Making check in opal
Making check in include
make[2]: Nothing to be done for `check'.
Making check in libltdl
make check-am
make[3]: Nothing to be done for `check-am'.
Making check in asm
make[2]: Nothing to be done for `check'.
Making check in datatype
make[2]: Nothing to be done for `check'.
Making check in etc
make[2]: Nothing to be done for `check'.
Making check in event
Making check in compat
Making check in sys
make[4]: Nothing to be done for `check'.
make[4]: Nothing to be done for `check-am'.
make[3]: Nothing to be done for `check-am'.
Making check in util
Making check in keyval
make[3]: Nothing to be done for `check'.
make[3]: Nothing to be done for `check-am'.
Making check in mca/base
make[2]: Nothing to be done for `check'.
Making check in mca/backtrace
make[2]: Nothing to be done for `check'.
Making check in mca/carto
make[2]: Nothing to be done for `check'.
Making check in mca/crs
make[2]: Nothing to be done for `check'.
Making check in mca/hwloc
make[2]: Nothing to be done for `check'.
Making check in mca/installdirs
make[2]: Nothing to be done for `check'.
Making check in mca/maffinity
make[2]: Nothing to be done for `check'.
Making check in mca/memchecker
make[2]: Nothing to be done for `check'.
Making check in mca/memcpy
make[2]: Nothing to be done for `check'.
Making check in mca/memory
make[2]: Nothing to be done for `check'.
Making check in mca/paffinity
make[2]: Nothing to be done for `check'.
Making check in mca/pstat
make[2]: Nothing to be done for `check'.
Making check in mca/shmem
make[2]: Nothing to be done for `check'.
Making check in mca/sysinfo
make[2]: Nothing to be done for `check'.
Making check in mca/timer
make[2]: Nothing to be done for `check'.
Making check in mca/backtrace/execinfo
make[2]: Nothing to be done for `check'.
Making check in mca/hwloc/hwloc132
Making check in hwloc
Making check in src
make[4]: Nothing to be done for `check'.
Making check in include
make[4]: Nothing to be done for `check'.
make[4]: Nothing to be done for `check-am'.
make[3]: Nothing to be done for `check-am'.
Making check in mca/installdirs/env
make[2]: Nothing to be done for `check'.
Making check in mca/installdirs/config
make[2]: Nothing to be done for `check'.
Making check in mca/timer/darwin
make[2]: Nothing to be done for `check'.
Making check in .
make[2]: Nothing to be done for `check-am'.
Making check in mca/carto/auto_detect
make[2]: Nothing to be done for `check'.
Making check in mca/carto/file
make[2]: Nothing to be done for `check'.
Making check in mca/crs/none
make[2]: Nothing to be done for `check'.
Making check in mca/maffinity/first_use
make[2]: Nothing to be done for `check'.
Making check in mca/maffinity/hwloc
make[2]: Nothing to be done for `check'.
Making check in mca/paffinity/hwloc
make[2]: Nothing to be done for `check'.
Making check in mca/pstat/darwin
make[2]: Nothing to be done for `check'.
Making check in mca/shmem/mmap
make[2]: Nothing to be done for `check'.
Making check in mca/shmem/posix
make[2]: Nothing to be done for `check'.
Making check in mca/shmem/sysv
make[2]: Nothing to be done for `check'.
Making check in mca/sysinfo/darwin
make[2]: Nothing to be done for `check'.
Making check in tools/wrappers
make[2]: Nothing to be done for `check'.
Making check in orte
Making check in include
make[2]: Nothing to be done for `check'.
Making check in mca/errmgr
make[2]: Nothing to be done for `check'.
Making check in mca/ess
make[2]: Nothing to be done for `check'.
Making check in mca/filem
make[2]: Nothing to be done for `check'.
Making check in mca/grpcomm
make[2]: Nothing to be done for `check'.
Making check in mca/iof
make[2]: Nothing to be done for `check'.
Making check in mca/notifier
make[2]: Nothing to be done for `check'.
Making check in mca/odls
make[2]: Nothing to be done for `check'.
Making check in mca/oob
make[2]: Nothing to be done for `check'.
Making check in mca/plm
make[2]: Nothing to be done for `check'.
Making check in mca/ras
make[2]: Nothing to be done for `check'.
Making check in mca/rmaps
make[2]: Nothing to be done for `check'.
Making check in mca/rml
make[2]: Nothing to be done for `check'.
Making check in mca/routed
make[2]: Nothing to be done for `check'.
Making check in mca/snapc
make[2]: Nothing to be done for `check'.
Making check in etc
make[2]: Nothing to be done for `check'.
Making check in .
make[2]: Nothing to be done for `check-am'.
Making check in mca/errmgr/default
make[2]: Nothing to be done for `check'.
Making check in mca/ess/env
make[2]: Nothing to be done for `check'.
Making check in mca/ess/hnp
make[2]: Nothing to be done for `check'.
Making check in mca/ess/singleton
make[2]: Nothing to be done for `check'.
Making check in mca/ess/slave
make[2]: Nothing to be done for `check'.
Making check in mca/ess/slurm
make[2]: Nothing to be done for `check'.
Making check in mca/ess/slurmd
make[2]: Nothing to be done for `check'.
Making check in mca/ess/tool
make[2]: Nothing to be done for `check'.
Making check in mca/filem/rsh
make[2]: Nothing to be done for `check'.
Making check in mca/grpcomm/bad
make[2]: Nothing to be done for `check'.
Making check in mca/grpcomm/basic
make[2]: Nothing to be done for `check'.
Making check in mca/grpcomm/hier
make[2]: Nothing to be done for `check'.
Making check in mca/iof/hnp
make[2]: Nothing to be done for `check'.
Making check in mca/iof/orted
make[2]: Nothing to be done for `check'.
Making check in mca/iof/tool
make[2]: Nothing to be done for `check'.
Making check in mca/notifier/command
make[2]: Nothing to be done for `check'.
Making check in mca/notifier/syslog
make[2]: Nothing to be done for `check'.
Making check in mca/odls/default
make[2]: Nothing to be done for `check'.
Making check in mca/oob/tcp
make[2]: Nothing to be done for `check'.
Making check in mca/plm/rsh
make[2]: Nothing to be done for `check'.
Making check in mca/plm/slurm
make[2]: Nothing to be done for `check'.
Making check in mca/ras/cm
make[2]: Nothing to be done for `check'.
Making check in mca/ras/slurm
make[2]: Nothing to be done for `check'.
Making check in mca/rmaps/load_balance
make[2]: Nothing to be done for `check'.
Making check in mca/rmaps/rank_file
make[2]: Nothing to be done for `check'.
Making check in mca/rmaps/resilient
make[2]: Nothing to be done for `check'.
Making check in mca/rmaps/round_robin
make[2]: Nothing to be done for `check'.
Making check in mca/rmaps/seq
make[2]: Nothing to be done for `check'.
Making check in mca/rmaps/topo
make[2]: Nothing to be done for `check'.
Making check in mca/rml/oob
make[2]: Nothing to be done for `check'.
Making check in mca/routed/binomial
make[2]: Nothing to be done for `check'.
Making check in mca/routed/cm
make[2]: Nothing to be done for `check'.
Making check in mca/routed/direct
make[2]: Nothing to be done for `check'.
Making check in mca/routed/linear
make[2]: Nothing to be done for `check'.
Making check in mca/routed/radix
make[2]: Nothing to be done for `check'.
Making check in mca/routed/slave
make[2]: Nothing to be done for `check'.
Making check in tools/orte-bootproxy
make[2]: Nothing to be done for `check'.
Making check in tools/orte-checkpoint
make[2]: Nothing to be done for `check'.
Making check in tools/orte-clean
make[2]: Nothing to be done for `check'.
Making check in tools/orte-iof
make[2]: Nothing to be done for `check'.
Making check in tools/orte-ps
make[2]: Nothing to be done for `check'.
Making check in tools/orte-restart
make[2]: Nothing to be done for `check'.
Making check in tools/orted
make[2]: Nothing to be done for `check'.
Making check in tools/orterun
make[2]: Nothing to be done for `check'.
Making check in tools/wrappers
make[2]: Nothing to be done for `check'.
Making check in tools/orte-top
make[2]: Nothing to be done for `check'.
Making check in ompi
Making check in include
make[2]: Nothing to be done for `check'.
Making check in datatype
make[2]: Nothing to be done for `check'.
Making check in debuggers
make predefined_gap_test dlopen_test
CC predefined_gap_test.o
CC dlopen_test-dlopen_test.o
CCLD dlopen_test
CCLD predefined_gap_test
make check-TESTS
ompi_predefined_communicator_t = 1024 bytes
ompi_communicator_t = 560 bytes
c_base = 0, 16
c_lock = 16, 88
c_name = 104, 64
c_contextid = 168, 4
c_my_rank = 172, 4
c_flags = 176, 4
c_id_available = 180, 4
c_id_start_index = 184, 4
c_remote_group = 200, 8
c_local_comm = 208, 8
c_keyhash = 216, 8
c_cube_dim = 224, 4
c_topo_component = 232, 8 ***
c_topo = 240, 8
c_topo_comm = 248, 8
c_topo_module = 256, 8
c_f_to_c_index = 264, 4
c_peruse_handles = 272, 8 ***
error_handler = 280, 8
errhandler_type = 288, 4
c_pml_comm = 296, 8 ***
c_coll = 304, 256
=============================================
ompi_predefined_group_t = 256 bytes
ompi_group_t = 72 bytes
grp_proc_count = 16, 4
grp_my_rank = 20, 4
grp_f_to_c_index = 24, 4
grp_proc_pointers = 32, 8 ***
grp_flags = 40, 4
grp_parent_group_ptr = 48, 8 ***
=============================================
ompi_predefined_request_t = 256 bytes
ompi_request_t = 136 bytes
super = 0, 56
req_type = 56, 4
req_status = 64, 24 ***
req_complete = 88, 1
req_state = 92, 4 ***
req_persistent = 96, 1
req_f_to_c_index = 100, 4 ***
req_free = 104, 8
=============================================
ompi_predefined_op_t = 2048 bytes
ompi_op_t = 1400 bytes
super = 0, 16
o_name = 16, 64
o_flags = 80, 4
o_f_to_c_index = 84, 4
o_func = 88, 656
o_3buff_instrinsic = 744, 656
=============================================
ompi_predefined_datatype_t = 512 bytes
ompi_datatype_t = 448 bytes
=============================================
ompi_predefined_win_t = 512 bytes
ompi_win_t = 248 bytes
w_base = 0, 16
w_lock = 16, 88
w_name = 104, 64
w_group = 168, 8
w_flags = 176, 2
w_keyhash = 184, 8 ***
w_f_to_c_index = 192, 4
error_handler = 200, 8 ***
errhandler_type = 208, 4
w_disp_unit = 212, 4
w_baseptr = 216, 8
w_size = 224, 8
w_mode = 232, 2
w_osc_module = 240, 8 ***
=============================================
ompi_predefined_info_t = 256 bytes
ompi_info_t = 88 bytes
super = 0, 64
i_f_to_c_index = 64, 4
i_lock = 72, 8 ***
i_freed = 80, 1
=============================================
ompi_predefined_file_t = 1536 bytes
ompi_file_t = 768 bytes
super = 0, 16
f_comm = 16, 8
f_filename = 24, 8
f_amode = 32, 4
f_info = 40, 8 ***
f_flags = 48, 4
f_f_to_c_index = 52, 4
error_handler = 56, 8
errhandler_type = 64, 4
f_io_version = 68, 4
f_io_selected_component = 72, 296
f_io_selected_module = 368, 392
f_io_selected_data = 760, 8
PASS: predefined_gap_test
Trying to lt_dlopen file with dladvise_local: ./libompi_dbg_msgq
File opened with dladvise_local, all passed
PASS: dlopen_test
==================
All 2 tests passed
==================
Making check in etc
make[2]: Nothing to be done for `check'.
Making check in mpi/c
Making check in profile
make[3]: Nothing to be done for `check'.
make[3]: Nothing to be done for `check-am'.
Making check in mpiext
make[2]: Nothing to be done for `check'.
Making check in mca/common
make[2]: Nothing to be done for `check'.
Making check in mca/allocator
make[2]: Nothing to be done for `check'.
Making check in mca/bml
make[2]: Nothing to be done for `check'.
Making check in mca/btl
make[2]: Nothing to be done for `check'.
Making check in mca/coll
make[2]: Nothing to be done for `check'.
Making check in mca/crcp
make[2]: Nothing to be done for `check'.
Making check in mca/dpm
make[2]: Nothing to be done for `check'.
Making check in mca/io
make[2]: Nothing to be done for `check'.
Making check in mca/mpool
make[2]: Nothing to be done for `check'.
Making check in mca/mtl
make[2]: Nothing to be done for `check'.
Making check in mca/op
make[2]: Nothing to be done for `check'.
Making check in mca/osc
make[2]: Nothing to be done for `check'.
Making check in mca/pml
make[2]: Nothing to be done for `check'.
Making check in mca/pubsub
make[2]: Nothing to be done for `check'.
Making check in mca/rcache
make[2]: Nothing to be done for `check'.
Making check in mca/topo
make[2]: Nothing to be done for `check'.
Making check in .
make[2]: Nothing to be done for `check-am'.
Making check in mpi/cxx
make[2]: Nothing to be done for `check'.
Making check in mpi/f77
Making check in profile
make[3]: Nothing to be done for `check'.
make[3]: Nothing to be done for `check-am'.
Making check in mpi/f90
make check-recursive
Making check in scripts
make[4]: Nothing to be done for `check'.
make[4]: Nothing to be done for `check-am'.
Making check in mca/common/sm
if test -z "libmca_common_sm.la"; then \
rm -f "libmca_common_sm.la"; \
ln -s "libmca_common_sm_noinst.la" "libmca_common_sm.la"; \
fi
Making check in mca/allocator/basic
make[2]: Nothing to be done for `check'.
Making check in mca/allocator/bucket
make[2]: Nothing to be done for `check'.
Making check in mca/bml/r2
make[2]: Nothing to be done for `check'.
Making check in mca/btl/self
make[2]: Nothing to be done for `check'.
Making check in mca/btl/sm
make[2]: Nothing to be done for `check'.
Making check in mca/btl/tcp
make[2]: Nothing to be done for `check'.
Making check in mca/coll/basic
make[2]: Nothing to be done for `check'.
Making check in mca/coll/hierarch
make[2]: Nothing to be done for `check'.
Making check in mca/coll/inter
make[2]: Nothing to be done for `check'.
Making check in mca/coll/self
make[2]: Nothing to be done for `check'.
Making check in mca/coll/sm
make[2]: Nothing to be done for `check'.
Making check in mca/coll/sync
make[2]: Nothing to be done for `check'.
Making check in mca/coll/tuned
make[2]: Nothing to be done for `check'.
Making check in mca/dpm/orte
make[2]: Nothing to be done for `check'.
Making check in mca/io/romio
Making check in romio
Making check in include
make[4]: Nothing to be done for `check'.
Making check in adio
Making check in common
make[5]: Nothing to be done for `check'.
Making check in include
make[5]: Nothing to be done for `check'.
Making check in ad_nfs
make[5]: Nothing to be done for `check'.
Making check in ad_testfs
make[5]: Nothing to be done for `check'.
Making check in ad_ufs
make[5]: Nothing to be done for `check'.
make[5]: Nothing to be done for `check-am'.
Making check in mpi-io
Making check in glue/openmpi
make[5]: Nothing to be done for `check'.
make[5]: Nothing to be done for `check-am'.
make[4]: Nothing to be done for `check-am'.
make[3]: Nothing to be done for `check-am'.
Making check in mca/mpool/fake
make[2]: Nothing to be done for `check'.
Making check in mca/mpool/rdma
make[2]: Nothing to be done for `check'.
Making check in mca/mpool/sm
make[2]: Nothing to be done for `check'.
Making check in mca/osc/pt2pt
make[2]: Nothing to be done for `check'.
Making check in mca/osc/rdma
make[2]: Nothing to be done for `check'.
Making check in mca/pml/bfo
make[2]: Nothing to be done for `check'.
Making check in mca/pml/cm
make[2]: Nothing to be done for `check'.
Making check in mca/pml/csum
make[2]: Nothing to be done for `check'.
Making check in mca/pml/ob1
make[2]: Nothing to be done for `check'.
Making check in mca/pml/v
Making check in mca/vprotocol
make[3]: Nothing to be done for `check'.
Making check in mca/vprotocol/pessimist
make[3]: Nothing to be done for `check'.
make[3]: Nothing to be done for `check-am'.
Making check in mca/pubsub/orte
make[2]: Nothing to be done for `check'.
Making check in mca/rcache/vma
make[2]: Nothing to be done for `check'.
Making check in mca/topo/unity
make[2]: Nothing to be done for `check'.
Making check in contrib/libompitrace
make[2]: Nothing to be done for `check'.
Making check in contrib/vt
Making check in vt
Making check in extlib
Making check in otf
Making check in vendor/jenkins_hash
make[6]: Nothing to be done for `check'.
Making check in otflib
make[6]: Nothing to be done for `check'.
Making check in otfauxlib
make[6]: Nothing to be done for `check'.
Making check in tools
Making check in otfaux
make[7]: Nothing to be done for `check'.
Making check in otfconfig
make[7]: Nothing to be done for `check'.
Making check in otfdump
make[7]: Nothing to be done for `check'.
Making check in otfinfo
make[7]: Nothing to be done for `check'.
Making check in otfmerge
Making check in .
make[8]: Nothing to be done for `check-am'.
Making check in mpi
make[8]: Nothing to be done for `check'.
Making check in otfprofile
Making check in .
make[8]: Nothing to be done for `check-am'.
Making check in mpi
make[8]: Nothing to be done for `check'.
Making check in otfshrink
make[7]: Nothing to be done for `check'.
Making check in otfcompress
make[7]: Nothing to be done for `check'.
make[7]: Nothing to be done for `check-am'.
Making check in tests
Making check in hello
make otf_hello
CC otf_hello-hello.o
CCLD otf_hello
Making check in generic_streams
make
make[8]: Nothing to be done for `all'.
Making check in generic_streams-mpi
make
make[8]: Nothing to be done for `all'.
Making check in progress
make otf_progress
CC otf_progress-progress.o
CCLD otf_progress
Making check in read_from_buffer
make otf_read_from_buffer
CC otf_read_from_buffer-read_from_buffer.o
CCLD otf_read_from_buffer
make[7]: Nothing to be done for `check-am'.
Making check in docu
make[6]: Nothing to be done for `check'.
make[6]: Nothing to be done for `check-am'.
make[5]: Nothing to be done for `check-am'.
Making check in util
make[4]: Nothing to be done for `check'.
Making check in rfg
make[4]: Nothing to be done for `check'.
Making check in vtlib
make[4]: Nothing to be done for `check'.
Making check in tools
Making check in vtfilter
Making check in .
make[6]: Nothing to be done for `check-am'.
Making check in mpi
make[6]: Nothing to be done for `check'.
Making check in vtrun
make[5]: Nothing to be done for `check'.
Making check in vtsetup
Making check in .
make[6]: Nothing to be done for `check-am'.
Making check in doc
make[6]: Nothing to be done for `check'.
Making check in vtunify
Making check in .
make[6]: Nothing to be done for `check-am'.
Making check in mpi
make[6]: Nothing to be done for `check'.
Making check in vtwrapper
make[5]: Nothing to be done for `check'.
make[5]: Nothing to be done for `check-am'.
Making check in include
make[4]: Nothing to be done for `check'.
Making check in doc
make[4]: Nothing to be done for `check'.
make[4]: Nothing to be done for `check-am'.
Making check in wrappers
make[3]: Nothing to be done for `check'.
make[3]: Nothing to be done for `check-am'.
Making check in tools/ompi_info
make[2]: Nothing to be done for `check'.
Making check in tools/wrappers
make[2]: Nothing to be done for `check'.
Making check in tools/ortetools
make[2]: Nothing to be done for `check'.
Making check in tools/ompi-server
make[2]: Nothing to be done for `check'.
Making check in tools/ompi-probe
make[2]: Nothing to be done for `check'.
Making check in tools/ompi-profiler
make[2]: Nothing to be done for `check'.
Making check in test
Making check in support
make libsupport.a
CC components.o
CC support.o
AR libsupport.a
Making check in asm
make atomic_barrier atomic_barrier_noinline atomic_spinlock atomic_spinlock_noinline atomic_math atomic_math_noinline atomic_cmpset atomic_cmpset_noinline
CC atomic_barrier.o
CC atomic_barrier_noinline-atomic_barrier_noinline.o
CC atomic_spinlock.o
CC atomic_spinlock_noinline-atomic_spinlock_noinline.o
CC atomic_math.o
CC atomic_math_noinline-atomic_math_noinline.o
CC atomic_cmpset.o
CC atomic_cmpset_noinline-atomic_cmpset_noinline.o
CCLD atomic_barrier
CCLD atomic_barrier_noinline
CCLD atomic_spinlock
CCLD atomic_spinlock_noinline
CCLD atomic_math
CCLD atomic_math_noinline
CCLD atomic_cmpset
CCLD atomic_cmpset_noinline
make check-TESTS
--> Testing atomic_barrier
- 1 threads: Passed
- 2 threads: Passed
- 4 threads: Passed
- 5 threads: Passed
- 8 threads: Passed
PASS: atomic_barrier
--> Testing atomic_barrier_noinline
- 1 threads: Passed
- 2 threads: Passed
- 4 threads: Passed
- 5 threads: Passed
- 8 threads: Passed
PASS: atomic_barrier_noinline
--> Testing atomic_spinlock
- 1 threads: Passed
- 2 threads: Passed
- 4 threads: Passed
- 5 threads: Passed
- 8 threads: Passed
PASS: atomic_spinlock
--> Testing atomic_spinlock_noinline
- 1 threads: Passed
- 2 threads: Passed
- 4 threads: Passed
- 5 threads: Passed
- 8 threads: Passed
PASS: atomic_spinlock_noinline
--> Testing atomic_math
- 1 threads: Passed
- 2 threads: Passed
- 4 threads: Passed
- 5 threads: Passed
- 8 threads: Passed
PASS: atomic_math
--> Testing atomic_math_noinline
- 1 threads: Passed
- 2 threads: Passed
- 4 threads: Passed
- 5 threads: Passed
- 8 threads: Passed
PASS: atomic_math_noinline
--> Testing atomic_cmpset
- 1 threads: Passed
- 2 threads: Passed
- 4 threads: Passed
- 5 threads: Passed
- 8 threads: Passed
PASS: atomic_cmpset
--> Testing atomic_cmpset_noinline
- 1 threads: Passed
- 2 threads: Passed
- 4 threads: Passed
- 5 threads: Passed
- 8 threads: Passed
PASS: atomic_cmpset_noinline
==================
All 8 tests passed
==================
Making check in class
make ompi_rb_tree opal_bitmap opal_hash_table opal_list opal_value_array opal_pointer_array
CC ompi_rb_tree.o
CC opal_bitmap.o
CC opal_hash_table.o
CC opal_list.o
CC opal_value_array.o
CC opal_pointer_array.o
CCLD ompi_rb_tree
CCLD opal_bitmap
CCLD opal_hash_table
CCLD opal_list
CCLD opal_value_array
CCLD opal_pointer_array
make check-TESTS
==================
All 0 tests passed
==================
Making check in threads
make opal_thread opal_condition
CC opal_thread.o
CC opal_condition.o
CCLD opal_thread
CCLD opal_condition
make check-TESTS
==================
All 0 tests passed
==================
Making check in datatype
make opal_datatype_test checksum position ddt_test ddt_raw to_self ddt_pack
CC opal_ddt_lib.o
CC opal_datatype_test.o
CC checksum.o
CC position.o
CC ddt_test.o
CC ddt_lib.o
CC ddt_raw.o
CC to_self.o
CC ddt_pack.o
CCLD opal_datatype_test
CCLD position
CCLD checksum
CCLD ddt_test
CCLD ddt_raw
CCLD to_self
CCLD ddt_pack
make check-TESTS
#
* TEST CREATE CONTIGUOUS
#
#
* TEST STRANGE DATATYPE
#
Strange datatype BEFORE COMMIT
Strange datatype AFTER COMMIT
#
* TEST UPPER TRIANGULAR MATRIX (size 100)
#
Example 3.26 type1 correct
Example 3.26 type1 correct
Example 3.26 type2 correct
type3 correct
hindexed ok
indexed ok
hvector ok
vector ok
/bin/sh: line 1: 32207 Abort trap: 6 ${dir}$tst
FAIL: opal_datatype_test
contiguous checksum 431eccff
packed checksum 431eccff
sparse checksum 431eccff
COOL the 3 checksum match
manual checksum 431eccff
PASS: checksum
Found 0 errors
PASS: position
#
* TEST INVERSED VECTOR
#
direct local copy in 7 microsec
copying same data-type using convertors in 19 microsec
unpack in 11 microsec [pack in 8 microsec]
#
* TEST STRANGE DATATYPE
#
Strange datatype BEFORE COMMIT
Strange datatype AFTER COMMIT
direct local copy in 3 microsec
copying same data-type using convertors in 8 microsec
unpack in 5 microsec [pack in 3 microsec]
#
* TEST UPPER TRIANGULAR MATRIX (size 100)
#
direct local copy in 4 microsec
copying same data-type using convertors in 167 microsec
unpack in 90 microsec [pack in 77 microsec]
Example 3.26 type1 correct
Example 3.26 type1 correct
Example 3.26 type2 correct
type3 correct
hindexed ok
indexed ok
hvector ok
vector ok
/bin/sh: line 1: 32259 Abort trap: 6 ${dir}$tst
FAIL: ddt_test
#
* TEST INVERSED VECTOR
#
raw extraction in 7 microsec
#
* TEST STRANGE DATATYPE
#
Strange datatype BEFORE COMMIT
Strange datatype AFTER COMMIT
raw extraction in 3 microsec
#
* TEST UPPER TRIANGULAR MATRIX (size 100)
#
raw extraction in 1 microsec
Example 3.26 type1 correct
Example 3.26 type1 correct
Example 3.26 type2 correct
type3 correct
hindexed ok
indexed ok
hvector ok
vector ok
/bin/sh: line 1: 32277 Abort trap: 6 ${dir}$tst
FAIL: ddt_raw
========================================================
3 of 5 tests failed
Please report to http://www.open-mpi.org/community/help/
========================================================
make[3]: *** [check-TESTS] Error 1
make[2]: *** [check-am] Error 2
make[1]: *** [check-recursive] Error 1
make: *** [check-recursive] Error 1
Error: #<BuildError: Failed executing: make check >
/usr/local/Library/Homebrew/formula.rb:492:in `system'
/usr/local/Library/Formula/open-mpi.rb:42:in `install'
/usr/local/Library/Homebrew/build.rb:102:in `install'
/usr/local/Library/Homebrew/formula.rb:214:in `brew'
/usr/local/Library/Homebrew/formula.rb:519:in `stage'
/usr/local/Library/Homebrew/extend/fileutils.rb:22:in `mktemp'
/usr/local/Library/Homebrew/formula.rb:515:in `stage'
/usr/local/Library/Homebrew/formula.rb:209:in `brew'
/usr/local/Library/Homebrew/build.rb:82:in `install'
/usr/local/Library/Homebrew/build.rb:44
/usr/local/Library/Formula/open-mpi.rb:28
Sign up for free to join this conversation on GitHub. Already have an account? Sign in to comment
Something went wrong with that request. Please try again.