Skip to content

Instantly share code, notes, and snippets.

@Arpit360

Arpit360/Repo35231 Secret

Last active Oct 27, 2015
Embed
What would you like to do?
Last login: Tue Oct 27 14:49:23 on ttys000
mac360-xamarins-Mac-mini:~ mac360xamarin$ xbuild /t:Build ~/Downloads/UnifiedIosBindingProjectWithEnum/UnifiedIosBindingProject1.sln
XBuild Engine Version 12.0
Mono, Version 4.0.5.0
Copyright (C) 2005-2013 Various Mono authors
Build started 10/27/2015 3:45:48 PM.
__________________________________________________
Project "/Users/mac360_xamarin/Downloads/UnifiedIosBindingProjectWithEnum/UnifiedIosBindingProject1.sln" (Build target(s)):
Target ValidateSolutionConfiguration:
Building solution configuration "Debug|Any CPU".
Target Build:
Project "/Users/mac360_xamarin/Downloads/UnifiedIosBindingProjectWithEnum/UnifiedIosBindingProject1/UnifiedIosBindingProject1.csproj" (default target(s)):
Target _CreateGeneratedSourcesDir:
Created directory "obj/Debug/ios/"
Target _CollectBundleResources:
CollectBundleResources Task
BundleResources:
OptimizePropertyLists: False
OptimizePNGs: False
ProjectDir: /Users/mac360_xamarin/Downloads/UnifiedIosBindingProjectWithEnum/UnifiedIosBindingProject1
ResourcePrefix: Resources
Target _CreateEmbeddedResources:
CreateEmbeddedResources Task
BundleResources:
Prefix: monotouch
Target PrepareForBuild:
Configuration: Debug Platform: AnyCPU
Created directory "bin/Debug/"
Target GenerateSatelliteAssemblies:
No input files were specified for target GenerateSatelliteAssemblies, skipping.
Target _GenerateBindings:
BTouchEmitDebugInformation: false
BTouch Task
BTouchToolPath: /Library/Frameworks/Xamarin.iOS.framework/Versions/Current/bin/
BTouchToolExe: btouch-native
AdditionalLibPaths: <null>
AllowUnsafeBlocks: True
ApiDefinitions:
ApiDefinition.cs
BaseLibDll: /Library/Frameworks/Xamarin.iOS.framework/Versions/Current/lib/mono/Xamarin.iOS/Xamarin.iOS.dll
CompilerPath: <null>
CoreSources:
StructsAndEnums.cs
DefineConstants: __MOBILE__;__IOS__;DEBUG;
EmitDebugInformation: False
GeneratedSourcesDir: obj/Debug/ios/
GeneratedSourcesFileList: obj/Debug/ios/sources.list
Namespace: <null>
NativeLibraries: <null>
NoStdLib: False
OutputAssembly: <null>
References:
/Library/Frameworks/Xamarin.iOS.framework/Versions/Current/lib/mono/Xamarin.iOS/System.dll
/Library/Frameworks/Xamarin.iOS.framework/Versions/Current/lib/mono/Xamarin.iOS/Xamarin.iOS.dll
/Library/Frameworks/Xamarin.iOS.framework/Versions/Current/lib/mono/Xamarin.iOS/System.Core.dll
/Library/Frameworks/Xamarin.iOS.framework/Versions/Current/lib/mono/Xamarin.iOS/mscorlib.dll
Resources: <null>
Sources: <null>
Tool /Library/Frameworks/Xamarin.iOS.framework/Versions/Current/bin/btouch-native execution started with arguments: /v /baselib:/Library/Frameworks/Xamarin.iOS.framework/Versions/Current/lib/mono/Xamarin.iOS/Xamarin.iOS.dll /unsafe /d:"__MOBILE__;__IOS__;DEBUG" /Users/mac360_xamarin/Downloads/UnifiedIosBindingProjectWithEnum/UnifiedIosBindingProject1/ApiDefinition.cs /s:/Users/mac360_xamarin/Downloads/UnifiedIosBindingProjectWithEnum/UnifiedIosBindingProject1/StructsAndEnums.cs -r /Library/Frameworks/Xamarin.iOS.framework/Versions/Current/lib/mono/Xamarin.iOS/System.dll -r /Library/Frameworks/Xamarin.iOS.framework/Versions/Current/lib/mono/Xamarin.iOS/Xamarin.iOS.dll -r /Library/Frameworks/Xamarin.iOS.framework/Versions/Current/lib/mono/Xamarin.iOS/System.Core.dll -r /Library/Frameworks/Xamarin.iOS.framework/Versions/Current/lib/mono/Xamarin.iOS/mscorlib.dll /tmpdir:/Users/mac360_xamarin/Downloads/UnifiedIosBindingProjectWithEnum/UnifiedIosBindingProject1/obj/Debug/ios/ /sourceonly:/Users/mac360_xamarin/Downloads/UnifiedIosBindingProjectWithEnum/UnifiedIosBindingProject1/obj/Debug/ios/sources.list
/Library/Frameworks/Xamarin.iOS.framework/Versions/Current/bin/smcs -debug -unsafe -target:library -nowarn:436 -out:'/Users/mac360_xamarin/Downloads/UnifiedIosBindingProjectWithEnum/UnifiedIosBindingProject1/obj/Debug/ios/temp.dll' -r:/Library/Frameworks/Xamarin.iOS.framework/Versions/9.1.0.18/lib/btouch/btouch-native.exe -r:'/Library/Frameworks/Xamarin.iOS.framework/Versions/Current/lib/mono/Xamarin.iOS/System.dll' -r:'/Library/Frameworks/Xamarin.iOS.framework/Versions/Current/lib/mono/Xamarin.iOS/Xamarin.iOS.dll' -r:'/Library/Frameworks/Xamarin.iOS.framework/Versions/Current/lib/mono/Xamarin.iOS/System.Core.dll' -r:'/Library/Frameworks/Xamarin.iOS.framework/Versions/Current/lib/mono/Xamarin.iOS/mscorlib.dll' -unsafe -r:'/Library/Frameworks/Xamarin.iOS.framework/Versions/Current/lib/mono/Xamarin.iOS/Xamarin.iOS.dll' -define:__MOBILE__;__IOS__;DEBUG '/Users/mac360_xamarin/Downloads/UnifiedIosBindingProjectWithEnum/UnifiedIosBindingProject1/ApiDefinition.cs' '/Users/mac360_xamarin/Downloads/UnifiedIosBindingProjectWithEnum/UnifiedIosBindingProject1/StructsAndEnums.cs' -lib:/Library/Frameworks/Xamarin.iOS.framework/Versions/Current/lib/mono/Xamarin.iOS
WARNING: The runtime version supported by this application is unavailable.
Using default runtime: v4.0.30319
Target _CompressFrameworks:
No input files were specified for target _CompressFrameworks, skipping.
Target CoreCompile:
Tool /Library/Frameworks/Xamarin.iOS.framework/Versions/Current/bin/smcs execution started with arguments: /noconfig /debug:full /debug+ /optimize- /out:obj/Debug/UnifiedIosBindingProject1.dll Properties/AssemblyInfo.cs StructsAndEnums.cs /Users/mac360_xamarin/Downloads/UnifiedIosBindingProjectWithEnum/UnifiedIosBindingProject1/obj/Debug/ios/ObjCRuntime/Messaging.g.cs /Users/mac360_xamarin/Downloads/UnifiedIosBindingProjectWithEnum/UnifiedIosBindingProject1/obj/Debug/ios/UnifiedIosBindingProject1/Foo.g.cs obj/Debug/Xamarin.iOS,Version=v1.0.AssemblyAttribute.cs /target:library /unsafe+ /define:"__MOBILE__;__IOS__;DEBUG" /nostdlib /reference:/Library/Frameworks/Xamarin.iOS.framework/Versions/Current/lib/mono/Xamarin.iOS/System.dll /reference:/Library/Frameworks/Xamarin.iOS.framework/Versions/Current/lib/mono/Xamarin.iOS/Xamarin.iOS.dll /reference:/Library/Frameworks/Xamarin.iOS.framework/Versions/Current/lib/mono/Xamarin.iOS/System.Core.dll /reference:/Library/Frameworks/Xamarin.iOS.framework/Versions/Current/lib/mono/Xamarin.iOS/mscorlib.dll /warn:4
/Users/mac360_xamarin/Downloads/UnifiedIosBindingProjectWithEnum/UnifiedIosBindingProject1/obj/Debug/ios/UnifiedIosBindingProject1/Foo.g.cs(37,14): error CS0101: The namespace `UnifiedIosBindingProject1' already contains a definition for `Foo'
StructsAndEnums.cs(5,17): (Location of the symbol related to previous error)
Task "Csc" execution -- FAILED
Done building target "CoreCompile" in project "/Users/mac360_xamarin/Downloads/UnifiedIosBindingProjectWithEnum/UnifiedIosBindingProject1/UnifiedIosBindingProject1.csproj".-- FAILED
Done building project "/Users/mac360_xamarin/Downloads/UnifiedIosBindingProjectWithEnum/UnifiedIosBindingProject1/UnifiedIosBindingProject1.csproj".-- FAILED
Task "MSBuild" execution -- FAILED
Done building target "Build" in project "/Users/mac360_xamarin/Downloads/UnifiedIosBindingProjectWithEnum/UnifiedIosBindingProject1.sln".-- FAILED
Done building project "/Users/mac360_xamarin/Downloads/UnifiedIosBindingProjectWithEnum/UnifiedIosBindingProject1.sln".-- FAILED
Build FAILED.
Errors:
/Users/mac360_xamarin/Downloads/UnifiedIosBindingProjectWithEnum/UnifiedIosBindingProject1.sln (Build) ->
(Build target) ->
/Users/mac360_xamarin/Downloads/UnifiedIosBindingProjectWithEnum/UnifiedIosBindingProject1/UnifiedIosBindingProject1.csproj (default targets) ->
/Library/Frameworks/Mono.framework/Versions/4.0.5/lib/mono/4.5/Microsoft.CSharp.targets (CoreCompile target) ->
/Users/mac360_xamarin/Downloads/UnifiedIosBindingProjectWithEnum/UnifiedIosBindingProject1/obj/Debug/ios/UnifiedIosBindingProject1/Foo.g.cs(37,14): error CS0101: The namespace `UnifiedIosBindingProject1' already contains a definition for `Foo'
0 Warning(s)
1 Error(s)
Time Elapsed 00:00:03.6474390
mac360-xamarins-Mac-mini:~ mac360xamarin$ find obj
find: obj: No such file or directory
mac360-xamarins-Mac-mini:~ mac360xamarin$ cd /Users/mac360_xamarin/Downloads/UnifiedIosBindingProjectWithEnum
mac360-xamarins-Mac-mini:UnifiedIosBindingProjectWithEnum mac360xamarin$ find obj
find: obj: No such file or directory
mac360-xamarins-Mac-mini:UnifiedIosBindingProjectWithEnum mac360xamarin$ find ~/obj
find: /Users/mac360_xamarin/obj: No such file or directory
mac360-xamarins-Mac-mini:UnifiedIosBindingProjectWithEnum mac360xamarin$ cd ..
mac360-xamarins-Mac-mini:Downloads mac360xamarin$ cd UnifiedIosBindingProjectWithEnum
mac360-xamarins-Mac-mini:UnifiedIosBindingProjectWithEnum mac360xamarin$ cd UnifiedIosBindingProject1
mac360-xamarins-Mac-mini:UnifiedIosBindingProject1 mac360xamarin$ find obj
obj
obj/Debug
obj/Debug/ios
obj/Debug/ios/ObjCRuntime
obj/Debug/ios/ObjCRuntime/Messaging.g.cs
obj/Debug/ios/sources.list
obj/Debug/ios/temp.dll
obj/Debug/ios/temp.dll.mdb
obj/Debug/ios/UnifiedIosBindingProject1
obj/Debug/ios/UnifiedIosBindingProject1/Foo.g.cs
obj/Debug/UnifiedIosBindingProject1.csproj.FilesWrittenAbsolute.txt
obj/Debug/Xamarin.iOS,Version=v1.0.AssemblyAttribute.cs
mac360-xamarins-Mac-mini:UnifiedIosBindingProject1 mac360xamarin$
Sign up for free to join this conversation on GitHub. Already have an account? Sign in to comment