Skip to content

Instantly share code, notes, and snippets.

Embed
What would you like to do?
Building Solution: UnifiedTest (Debug|iPhoneSimulator)
Building: UnifiedTest (Debug|iPhoneSimulator)
Build started 2/13/2015 12:05:19 AM.
__________________________________________________
Project "/Users/mac360_xamarin/Desktop/untitled folder/TestProject 2/UnifiedTest/UnifiedTest/UnifiedTest.csproj" (Build target(s)):
Initial Properties:
__CF_USER_TEXT_ENCODING = 0x1F5:0x0:0x0
Apple_PubSub_Socket_Render = /private/tmp/com.apple.launchd.DLHI5ZLMAR/Render
AssemblyName = UnifiedTest
BuildingInsideVisualStudio = true
CodesignEntitlements = Entitlements.plist
CodesignKey = iPhone Developer
COMMAND_MODE = unix2003
Configuration = Debug
ConsolePause = false
DebugSymbols = true
DebugType = full
DefineConstants = DEBUG;__MOBILE__;IOS;AIR_PLUS;SIMULATOR;
DYLD_FALLBACK_LIBRARY_PATH = /Applications/Xamarin Studio.app/Contents/Resources/lib:/Applications/Xamarin Studio.app/Contents/Resources/lib/monodevelop/bin:/Library/Frameworks/Mono.framework/Versions/Current/lib:/lib:/usr/lib:/Library/Developer/CommandLineTools/usr/lib:/usr/local/lib
ErrorReport = prompt
GTK2_RC_FILES = /Applications/Xamarin Studio.app/Contents/Resources/lib/monodevelop/bin/gtkrc.mac-yosemite
HOME = /Users/mac360_xamarin
IPhoneResourcePrefix = Resources
LOGNAME = mac360xamarin
MONO_GAC_PREFIX = /Applications/Xamarin Studio.app/Contents/Resources
MSBuildBinPath = /Library/Frameworks/Mono.framework/Versions/3.12.0/lib/mono/4.5
MSBuildExtensionsPath = /Library/Frameworks/Mono.framework/External/xbuild
MSBuildExtensionsPath32 = /Library/Frameworks/Mono.framework/External/xbuild
MSBuildExtensionsPath64 = /Library/Frameworks/Mono.framework/External/xbuild
MSBuildProjectDefaultTargets = Build
MSBuildProjectDirectory = /Users/mac360_xamarin/Desktop/untitled folder/TestProject 2/UnifiedTest/UnifiedTest
MSBuildProjectExtension = .csproj
MSBuildProjectFile = UnifiedTest.csproj
MSBuildProjectFullPath = /Users/mac360_xamarin/Desktop/untitled folder/TestProject 2/UnifiedTest/UnifiedTest/UnifiedTest.csproj
MSBuildProjectName = UnifiedTest
MSBuildThisFile = UnifiedTest.csproj
MSBuildThisFileDirectory = /Users/mac360_xamarin/Desktop/untitled folder/TestProject 2/UnifiedTest/UnifiedTest/
MSBuildThisFileDirectoryNoRoot = Users/mac360_xamarin/Desktop/untitled folder/TestProject 2/UnifiedTest/UnifiedTest/
MSBuildThisFileExtension = .csproj
MSBuildThisFileFullPath = /Users/mac360_xamarin/Desktop/untitled folder/TestProject 2/UnifiedTest/UnifiedTest/UnifiedTest.csproj
MSBuildThisFileName = UnifiedTest
MSBuildToolsPath = /Library/Frameworks/Mono.framework/Versions/3.12.0/lib/mono/4.5
MSBuildToolsRoot = /Library/Frameworks/Mono.framework/Versions/3.12.0/lib/mono
MSBuildToolsVersion = 4.0
MtouchArch = i386
MtouchDebug = true
MtouchExtraArgs = --registrar:dynamic
MtouchI18n =
Optimize = false
OS = Unix
OutputPath = bin\iPhoneSimulator\Debug
OutputType = Exe
PATH = /Applications/Xamarin Studio.app/Contents/Resources:/Applications/Xamarin Studio.app/Contents/MacOS:/usr/bin:/bin:/usr/sbin:/sbin
PKG_CONFIG_LIBDIR =
PKG_CONFIG_PATH = /Applications/Xamarin Studio.app/Contents/Resources/lib/pkgconfig:/Library/Frameworks/Mono.framework/Versions/3.12.0/share/pkgconfig:/Library/Frameworks/Mono.framework/Versions/3.12.0/lib/pkgconfig
Platform = iPhoneSimulator
ProjectGuid = {FA3B3D6C-173B-49E8-8640-D396349907ED}
ProjectTypeGuids = {FEACFBD2-3405-455C-9665-78FE426C6842};{FAE04EC0-301F-11D3-BF4B-00C04F79EFBC}
RootNamespace = UnifiedTest
SHELL = /bin/bash
SolutionDir = /Users/mac360_xamarin/Desktop/untitled folder/TestProject 2/UnifiedTest/
SolutionFilename = UnifiedTest.sln
SolutionName = UnifiedTest
SolutionPath = /Users/mac360_xamarin/Desktop/untitled folder/TestProject 2/UnifiedTest/UnifiedTest.sln
SSH_AUTH_SOCK = /private/tmp/com.apple.launchd.QL8UL7XRba/Listeners
TMPDIR = /var/folders/vy/9yn4y5ds1zd3t03srnvlvsb80000gn/T/
UseHostCompilerIfAvailable = false
USER = mac360xamarin
WarningLevel = 4
XPC_FLAGS = 0x0
XPC_SERVICE_NAME = com.apple.xpc.launchd.oneshot.0x10000012.XamarinStudio
Initial Items:
/Users/mac360_xamarin/Desktop/untitled folder/TestProject 2/UnifiedTest/UnifiedTest/UnifiedTest.csproj: Importing project /Library/Frameworks/Mono.framework/External/xbuild/Xamarin/iOS/Xamarin.iOS.CSharp.targets from extension path /Library/Frameworks/Mono.framework/External/xbuild
/Library/Frameworks/Mono.framework/External/xbuild/Xamarin/iOS/Xamarin.iOS.CSharp.targets: Importing project /Library/Frameworks/Mono.framework/Versions/3.12.0/lib/mono/4.5/Microsoft.CSharp.targets
/Library/Frameworks/Mono.framework/Versions/3.12.0/lib/mono/4.5/Microsoft.CSharp.targets: Importing project /Library/Frameworks/Mono.framework/Versions/3.12.0/lib/mono/4.5/Microsoft.Common.targets
/Library/Frameworks/Mono.framework/External/xbuild/Xamarin/iOS/Xamarin.iOS.CSharp.targets: Importing project /Library/Frameworks/Mono.framework/External/xbuild/Xamarin/iOS/Xamarin.iOS.Common.targets
/Library/Frameworks/Mono.framework/External/xbuild/Xamarin/iOS/Xamarin.iOS.Common.targets: Importing project /Library/Frameworks/Mono.framework/External/xbuild/Xamarin/iOS/Xamarin.iOS.Common.props from extension path /Library/Frameworks/Mono.framework/External/xbuild
Building target "_ValidateEssentialProperties" in project "/Users/mac360_xamarin/Desktop/untitled folder/TestProject 2/UnifiedTest/UnifiedTest/UnifiedTest.csproj" ("/Library/Frameworks/Mono.framework/Versions/3.12.0/lib/mono/4.5/Microsoft.Common.targets").
Done building target "_ValidateEssentialProperties" in project "/Users/mac360_xamarin/Desktop/untitled folder/TestProject 2/UnifiedTest/UnifiedTest/UnifiedTest.csproj" ("/Library/Frameworks/Mono.framework/Versions/3.12.0/lib/mono/4.5/Microsoft.Common.targets").
Building target "Build" in project "/Users/mac360_xamarin/Desktop/untitled folder/TestProject 2/UnifiedTest/UnifiedTest/UnifiedTest.csproj" ("/Library/Frameworks/Mono.framework/Versions/3.12.0/lib/mono/4.5/Microsoft.Common.targets").
Building target "BuildOnlySettings" in project "/Users/mac360_xamarin/Desktop/untitled folder/TestProject 2/UnifiedTest/UnifiedTest/UnifiedTest.csproj" ("/Library/Frameworks/Mono.framework/Versions/3.12.0/lib/mono/4.5/Microsoft.Common.targets"); "Build" depends on it.
Done building target "BuildOnlySettings" in project "/Users/mac360_xamarin/Desktop/untitled folder/TestProject 2/UnifiedTest/UnifiedTest/UnifiedTest.csproj" ("/Library/Frameworks/Mono.framework/Versions/3.12.0/lib/mono/4.5/Microsoft.Common.targets"); "Build" depends on it.
Building target "PrepareForBuild" in project "/Users/mac360_xamarin/Desktop/untitled folder/TestProject 2/UnifiedTest/UnifiedTest/UnifiedTest.csproj" ("/Library/Frameworks/Mono.framework/Versions/3.12.0/lib/mono/4.5/Microsoft.Common.targets"); "Build" depends on it.
Target PrepareForBuild:
Task "Message"
Using task Message from Microsoft.Build.Tasks.Message, Microsoft.Build.Tasks.v4.0, Version=4.0.0.0, Culture=neutral, PublicKeyToken=b03f5f7f11d50a3a
Configuration: Debug Platform: iPhoneSimulator
Done executing task "Message"
Task "FindAppConfigFile"
Using task FindAppConfigFile from Microsoft.Build.Tasks.FindAppConfigFile, Microsoft.Build.Tasks.v4.0, Version=4.0.0.0, Culture=neutral, PublicKeyToken=b03f5f7f11d50a3a
Done executing task "FindAppConfigFile"
Task "MakeDir"
Using task MakeDir from Microsoft.Build.Tasks.MakeDir, Microsoft.Build.Tasks.v4.0, Version=4.0.0.0, Culture=neutral, PublicKeyToken=b03f5f7f11d50a3a
Created directory "obj/iPhoneSimulator/Debug/"
Done executing task "MakeDir"
Done building target "PrepareForBuild" in project "/Users/mac360_xamarin/Desktop/untitled folder/TestProject 2/UnifiedTest/UnifiedTest/UnifiedTest.csproj".
Done building target "PrepareForBuild" in project "/Users/mac360_xamarin/Desktop/untitled folder/TestProject 2/UnifiedTest/UnifiedTest/UnifiedTest.csproj" ("/Library/Frameworks/Mono.framework/Versions/3.12.0/lib/mono/4.5/Microsoft.Common.targets"); "Build" depends on it.
Building target "_CollectBundleResources" in project "/Users/mac360_xamarin/Desktop/untitled folder/TestProject 2/UnifiedTest/UnifiedTest/UnifiedTest.csproj" ("/Library/Frameworks/Mono.framework/External/xbuild/Xamarin/iOS/Xamarin.iOS.Common.targets"); "Build" depends on it.
Building target "_CompileInterfaceDefinitions" in project "/Users/mac360_xamarin/Desktop/untitled folder/TestProject 2/UnifiedTest/UnifiedTest/UnifiedTest.csproj" ("/Library/Frameworks/Mono.framework/External/xbuild/Xamarin/iOS/Xamarin.iOS.Common.targets"); "_CollectBundleResources" depends on it.
Building target "_DetectAppManifest" in project "/Users/mac360_xamarin/Desktop/untitled folder/TestProject 2/UnifiedTest/UnifiedTest/UnifiedTest.csproj" ("/Library/Frameworks/Mono.framework/External/xbuild/Xamarin/iOS/Xamarin.iOS.Common.targets"); "_CompileInterfaceDefinitions" depends on it.
Target _DetectAppManifest:
Task "FindItemWithLogicalNameTask"
Using task FindItemWithLogicalNameTask from Xamarin.MacDev.Tasks.FindItemWithLogicalNameTask, Xamarin.MacDev.Tasks, Version=1.0.5502.17430, Culture=neutral, PublicKeyToken=null
FindItemWithLogicalName Task
Items:
Info.plist
Entitlements.plist
LogicalName: Info.plist
ProjectDir: /Users/mac360_xamarin/Desktop/untitled folder/TestProject 2/UnifiedTest/UnifiedTest
ResourcePrefix: Resources
Info.plist found at: Info.plist
Done executing task "FindItemWithLogicalNameTask"
Done building target "_DetectAppManifest" in project "/Users/mac360_xamarin/Desktop/untitled folder/TestProject 2/UnifiedTest/UnifiedTest/UnifiedTest.csproj".
Done building target "_DetectAppManifest" in project "/Users/mac360_xamarin/Desktop/untitled folder/TestProject 2/UnifiedTest/UnifiedTest/UnifiedTest.csproj" ("/Library/Frameworks/Mono.framework/External/xbuild/Xamarin/iOS/Xamarin.iOS.Common.targets"); "_CompileInterfaceDefinitions" depends on it.
Building target "_DetectSdkLocations" in project "/Users/mac360_xamarin/Desktop/untitled folder/TestProject 2/UnifiedTest/UnifiedTest/UnifiedTest.csproj" ("/Library/Frameworks/Mono.framework/External/xbuild/Xamarin/iOS/Xamarin.iOS.Common.targets"); "_CompileInterfaceDefinitions" depends on it.
Target _DetectSdkLocations:
Task "DetectSdkLocationsTask"
Using task DetectSdkLocationsTask from Xamarin.iOS.Tasks.DetectSdkLocationsTask, Xamarin.iOS.Tasks, Version=0.0.0.0, Culture=neutral, PublicKeyToken=null
DeveloperRoot: /Applications/Xcode.app/Contents/Developer
DevicePlatform: /Applications/Xcode.app/Contents/Developer/Platforms/iPhoneOS.platform
GetPlatformPath: /Applications/Xcode.app/Contents/Developer/Platforms/iPhoneOS.platform
Searching for 'SDK Usr directory' in '/Applications/Xcode.app/Contents/Developer/Platforms/iPhoneSimulator.platform/Developer/SDKs/iPhoneSimulator8.1.sdk/Developer/usr'
Searching for 'SDK bin directory' in '/Applications/Xcode.app/Contents/Developer/Platforms/iPhoneSimulator.platform/Developer/SDKs/iPhoneSimulator8.1.sdk/Developer/usr/bin'
DetectSdkLocations Task
Platform: iPhoneSimulator
SdkVersion: 8.1
XamarinSdkRoot: /Library/Frameworks/Xamarin.iOS.framework/Versions/Current
Done executing task "DetectSdkLocationsTask"
Done building target "_DetectSdkLocations" in project "/Users/mac360_xamarin/Desktop/untitled folder/TestProject 2/UnifiedTest/UnifiedTest/UnifiedTest.csproj".
Done building target "_DetectSdkLocations" in project "/Users/mac360_xamarin/Desktop/untitled folder/TestProject 2/UnifiedTest/UnifiedTest/UnifiedTest.csproj" ("/Library/Frameworks/Mono.framework/External/xbuild/Xamarin/iOS/Xamarin.iOS.Common.targets"); "_CompileInterfaceDefinitions" depends on it.
Building target "_CoreCompileInterfaceDefinitions" in project "/Users/mac360_xamarin/Desktop/untitled folder/TestProject 2/UnifiedTest/UnifiedTest/UnifiedTest.csproj" ("/Library/Frameworks/Mono.framework/External/xbuild/Xamarin/iOS/Xamarin.iOS.Common.targets"); "_CompileInterfaceDefinitions" depends on it.
Target _CoreCompileInterfaceDefinitions:
Task "IBToolTask"
Using task IBToolTask from Xamarin.MacDev.Tasks.IBToolTask, Xamarin.MacDev.Tasks, Version=1.0.5502.17430, Culture=neutral, PublicKeyToken=null
IBTool Task
AppManifest: Info.plist
InterfaceDefinitions:
../../NestedFolder/MainController/DiscoveryViewControlleriPad.xib
IntermediateOutputPath: obj/iPhoneSimulator/Debug/
Platform: iPhoneSimulator
ResourcePrefix: Resources
SdkBinPath: /Applications/Xcode.app/Contents/Developer/Platforms/iPhoneSimulator.platform/Developer/SDKs/iPhoneSimulator8.1.sdk/Developer/usr/bin
SdkRoot: /Applications/Xcode.app/Contents/Developer/Platforms/iPhoneSimulator.platform/Developer/SDKs/iPhoneSimulator8.1.sdk
SdkVersion: 8.1
Done executing task "IBToolTask"
Done building target "_CoreCompileInterfaceDefinitions" in project "/Users/mac360_xamarin/Desktop/untitled folder/TestProject 2/UnifiedTest/UnifiedTest/UnifiedTest.csproj".
Done building target "_CoreCompileInterfaceDefinitions" in project "/Users/mac360_xamarin/Desktop/untitled folder/TestProject 2/UnifiedTest/UnifiedTest/UnifiedTest.csproj" ("/Library/Frameworks/Mono.framework/External/xbuild/Xamarin/iOS/Xamarin.iOS.Common.targets"); "_CompileInterfaceDefinitions" depends on it.
Done building target "_CompileInterfaceDefinitions" in project "/Users/mac360_xamarin/Desktop/untitled folder/TestProject 2/UnifiedTest/UnifiedTest/UnifiedTest.csproj" ("/Library/Frameworks/Mono.framework/External/xbuild/Xamarin/iOS/Xamarin.iOS.Common.targets"); "_CollectBundleResources" depends on it.
Building target "_CompileImageAssets" in project "/Users/mac360_xamarin/Desktop/untitled folder/TestProject 2/UnifiedTest/UnifiedTest/UnifiedTest.csproj" ("/Library/Frameworks/Mono.framework/External/xbuild/Xamarin/iOS/Xamarin.iOS.Common.targets"); "_CollectBundleResources" depends on it.
Building target "_CoreCompileImageAssets" in project "/Users/mac360_xamarin/Desktop/untitled folder/TestProject 2/UnifiedTest/UnifiedTest/UnifiedTest.csproj" ("/Library/Frameworks/Mono.framework/External/xbuild/Xamarin/iOS/Xamarin.iOS.Common.targets"); "_CompileImageAssets" depends on it.
Done building target "_CoreCompileImageAssets" in project "/Users/mac360_xamarin/Desktop/untitled folder/TestProject 2/UnifiedTest/UnifiedTest/UnifiedTest.csproj" ("/Library/Frameworks/Mono.framework/External/xbuild/Xamarin/iOS/Xamarin.iOS.Common.targets"); "_CompileImageAssets" depends on it.
Done building target "_CompileImageAssets" in project "/Users/mac360_xamarin/Desktop/untitled folder/TestProject 2/UnifiedTest/UnifiedTest/UnifiedTest.csproj" ("/Library/Frameworks/Mono.framework/External/xbuild/Xamarin/iOS/Xamarin.iOS.Common.targets"); "_CollectBundleResources" depends on it.
Building target "_CompileColladaAssets" in project "/Users/mac360_xamarin/Desktop/untitled folder/TestProject 2/UnifiedTest/UnifiedTest/UnifiedTest.csproj" ("/Library/Frameworks/Mono.framework/External/xbuild/Xamarin/iOS/Xamarin.iOS.Common.targets"); "_CollectBundleResources" depends on it.
Building target "_CollectColladaAssets" in project "/Users/mac360_xamarin/Desktop/untitled folder/TestProject 2/UnifiedTest/UnifiedTest/UnifiedTest.csproj" ("/Library/Frameworks/Mono.framework/External/xbuild/Xamarin/iOS/Xamarin.iOS.Common.targets"); "_CompileColladaAssets" depends on it.
Target _CollectColladaAssets:
Task "CollectBundleResourcesTask"
Using task CollectBundleResourcesTask from Xamarin.MacDev.Tasks.CollectBundleResourcesTask, Xamarin.MacDev.Tasks, Version=1.0.5502.17430, Culture=neutral, PublicKeyToken=null
CollectBundleResources Task
BundleResources: <null>
OptimizePNGs: False
ProjectDir: /Users/mac360_xamarin/Desktop/untitled folder/TestProject 2/UnifiedTest/UnifiedTest
ResourcePrefix: Resources
Done executing task "CollectBundleResourcesTask"
Done building target "_CollectColladaAssets" in project "/Users/mac360_xamarin/Desktop/untitled folder/TestProject 2/UnifiedTest/UnifiedTest/UnifiedTest.csproj".
Done building target "_CollectColladaAssets" in project "/Users/mac360_xamarin/Desktop/untitled folder/TestProject 2/UnifiedTest/UnifiedTest/UnifiedTest.csproj" ("/Library/Frameworks/Mono.framework/External/xbuild/Xamarin/iOS/Xamarin.iOS.Common.targets"); "_CompileColladaAssets" depends on it.
Building target "_CoreCompileColladaAssets" in project "/Users/mac360_xamarin/Desktop/untitled folder/TestProject 2/UnifiedTest/UnifiedTest/UnifiedTest.csproj" ("/Library/Frameworks/Mono.framework/External/xbuild/Xamarin/iOS/Xamarin.iOS.Common.targets"); "_CompileColladaAssets" depends on it.
Target _CoreCompileColladaAssets:
No input files were specified for target _CoreCompileColladaAssets, skipping.
Done building target "_CoreCompileColladaAssets" in project "/Users/mac360_xamarin/Desktop/untitled folder/TestProject 2/UnifiedTest/UnifiedTest/UnifiedTest.csproj".
Done building target "_CoreCompileColladaAssets" in project "/Users/mac360_xamarin/Desktop/untitled folder/TestProject 2/UnifiedTest/UnifiedTest/UnifiedTest.csproj" ("/Library/Frameworks/Mono.framework/External/xbuild/Xamarin/iOS/Xamarin.iOS.Common.targets"); "_CompileColladaAssets" depends on it.
Done building target "_CompileColladaAssets" in project "/Users/mac360_xamarin/Desktop/untitled folder/TestProject 2/UnifiedTest/UnifiedTest/UnifiedTest.csproj" ("/Library/Frameworks/Mono.framework/External/xbuild/Xamarin/iOS/Xamarin.iOS.Common.targets"); "_CollectBundleResources" depends on it.
Building target "_CompileSceneKitAssets" in project "/Users/mac360_xamarin/Desktop/untitled folder/TestProject 2/UnifiedTest/UnifiedTest/UnifiedTest.csproj" ("/Library/Frameworks/Mono.framework/External/xbuild/Xamarin/iOS/Xamarin.iOS.Common.targets"); "_CollectBundleResources" depends on it.
Building target "_CoreCompileSceneKitAssets" in project "/Users/mac360_xamarin/Desktop/untitled folder/TestProject 2/UnifiedTest/UnifiedTest/UnifiedTest.csproj" ("/Library/Frameworks/Mono.framework/External/xbuild/Xamarin/iOS/Xamarin.iOS.Common.targets"); "_CompileSceneKitAssets" depends on it.
Target _CoreCompileSceneKitAssets:
Task "CompileSceneKitAssetsTask"
Using task CompileSceneKitAssetsTask from Xamarin.iOS.Tasks.CompileSceneKitAssetsTask, Xamarin.iOS.Tasks, Version=0.0.0.0, Culture=neutral, PublicKeyToken=null
CompileSceneKitAssets Task
IntermediateOutputPath: obj/iPhoneSimulator/Debug/
ProjectDir: /Users/mac360_xamarin/Desktop/untitled folder/TestProject 2/UnifiedTest/UnifiedTest
ResourcePrefix: Resources
SceneKitAssets:
SdkDevPath: /Applications/Xcode.app/Contents/Developer
SdkRoot: /Applications/Xcode.app/Contents/Developer/Platforms/iPhoneSimulator.platform/Developer/SDKs/iPhoneSimulator8.1.sdk
SdkVersion: 8.1
Done executing task "CompileSceneKitAssetsTask"
Done building target "_CoreCompileSceneKitAssets" in project "/Users/mac360_xamarin/Desktop/untitled folder/TestProject 2/UnifiedTest/UnifiedTest/UnifiedTest.csproj".
Done building target "_CoreCompileSceneKitAssets" in project "/Users/mac360_xamarin/Desktop/untitled folder/TestProject 2/UnifiedTest/UnifiedTest/UnifiedTest.csproj" ("/Library/Frameworks/Mono.framework/External/xbuild/Xamarin/iOS/Xamarin.iOS.Common.targets"); "_CompileSceneKitAssets" depends on it.
Done building target "_CompileSceneKitAssets" in project "/Users/mac360_xamarin/Desktop/untitled folder/TestProject 2/UnifiedTest/UnifiedTest/UnifiedTest.csproj" ("/Library/Frameworks/Mono.framework/External/xbuild/Xamarin/iOS/Xamarin.iOS.Common.targets"); "_CollectBundleResources" depends on it.
Building target "_CompileTextureAtlases" in project "/Users/mac360_xamarin/Desktop/untitled folder/TestProject 2/UnifiedTest/UnifiedTest/UnifiedTest.csproj" ("/Library/Frameworks/Mono.framework/External/xbuild/Xamarin/iOS/Xamarin.iOS.Common.targets"); "_CollectBundleResources" depends on it.
Building target "_CoreCompileTextureAtlases" in project "/Users/mac360_xamarin/Desktop/untitled folder/TestProject 2/UnifiedTest/UnifiedTest/UnifiedTest.csproj" ("/Library/Frameworks/Mono.framework/External/xbuild/Xamarin/iOS/Xamarin.iOS.Common.targets"); "_CompileTextureAtlases" depends on it.
Target _CoreCompileTextureAtlases:
Task "TextureAtlasTask"
Using task TextureAtlasTask from Xamarin.iOS.Tasks.TextureAtlasTask, Xamarin.iOS.Tasks, Version=0.0.0.0, Culture=neutral, PublicKeyToken=null
TextureAtlas Task
AtlasTextures: <null>
IntermediateOutputPath: obj/iPhoneSimulator/Debug/
ProjectDir: /Users/mac360_xamarin/Desktop/untitled folder/TestProject 2/UnifiedTest/UnifiedTest
ResourcePrefix: Resources
SdkBinPath: /Applications/Xcode.app/Contents/Developer/Platforms/iPhoneSimulator.platform/Developer/SDKs/iPhoneSimulator8.1.sdk/Developer/usr/bin
SdkDevPath: /Applications/Xcode.app/Contents/Developer
SdkUsrPath: /Applications/Xcode.app/Contents/Developer/Platforms/iPhoneSimulator.platform/Developer/SDKs/iPhoneSimulator8.1.sdk/Developer/usr
Done executing task "TextureAtlasTask"
Done building target "_CoreCompileTextureAtlases" in project "/Users/mac360_xamarin/Desktop/untitled folder/TestProject 2/UnifiedTest/UnifiedTest/UnifiedTest.csproj".
Done building target "_CoreCompileTextureAtlases" in project "/Users/mac360_xamarin/Desktop/untitled folder/TestProject 2/UnifiedTest/UnifiedTest/UnifiedTest.csproj" ("/Library/Frameworks/Mono.framework/External/xbuild/Xamarin/iOS/Xamarin.iOS.Common.targets"); "_CompileTextureAtlases" depends on it.
Done building target "_CompileTextureAtlases" in project "/Users/mac360_xamarin/Desktop/untitled folder/TestProject 2/UnifiedTest/UnifiedTest/UnifiedTest.csproj" ("/Library/Frameworks/Mono.framework/External/xbuild/Xamarin/iOS/Xamarin.iOS.Common.targets"); "_CollectBundleResources" depends on it.
Building target "_CollectITunesArtwork" in project "/Users/mac360_xamarin/Desktop/untitled folder/TestProject 2/UnifiedTest/UnifiedTest/UnifiedTest.csproj" ("/Library/Frameworks/Mono.framework/External/xbuild/Xamarin/iOS/Xamarin.iOS.Common.targets"); "_CollectBundleResources" depends on it.
Target _CollectITunesArtwork:
Task "CollectITunesArtworkTask"
Using task CollectITunesArtworkTask from Xamarin.iOS.Tasks.CollectITunesArtworkTask, Xamarin.iOS.Tasks, Version=0.0.0.0, Culture=neutral, PublicKeyToken=null
CollectITunesArtwork Task
ITunesArtwork: <null>
Done executing task "CollectITunesArtworkTask"
Done building target "_CollectITunesArtwork" in project "/Users/mac360_xamarin/Desktop/untitled folder/TestProject 2/UnifiedTest/UnifiedTest/UnifiedTest.csproj".
Done building target "_CollectITunesArtwork" in project "/Users/mac360_xamarin/Desktop/untitled folder/TestProject 2/UnifiedTest/UnifiedTest/UnifiedTest.csproj" ("/Library/Frameworks/Mono.framework/External/xbuild/Xamarin/iOS/Xamarin.iOS.Common.targets"); "_CollectBundleResources" depends on it.
Target _CollectBundleResources:
Task "CollectBundleResourcesTask"
Using task CollectBundleResourcesTask from Xamarin.MacDev.Tasks.CollectBundleResourcesTask, Xamarin.MacDev.Tasks, Version=1.0.5502.17430, Culture=neutral, PublicKeyToken=null
CollectBundleResources Task
BundleResources:
Resources/Default-568h@2x.png
OptimizePNGs: True
ProjectDir: /Users/mac360_xamarin/Desktop/untitled folder/TestProject 2/UnifiedTest/UnifiedTest
ResourcePrefix: Resources
Done executing task "CollectBundleResourcesTask"
Done building target "_CollectBundleResources" in project "/Users/mac360_xamarin/Desktop/untitled folder/TestProject 2/UnifiedTest/UnifiedTest/UnifiedTest.csproj".
Done building target "_CollectBundleResources" in project "/Users/mac360_xamarin/Desktop/untitled folder/TestProject 2/UnifiedTest/UnifiedTest/UnifiedTest.csproj" ("/Library/Frameworks/Mono.framework/External/xbuild/Xamarin/iOS/Xamarin.iOS.Common.targets"); "Build" depends on it.
Building target "_OptimizePngImages" in project "/Users/mac360_xamarin/Desktop/untitled folder/TestProject 2/UnifiedTest/UnifiedTest/UnifiedTest.csproj" ("/Library/Frameworks/Mono.framework/External/xbuild/Xamarin/iOS/Xamarin.iOS.Common.targets"); "Build" depends on it.
Building target "_CollectPngImages" in project "/Users/mac360_xamarin/Desktop/untitled folder/TestProject 2/UnifiedTest/UnifiedTest/UnifiedTest.csproj" ("/Library/Frameworks/Mono.framework/External/xbuild/Xamarin/iOS/Xamarin.iOS.Common.targets"); "_OptimizePngImages" depends on it.
Done building target "_CollectPngImages" in project "/Users/mac360_xamarin/Desktop/untitled folder/TestProject 2/UnifiedTest/UnifiedTest/UnifiedTest.csproj" ("/Library/Frameworks/Mono.framework/External/xbuild/Xamarin/iOS/Xamarin.iOS.Common.targets"); "_OptimizePngImages" depends on it.
Building target "_CoreOptimizePngImages" in project "/Users/mac360_xamarin/Desktop/untitled folder/TestProject 2/UnifiedTest/UnifiedTest/UnifiedTest.csproj" ("/Library/Frameworks/Mono.framework/External/xbuild/Xamarin/iOS/Xamarin.iOS.Common.targets"); "_OptimizePngImages" depends on it.
Target _CoreOptimizePngImages:
Target _CoreOptimizePngImages needs to be built as output file 'obj/iPhoneSimulator/Debug/Default-568h@2x.png' does not exist.
Task "OptimizeImageTask"
Using task OptimizeImageTask from Xamarin.iOS.Tasks.OptimizeImageTask, Xamarin.iOS.Tasks, Version=0.0.0.0, Culture=neutral, PublicKeyToken=null
OptimizeImage Task
InputImage: Resources/Default-568h@2x.png
OutputImage: obj/iPhoneSimulator/Debug/Default-568h@2x.png
SdkDevPath: /Applications/Xcode.app/Contents/Developer
Tool /Applications/Xcode.app/Contents/Developer/Platforms/iPhoneOS.platform/Developer/usr/bin/pngcrush execution started with arguments: -q -iphone -f 0 Resources/Default-568h@2x.png obj/iPhoneSimulator/Debug/Default-568h@2x.png
Tool /Applications/Xcode.app/Contents/Developer/Platforms/iPhoneOS.platform/Developer/usr/bin/pngcrush execution finished.
Done executing task "OptimizeImageTask"
Done building target "_CoreOptimizePngImages" in project "/Users/mac360_xamarin/Desktop/untitled folder/TestProject 2/UnifiedTest/UnifiedTest/UnifiedTest.csproj".
Done building target "_CoreOptimizePngImages" in project "/Users/mac360_xamarin/Desktop/untitled folder/TestProject 2/UnifiedTest/UnifiedTest/UnifiedTest.csproj" ("/Library/Frameworks/Mono.framework/External/xbuild/Xamarin/iOS/Xamarin.iOS.Common.targets"); "_OptimizePngImages" depends on it.
Building target "_AfterCoreOptimizePngImages" in project "/Users/mac360_xamarin/Desktop/untitled folder/TestProject 2/UnifiedTest/UnifiedTest/UnifiedTest.csproj" ("/Library/Frameworks/Mono.framework/External/xbuild/Xamarin/iOS/Xamarin.iOS.Common.targets"); "_OptimizePngImages" depends on it.
Target _AfterCoreOptimizePngImages:
Task "CreateItem"
Using task CreateItem from Microsoft.Build.Tasks.CreateItem, Microsoft.Build.Tasks.v4.0, Version=4.0.0.0, Culture=neutral, PublicKeyToken=b03f5f7f11d50a3a
Done executing task "CreateItem"
Done building target "_AfterCoreOptimizePngImages" in project "/Users/mac360_xamarin/Desktop/untitled folder/TestProject 2/UnifiedTest/UnifiedTest/UnifiedTest.csproj".
Done building target "_AfterCoreOptimizePngImages" in project "/Users/mac360_xamarin/Desktop/untitled folder/TestProject 2/UnifiedTest/UnifiedTest/UnifiedTest.csproj" ("/Library/Frameworks/Mono.framework/External/xbuild/Xamarin/iOS/Xamarin.iOS.Common.targets"); "_OptimizePngImages" depends on it.
Done building target "_OptimizePngImages" in project "/Users/mac360_xamarin/Desktop/untitled folder/TestProject 2/UnifiedTest/UnifiedTest/UnifiedTest.csproj" ("/Library/Frameworks/Mono.framework/External/xbuild/Xamarin/iOS/Xamarin.iOS.Common.targets"); "Build" depends on it.
Building target "_PackLibraryResources" in project "/Users/mac360_xamarin/Desktop/untitled folder/TestProject 2/UnifiedTest/UnifiedTest/UnifiedTest.csproj" ("/Library/Frameworks/Mono.framework/External/xbuild/Xamarin/iOS/Xamarin.iOS.Common.targets"); "Build" depends on it.
Target _PackLibraryResources skipped due to false condition: '$(OutputType)' != 'Exe' And '$(IsAppExtension)' != 'true'
Done building target "_PackLibraryResources" in project "/Users/mac360_xamarin/Desktop/untitled folder/TestProject 2/UnifiedTest/UnifiedTest/UnifiedTest.csproj" ("/Library/Frameworks/Mono.framework/External/xbuild/Xamarin/iOS/Xamarin.iOS.Common.targets"); "Build" depends on it.
Building target "_UnpackLibraryResources" in project "/Users/mac360_xamarin/Desktop/untitled folder/TestProject 2/UnifiedTest/UnifiedTest/UnifiedTest.csproj" ("/Library/Frameworks/Mono.framework/External/xbuild/Xamarin/iOS/Xamarin.iOS.Common.targets"); "Build" depends on it.
Building target "ResolveReferences" in project "/Users/mac360_xamarin/Desktop/untitled folder/TestProject 2/UnifiedTest/UnifiedTest/UnifiedTest.csproj" ("/Library/Frameworks/Mono.framework/Versions/3.12.0/lib/mono/4.5/Microsoft.Common.targets"); "_UnpackLibraryResources" depends on it.
Building target "_SeparateAppExtensionReferences" in project "/Users/mac360_xamarin/Desktop/untitled folder/TestProject 2/UnifiedTest/UnifiedTest/UnifiedTest.csproj" ("/Library/Frameworks/Mono.framework/External/xbuild/Xamarin/iOS/Xamarin.iOS.Common.targets"); "ResolveReferences" depends on it.
Done building target "_SeparateAppExtensionReferences" in project "/Users/mac360_xamarin/Desktop/untitled folder/TestProject 2/UnifiedTest/UnifiedTest/UnifiedTest.csproj" ("/Library/Frameworks/Mono.framework/External/xbuild/Xamarin/iOS/Xamarin.iOS.Common.targets"); "ResolveReferences" depends on it.
Building target "BeforeResolveReferences" in project "/Users/mac360_xamarin/Desktop/untitled folder/TestProject 2/UnifiedTest/UnifiedTest/UnifiedTest.csproj" ("/Library/Frameworks/Mono.framework/Versions/3.12.0/lib/mono/4.5/Microsoft.Common.targets"); "ResolveReferences" depends on it.
Done building target "BeforeResolveReferences" in project "/Users/mac360_xamarin/Desktop/untitled folder/TestProject 2/UnifiedTest/UnifiedTest/UnifiedTest.csproj" ("/Library/Frameworks/Mono.framework/Versions/3.12.0/lib/mono/4.5/Microsoft.Common.targets"); "ResolveReferences" depends on it.
Building target "ResolveProjectReferences" in project "/Users/mac360_xamarin/Desktop/untitled folder/TestProject 2/UnifiedTest/UnifiedTest/UnifiedTest.csproj" ("/Library/Frameworks/Mono.framework/Versions/3.12.0/lib/mono/4.5/Microsoft.Common.targets"); "ResolveReferences" depends on it.
Building target "SplitProjectReferencesByExistent" in project "/Users/mac360_xamarin/Desktop/untitled folder/TestProject 2/UnifiedTest/UnifiedTest/UnifiedTest.csproj" ("/Library/Frameworks/Mono.framework/Versions/3.12.0/lib/mono/4.5/Microsoft.Common.targets"); "ResolveProjectReferences" depends on it.
Building target "AssignProjectConfiguration" in project "/Users/mac360_xamarin/Desktop/untitled folder/TestProject 2/UnifiedTest/UnifiedTest/UnifiedTest.csproj" ("/Library/Frameworks/Mono.framework/Versions/3.12.0/lib/mono/4.5/Microsoft.Common.targets"); "SplitProjectReferencesByExistent" depends on it.
Target AssignProjectConfiguration skipped due to false condition: '@(ProjectReference)' != ''
Done building target "AssignProjectConfiguration" in project "/Users/mac360_xamarin/Desktop/untitled folder/TestProject 2/UnifiedTest/UnifiedTest/UnifiedTest.csproj" ("/Library/Frameworks/Mono.framework/Versions/3.12.0/lib/mono/4.5/Microsoft.Common.targets"); "SplitProjectReferencesByExistent" depends on it.
Done building target "SplitProjectReferencesByExistent" in project "/Users/mac360_xamarin/Desktop/untitled folder/TestProject 2/UnifiedTest/UnifiedTest/UnifiedTest.csproj" ("/Library/Frameworks/Mono.framework/Versions/3.12.0/lib/mono/4.5/Microsoft.Common.targets"); "ResolveProjectReferences" depends on it.
Done building target "ResolveProjectReferences" in project "/Users/mac360_xamarin/Desktop/untitled folder/TestProject 2/UnifiedTest/UnifiedTest/UnifiedTest.csproj" ("/Library/Frameworks/Mono.framework/Versions/3.12.0/lib/mono/4.5/Microsoft.Common.targets"); "ResolveReferences" depends on it.
Building target "ResolveAssemblyReferences" in project "/Users/mac360_xamarin/Desktop/untitled folder/TestProject 2/UnifiedTest/UnifiedTest/UnifiedTest.csproj" ("/Library/Frameworks/Mono.framework/Versions/3.12.0/lib/mono/4.5/Microsoft.Common.targets"); "ResolveReferences" depends on it.
Building target "GetFrameworkPaths" in project "/Users/mac360_xamarin/Desktop/untitled folder/TestProject 2/UnifiedTest/UnifiedTest/UnifiedTest.csproj" ("/Library/Frameworks/Mono.framework/Versions/3.12.0/lib/mono/4.5/Microsoft.Common.targets"); "ResolveAssemblyReferences" depends on it.
Target GetFrameworkPaths skipped due to false condition: '$(TargetFrameworkIdentifier)' == '' or '$(TargetFrameworkIdentifier)' == '.NETFramework'
Done building target "GetFrameworkPaths" in project "/Users/mac360_xamarin/Desktop/untitled folder/TestProject 2/UnifiedTest/UnifiedTest/UnifiedTest.csproj" ("/Library/Frameworks/Mono.framework/Versions/3.12.0/lib/mono/4.5/Microsoft.Common.targets"); "ResolveAssemblyReferences" depends on it.
Building target "GetReferenceAssemblyPaths" in project "/Users/mac360_xamarin/Desktop/untitled folder/TestProject 2/UnifiedTest/UnifiedTest/UnifiedTest.csproj" ("/Library/Frameworks/Mono.framework/Versions/3.12.0/lib/mono/4.5/Microsoft.Common.targets"); "ResolveAssemblyReferences" depends on it.
Target GetReferenceAssemblyPaths:
Task "CreateProperty"
Using task CreateProperty from Microsoft.Build.Tasks.CreateProperty, Microsoft.Build.Tasks.v4.0, Version=4.0.0.0, Culture=neutral, PublicKeyToken=b03f5f7f11d50a3a
Done executing task "CreateProperty"
Task "GetReferenceAssemblyPaths"
Using task GetReferenceAssemblyPaths from Microsoft.Build.Tasks.GetReferenceAssemblyPaths, Microsoft.Build.Tasks.v4.0, Version=4.0.0.0, Culture=neutral, PublicKeyToken=b03f5f7f11d50a3a
Looking for framework 'Xamarin.iOS,Version=v1.0' in root path '/Library/Frameworks/Mono.framework/External/xbuild-frameworks'
Found framework definition list '/Library/Frameworks/Mono.framework/External/xbuild-frameworks/Xamarin.iOS/v1.0/RedistList/FrameworkList.xml' for framework 'Xamarin.iOS,Version=v1.0'
Done executing task "GetReferenceAssemblyPaths"
Done building target "GetReferenceAssemblyPaths" in project "/Users/mac360_xamarin/Desktop/untitled folder/TestProject 2/UnifiedTest/UnifiedTest/UnifiedTest.csproj".
Done building target "GetReferenceAssemblyPaths" in project "/Users/mac360_xamarin/Desktop/untitled folder/TestProject 2/UnifiedTest/UnifiedTest/UnifiedTest.csproj" ("/Library/Frameworks/Mono.framework/Versions/3.12.0/lib/mono/4.5/Microsoft.Common.targets"); "ResolveAssemblyReferences" depends on it.
Building target "_AddCorlibReference" in project "/Users/mac360_xamarin/Desktop/untitled folder/TestProject 2/UnifiedTest/UnifiedTest/UnifiedTest.csproj" ("/Library/Frameworks/Mono.framework/Versions/3.12.0/lib/mono/4.5/Microsoft.CSharp.targets"); "ResolveAssemblyReferences" depends on it.
Done building target "_AddCorlibReference" in project "/Users/mac360_xamarin/Desktop/untitled folder/TestProject 2/UnifiedTest/UnifiedTest/UnifiedTest.csproj" ("/Library/Frameworks/Mono.framework/Versions/3.12.0/lib/mono/4.5/Microsoft.CSharp.targets"); "ResolveAssemblyReferences" depends on it.
Target ResolveAssemblyReferences:
Task "CreateItem"
Using task CreateItem from Microsoft.Build.Tasks.CreateItem, Microsoft.Build.Tasks.v4.0, Version=4.0.0.0, Culture=neutral, PublicKeyToken=b03f5f7f11d50a3a
Done executing task "CreateItem"
Task "CreateItem"
Using task CreateItem from Microsoft.Build.Tasks.CreateItem, Microsoft.Build.Tasks.v4.0, Version=4.0.0.0, Culture=neutral, PublicKeyToken=b03f5f7f11d50a3a
Done executing task "CreateItem"
Task "ResolveAssemblyReference"
Using task ResolveAssemblyReference from Microsoft.Build.Tasks.ResolveAssemblyReference, Microsoft.Build.Tasks.v4.0, Version=4.0.0.0, Culture=neutral, PublicKeyToken=b03f5f7f11d50a3a
TargetFrameworkDirectories:
/Library/Frameworks/Xamarin.iOS.framework/Versions/Current/lib/mono/Xamarin.iOS
/Library/Frameworks/Xamarin.iOS.framework/Versions/Current/lib/mono/Xamarin.iOS/Facades/
SearchPaths:
{CandidateAssemblyFiles}
{HintPathFromItem}
{TargetFrameworkDirectory}
{PkgConfig}
{GAC}
{RawFileName}
bin/iPhoneSimulator/Debug/
Primary Reference System
Reference System resolved to /Library/Frameworks/Xamarin.iOS.framework/Versions/Current/lib/mono/Xamarin.iOS/System.dll. CopyLocal = False
Reference found at search path {TargetFrameworkDirectory}
For searchpath {CandidateAssemblyFiles}
Warning: {CandidateAssemblyFiles} not supported currently
For searchpath {HintPathFromItem}
HintPath attribute not found
For searchpath {TargetFrameworkDirectory}
Primary Reference System.Xml
Reference System.Xml resolved to /Library/Frameworks/Xamarin.iOS.framework/Versions/Current/lib/mono/Xamarin.iOS/System.Xml.dll. CopyLocal = False
Reference found at search path {TargetFrameworkDirectory}
For searchpath {CandidateAssemblyFiles}
Warning: {CandidateAssemblyFiles} not supported currently
For searchpath {HintPathFromItem}
HintPath attribute not found
For searchpath {TargetFrameworkDirectory}
Primary Reference Xamarin.iOS
Reference Xamarin.iOS resolved to /Library/Frameworks/Xamarin.iOS.framework/Versions/Current/lib/mono/Xamarin.iOS/Xamarin.iOS.dll. CopyLocal = False
Reference found at search path {TargetFrameworkDirectory}
For searchpath {CandidateAssemblyFiles}
Warning: {CandidateAssemblyFiles} not supported currently
For searchpath {HintPathFromItem}
HintPath attribute not found
For searchpath {TargetFrameworkDirectory}
Primary Reference System.Core
Reference System.Core resolved to /Library/Frameworks/Xamarin.iOS.framework/Versions/Current/lib/mono/Xamarin.iOS/System.Core.dll. CopyLocal = False
Reference found at search path {TargetFrameworkDirectory}
For searchpath {CandidateAssemblyFiles}
Warning: {CandidateAssemblyFiles} not supported currently
For searchpath {HintPathFromItem}
HintPath attribute not found
For searchpath {TargetFrameworkDirectory}
Primary Reference from AssemblyFiles /Library/Frameworks/Xamarin.iOS.framework/Versions/Current/lib/mono/Xamarin.iOS/mscorlib.dll
Done executing task "ResolveAssemblyReference"
Done building target "ResolveAssemblyReferences" in project "/Users/mac360_xamarin/Desktop/untitled folder/TestProject 2/UnifiedTest/UnifiedTest/UnifiedTest.csproj".
Done building target "ResolveAssemblyReferences" in project "/Users/mac360_xamarin/Desktop/untitled folder/TestProject 2/UnifiedTest/UnifiedTest/UnifiedTest.csproj" ("/Library/Frameworks/Mono.framework/Versions/3.12.0/lib/mono/4.5/Microsoft.Common.targets"); "ResolveReferences" depends on it.
Building target "AfterResolveReferences" in project "/Users/mac360_xamarin/Desktop/untitled folder/TestProject 2/UnifiedTest/UnifiedTest/UnifiedTest.csproj" ("/Library/Frameworks/Mono.framework/Versions/3.12.0/lib/mono/4.5/Microsoft.Common.targets"); "ResolveReferences" depends on it.
Done building target "AfterResolveReferences" in project "/Users/mac360_xamarin/Desktop/untitled folder/TestProject 2/UnifiedTest/UnifiedTest/UnifiedTest.csproj" ("/Library/Frameworks/Mono.framework/Versions/3.12.0/lib/mono/4.5/Microsoft.Common.targets"); "ResolveReferences" depends on it.
Building target "ImplicitlyExpandDesignTimeFacades" in project "/Users/mac360_xamarin/Desktop/untitled folder/TestProject 2/UnifiedTest/UnifiedTest/UnifiedTest.csproj" ("/Library/Frameworks/Mono.framework/External/xbuild/Xamarin/iOS/Xamarin.iOS.Common.targets"); "ResolveReferences" depends on it.
Done building target "ImplicitlyExpandDesignTimeFacades" in project "/Users/mac360_xamarin/Desktop/untitled folder/TestProject 2/UnifiedTest/UnifiedTest/UnifiedTest.csproj" ("/Library/Frameworks/Mono.framework/External/xbuild/Xamarin/iOS/Xamarin.iOS.Common.targets"); "ResolveReferences" depends on it.
Done building target "ResolveReferences" in project "/Users/mac360_xamarin/Desktop/untitled folder/TestProject 2/UnifiedTest/UnifiedTest/UnifiedTest.csproj" ("/Library/Frameworks/Mono.framework/Versions/3.12.0/lib/mono/4.5/Microsoft.Common.targets"); "_UnpackLibraryResources" depends on it.
Target _UnpackLibraryResources:
Task "UnpackLibraryResourcesTask"
Using task UnpackLibraryResourcesTask from Xamarin.MacDev.Tasks.UnpackLibraryResourcesTask, Xamarin.MacDev.Tasks, Version=1.0.5502.17430, Culture=neutral, PublicKeyToken=null
UnpackLibraryResources Task
IntermediateOutputPath: obj/iPhoneSimulator/Debug/
Prefix: monotouch
ReferencedLibraries:
/Library/Frameworks/Xamarin.iOS.framework/Versions/Current/lib/mono/Xamarin.iOS/System.dll
/Library/Frameworks/Xamarin.iOS.framework/Versions/Current/lib/mono/Xamarin.iOS/System.Xml.dll
/Library/Frameworks/Xamarin.iOS.framework/Versions/Current/lib/mono/Xamarin.iOS/Xamarin.iOS.dll
/Library/Frameworks/Xamarin.iOS.framework/Versions/Current/lib/mono/Xamarin.iOS/System.Core.dll
/Library/Frameworks/Xamarin.iOS.framework/Versions/Current/lib/mono/Xamarin.iOS/mscorlib.dll
Skipping framework assembly: /Library/Frameworks/Xamarin.iOS.framework/Versions/Current/lib/mono/Xamarin.iOS/System.dll
Skipping framework assembly: /Library/Frameworks/Xamarin.iOS.framework/Versions/Current/lib/mono/Xamarin.iOS/System.Xml.dll
Skipping framework assembly: /Library/Frameworks/Xamarin.iOS.framework/Versions/Current/lib/mono/Xamarin.iOS/Xamarin.iOS.dll
Skipping framework assembly: /Library/Frameworks/Xamarin.iOS.framework/Versions/Current/lib/mono/Xamarin.iOS/System.Core.dll
Inspecting assembly: /Library/Frameworks/Xamarin.iOS.framework/Versions/Current/lib/mono/Xamarin.iOS/mscorlib.dll
Done executing task "UnpackLibraryResourcesTask"
Done building target "_UnpackLibraryResources" in project "/Users/mac360_xamarin/Desktop/untitled folder/TestProject 2/UnifiedTest/UnifiedTest/UnifiedTest.csproj".
Done building target "_UnpackLibraryResources" in project "/Users/mac360_xamarin/Desktop/untitled folder/TestProject 2/UnifiedTest/UnifiedTest/UnifiedTest.csproj" ("/Library/Frameworks/Mono.framework/External/xbuild/Xamarin/iOS/Xamarin.iOS.Common.targets"); "Build" depends on it.
Building target "BeforeBuild" in project "/Users/mac360_xamarin/Desktop/untitled folder/TestProject 2/UnifiedTest/UnifiedTest/UnifiedTest.csproj" ("/Library/Frameworks/Mono.framework/Versions/3.12.0/lib/mono/4.5/Microsoft.Common.targets"); "Build" depends on it.
Done building target "BeforeBuild" in project "/Users/mac360_xamarin/Desktop/untitled folder/TestProject 2/UnifiedTest/UnifiedTest/UnifiedTest.csproj" ("/Library/Frameworks/Mono.framework/Versions/3.12.0/lib/mono/4.5/Microsoft.Common.targets"); "Build" depends on it.
Building target "CoreBuild" in project "/Users/mac360_xamarin/Desktop/untitled folder/TestProject 2/UnifiedTest/UnifiedTest/UnifiedTest.csproj" ("/Library/Frameworks/Mono.framework/Versions/3.12.0/lib/mono/4.5/Microsoft.Common.targets"); "Build" depends on it.
Building target "GetFrameworkPaths" in project "/Users/mac360_xamarin/Desktop/untitled folder/TestProject 2/UnifiedTest/UnifiedTest/UnifiedTest.csproj" ("/Library/Frameworks/Mono.framework/Versions/3.12.0/lib/mono/4.5/Microsoft.Common.targets"); "CoreBuild" depends on it.
Target GetFrameworkPaths skipped due to false condition: '$(TargetFrameworkIdentifier)' == '' or '$(TargetFrameworkIdentifier)' == '.NETFramework'
Done building target "GetFrameworkPaths" in project "/Users/mac360_xamarin/Desktop/untitled folder/TestProject 2/UnifiedTest/UnifiedTest/UnifiedTest.csproj" ("/Library/Frameworks/Mono.framework/Versions/3.12.0/lib/mono/4.5/Microsoft.Common.targets"); "CoreBuild" depends on it.
Building target "PreBuildEvent" in project "/Users/mac360_xamarin/Desktop/untitled folder/TestProject 2/UnifiedTest/UnifiedTest/UnifiedTest.csproj" ("/Library/Frameworks/Mono.framework/Versions/3.12.0/lib/mono/4.5/Microsoft.Common.targets"); "CoreBuild" depends on it.
Target PreBuildEvent skipped due to false condition: '$(PreBuildEvent)' != ''
Done building target "PreBuildEvent" in project "/Users/mac360_xamarin/Desktop/untitled folder/TestProject 2/UnifiedTest/UnifiedTest/UnifiedTest.csproj" ("/Library/Frameworks/Mono.framework/Versions/3.12.0/lib/mono/4.5/Microsoft.Common.targets"); "CoreBuild" depends on it.
Building target "CopyFilesMarkedCopyLocal" in project "/Users/mac360_xamarin/Desktop/untitled folder/TestProject 2/UnifiedTest/UnifiedTest/UnifiedTest.csproj" ("/Library/Frameworks/Mono.framework/Versions/3.12.0/lib/mono/4.5/Microsoft.Common.targets"); "CoreBuild" depends on it.
Target CopyFilesMarkedCopyLocal:
Task "Copy"
Using task Copy from Microsoft.Build.Tasks.Copy, Xamarin.iOS.Tasks, Version=0.0.0.0, Culture=neutral, PublicKeyToken=null
Done executing task "Copy"
Done building target "CopyFilesMarkedCopyLocal" in project "/Users/mac360_xamarin/Desktop/untitled folder/TestProject 2/UnifiedTest/UnifiedTest/UnifiedTest.csproj".
Done building target "CopyFilesMarkedCopyLocal" in project "/Users/mac360_xamarin/Desktop/untitled folder/TestProject 2/UnifiedTest/UnifiedTest/UnifiedTest.csproj" ("/Library/Frameworks/Mono.framework/Versions/3.12.0/lib/mono/4.5/Microsoft.Common.targets"); "CoreBuild" depends on it.
Building target "PrepareResources" in project "/Users/mac360_xamarin/Desktop/untitled folder/TestProject 2/UnifiedTest/UnifiedTest/UnifiedTest.csproj" ("/Library/Frameworks/Mono.framework/Versions/3.12.0/lib/mono/4.5/Microsoft.Common.targets"); "CoreBuild" depends on it.
Building target "AssignTargetPaths" in project "/Users/mac360_xamarin/Desktop/untitled folder/TestProject 2/UnifiedTest/UnifiedTest/UnifiedTest.csproj" ("/Library/Frameworks/Mono.framework/Versions/3.12.0/lib/mono/4.5/Microsoft.Common.targets"); "PrepareResources" depends on it.
Target AssignTargetPaths:
Task "AssignTargetPath"
Using task AssignTargetPath from Microsoft.Build.Tasks.AssignTargetPath, Microsoft.Build.Tasks.v4.0, Version=4.0.0.0, Culture=neutral, PublicKeyToken=b03f5f7f11d50a3a
Done executing task "AssignTargetPath"
Task "AssignTargetPath"
Using task AssignTargetPath from Microsoft.Build.Tasks.AssignTargetPath, Microsoft.Build.Tasks.v4.0, Version=4.0.0.0, Culture=neutral, PublicKeyToken=b03f5f7f11d50a3a
Done executing task "AssignTargetPath"
Task "AssignTargetPath"
Using task AssignTargetPath from Microsoft.Build.Tasks.AssignTargetPath, Microsoft.Build.Tasks.v4.0, Version=4.0.0.0, Culture=neutral, PublicKeyToken=b03f5f7f11d50a3a
Done executing task "AssignTargetPath"
Done building target "AssignTargetPaths" in project "/Users/mac360_xamarin/Desktop/untitled folder/TestProject 2/UnifiedTest/UnifiedTest/UnifiedTest.csproj".
Done building target "AssignTargetPaths" in project "/Users/mac360_xamarin/Desktop/untitled folder/TestProject 2/UnifiedTest/UnifiedTest/UnifiedTest.csproj" ("/Library/Frameworks/Mono.framework/Versions/3.12.0/lib/mono/4.5/Microsoft.Common.targets"); "PrepareResources" depends on it.
Building target "SplitResourcesByCulture" in project "/Users/mac360_xamarin/Desktop/untitled folder/TestProject 2/UnifiedTest/UnifiedTest/UnifiedTest.csproj" ("/Library/Frameworks/Mono.framework/Versions/3.12.0/lib/mono/4.5/Microsoft.Common.targets"); "PrepareResources" depends on it.
Target SplitResourcesByCulture:
Task "AssignCulture"
Using task AssignCulture from Microsoft.Build.Tasks.AssignCulture, Microsoft.Build.Tasks.v4.0, Version=4.0.0.0, Culture=neutral, PublicKeyToken=b03f5f7f11d50a3a
Done executing task "AssignCulture"
Task "CreateItem"
Using task CreateItem from Microsoft.Build.Tasks.CreateItem, Microsoft.Build.Tasks.v4.0, Version=4.0.0.0, Culture=neutral, PublicKeyToken=b03f5f7f11d50a3a
Done executing task "CreateItem"
Task "CreateItem"
Using task CreateItem from Microsoft.Build.Tasks.CreateItem, Microsoft.Build.Tasks.v4.0, Version=4.0.0.0, Culture=neutral, PublicKeyToken=b03f5f7f11d50a3a
Done executing task "CreateItem"
Done building target "SplitResourcesByCulture" in project "/Users/mac360_xamarin/Desktop/untitled folder/TestProject 2/UnifiedTest/UnifiedTest/UnifiedTest.csproj".
Done building target "SplitResourcesByCulture" in project "/Users/mac360_xamarin/Desktop/untitled folder/TestProject 2/UnifiedTest/UnifiedTest/UnifiedTest.csproj" ("/Library/Frameworks/Mono.framework/Versions/3.12.0/lib/mono/4.5/Microsoft.Common.targets"); "PrepareResources" depends on it.
Building target "CreateManifestResourceNames" in project "/Users/mac360_xamarin/Desktop/untitled folder/TestProject 2/UnifiedTest/UnifiedTest/UnifiedTest.csproj" ("/Library/Frameworks/Mono.framework/Versions/3.12.0/lib/mono/4.5/Microsoft.CSharp.targets"); "PrepareResources" depends on it.
Done building target "CreateManifestResourceNames" in project "/Users/mac360_xamarin/Desktop/untitled folder/TestProject 2/UnifiedTest/UnifiedTest/UnifiedTest.csproj" ("/Library/Frameworks/Mono.framework/Versions/3.12.0/lib/mono/4.5/Microsoft.CSharp.targets"); "PrepareResources" depends on it.
Building target "CopyNonResxEmbeddedResources" in project "/Users/mac360_xamarin/Desktop/untitled folder/TestProject 2/UnifiedTest/UnifiedTest/UnifiedTest.csproj" ("/Library/Frameworks/Mono.framework/Versions/3.12.0/lib/mono/4.5/Microsoft.Common.targets"); "PrepareResources" depends on it.
Target CopyNonResxEmbeddedResources skipped due to false condition: '@(NonResxWithCulture)' != '' or '@(NonResxWithNoCulture)' != '' or '@(ManifestNonResxWithCulture)' != '' or '@(ManifestNonResxWithNoCulture)' != ''
Done building target "CopyNonResxEmbeddedResources" in project "/Users/mac360_xamarin/Desktop/untitled folder/TestProject 2/UnifiedTest/UnifiedTest/UnifiedTest.csproj" ("/Library/Frameworks/Mono.framework/Versions/3.12.0/lib/mono/4.5/Microsoft.Common.targets"); "PrepareResources" depends on it.
Building target "GenerateResources" in project "/Users/mac360_xamarin/Desktop/untitled folder/TestProject 2/UnifiedTest/UnifiedTest/UnifiedTest.csproj" ("/Library/Frameworks/Mono.framework/Versions/3.12.0/lib/mono/4.5/Microsoft.Common.targets"); "PrepareResources" depends on it.
Done building target "GenerateResources" in project "/Users/mac360_xamarin/Desktop/untitled folder/TestProject 2/UnifiedTest/UnifiedTest/UnifiedTest.csproj" ("/Library/Frameworks/Mono.framework/Versions/3.12.0/lib/mono/4.5/Microsoft.Common.targets"); "PrepareResources" depends on it.
Building target "GenerateSatelliteAssemblies" in project "/Users/mac360_xamarin/Desktop/untitled folder/TestProject 2/UnifiedTest/UnifiedTest/UnifiedTest.csproj" ("/Library/Frameworks/Mono.framework/Versions/3.12.0/lib/mono/4.5/Microsoft.Common.targets"); "PrepareResources" depends on it.
Target GenerateSatelliteAssemblies:
No input files were specified for target GenerateSatelliteAssemblies, skipping.
Done building target "GenerateSatelliteAssemblies" in project "/Users/mac360_xamarin/Desktop/untitled folder/TestProject 2/UnifiedTest/UnifiedTest/UnifiedTest.csproj".
Done building target "GenerateSatelliteAssemblies" in project "/Users/mac360_xamarin/Desktop/untitled folder/TestProject 2/UnifiedTest/UnifiedTest/UnifiedTest.csproj" ("/Library/Frameworks/Mono.framework/Versions/3.12.0/lib/mono/4.5/Microsoft.Common.targets"); "PrepareResources" depends on it.
Building target "CompileLicxFiles" in project "/Users/mac360_xamarin/Desktop/untitled folder/TestProject 2/UnifiedTest/UnifiedTest/UnifiedTest.csproj" ("/Library/Frameworks/Mono.framework/Versions/3.12.0/lib/mono/4.5/Microsoft.Common.targets"); "PrepareResources" depends on it.
Target CompileLicxFiles skipped due to false condition: '@(LicxFiles)' != ''
Done building target "CompileLicxFiles" in project "/Users/mac360_xamarin/Desktop/untitled folder/TestProject 2/UnifiedTest/UnifiedTest/UnifiedTest.csproj" ("/Library/Frameworks/Mono.framework/Versions/3.12.0/lib/mono/4.5/Microsoft.Common.targets"); "PrepareResources" depends on it.
Done building target "PrepareResources" in project "/Users/mac360_xamarin/Desktop/untitled folder/TestProject 2/UnifiedTest/UnifiedTest/UnifiedTest.csproj" ("/Library/Frameworks/Mono.framework/Versions/3.12.0/lib/mono/4.5/Microsoft.Common.targets"); "CoreBuild" depends on it.
Building target "Compile" in project "/Users/mac360_xamarin/Desktop/untitled folder/TestProject 2/UnifiedTest/UnifiedTest/UnifiedTest.csproj" ("/Library/Frameworks/Mono.framework/Versions/3.12.0/lib/mono/4.5/Microsoft.Common.targets"); "CoreBuild" depends on it.
Building target "GenerateTargetFrameworkMonikerAttribute" in project "/Users/mac360_xamarin/Desktop/untitled folder/TestProject 2/UnifiedTest/UnifiedTest/UnifiedTest.csproj" ("/Library/Frameworks/Mono.framework/Versions/3.12.0/lib/mono/4.5/Microsoft.Common.targets"); "Compile" depends on it.
Target GenerateTargetFrameworkMonikerAttribute:
Target GenerateTargetFrameworkMonikerAttribute needs to be built as output file 'obj/iPhoneSimulator/Debug/Xamarin.iOS,Version=v1.0.AssemblyAttribute.cs' does not exist.
Task "WriteLinesToFile"
Using task WriteLinesToFile from Microsoft.Build.Tasks.WriteLinesToFile, Microsoft.Build.Tasks.v4.0, Version=4.0.0.0, Culture=neutral, PublicKeyToken=b03f5f7f11d50a3a
Done executing task "WriteLinesToFile"
Done building target "GenerateTargetFrameworkMonikerAttribute" in project "/Users/mac360_xamarin/Desktop/untitled folder/TestProject 2/UnifiedTest/UnifiedTest/UnifiedTest.csproj".
Done building target "GenerateTargetFrameworkMonikerAttribute" in project "/Users/mac360_xamarin/Desktop/untitled folder/TestProject 2/UnifiedTest/UnifiedTest/UnifiedTest.csproj" ("/Library/Frameworks/Mono.framework/Versions/3.12.0/lib/mono/4.5/Microsoft.Common.targets"); "Compile" depends on it.
Building target "BeforeCompile" in project "/Users/mac360_xamarin/Desktop/untitled folder/TestProject 2/UnifiedTest/UnifiedTest/UnifiedTest.csproj" ("/Library/Frameworks/Mono.framework/Versions/3.12.0/lib/mono/4.5/Microsoft.Common.targets"); "Compile" depends on it.
Done building target "BeforeCompile" in project "/Users/mac360_xamarin/Desktop/untitled folder/TestProject 2/UnifiedTest/UnifiedTest/UnifiedTest.csproj" ("/Library/Frameworks/Mono.framework/Versions/3.12.0/lib/mono/4.5/Microsoft.Common.targets"); "Compile" depends on it.
Building target "_TimestampBeforeCompile" in project "/Users/mac360_xamarin/Desktop/untitled folder/TestProject 2/UnifiedTest/UnifiedTest/UnifiedTest.csproj" ("/Library/Frameworks/Mono.framework/Versions/3.12.0/lib/mono/4.5/Microsoft.Common.targets"); "Compile" depends on it.
Target _TimestampBeforeCompile skipped due to false condition: '$(RunPostBuildEvent)' == 'OnOutputUpdated'
Done building target "_TimestampBeforeCompile" in project "/Users/mac360_xamarin/Desktop/untitled folder/TestProject 2/UnifiedTest/UnifiedTest/UnifiedTest.csproj" ("/Library/Frameworks/Mono.framework/Versions/3.12.0/lib/mono/4.5/Microsoft.Common.targets"); "Compile" depends on it.
Building target "CoreCompile" in project "/Users/mac360_xamarin/Desktop/untitled folder/TestProject 2/UnifiedTest/UnifiedTest/UnifiedTest.csproj" ("/Library/Frameworks/Mono.framework/Versions/3.12.0/lib/mono/4.5/Microsoft.CSharp.targets"); "Compile" depends on it.
Target CoreCompile:
Target CoreCompile needs to be built as output file 'obj/iPhoneSimulator/Debug/UnifiedTest.exe' does not exist.
Task "Csc"
Using task Csc from Microsoft.Build.Tasks.Csc, Microsoft.Build.Tasks.v4.0, Version=4.0.0.0, Culture=neutral, PublicKeyToken=b03f5f7f11d50a3a
Tool /Library/Frameworks/Xamarin.iOS.framework/Versions/Current/bin/smcs execution started with arguments: /noconfig /debug:full /debug+ /optimize- /out:obj/iPhoneSimulator/Debug/UnifiedTest.exe Main.cs AppDelegate.cs ../../NestedFolder/MainController/DiscoveryViewControlleriPad.cs ../../NestedFolder/MainController/DiscoveryViewControlleriPad.designer.cs ../../NestedFolder/MainController/UniversalDiscoveryViewController.cs obj/iPhoneSimulator/Debug/Xamarin.iOS,Version=v1.0.AssemblyAttribute.cs /target:exe /define:"__UNIFIED__;__MOBILE__;__IOS__;DEBUG;__MOBILE__;IOS;AIR_PLUS;SIMULATOR" /nostdlib /reference:/Library/Frameworks/Xamarin.iOS.framework/Versions/Current/lib/mono/Xamarin.iOS/System.dll /reference:/Library/Frameworks/Xamarin.iOS.framework/Versions/Current/lib/mono/Xamarin.iOS/System.Xml.dll /reference:/Library/Frameworks/Xamarin.iOS.framework/Versions/Current/lib/mono/Xamarin.iOS/Xamarin.iOS.dll /reference:/Library/Frameworks/Xamarin.iOS.framework/Versions/Current/lib/mono/Xamarin.iOS/System.Core.dll /reference:/Library/Frameworks/Xamarin.iOS.framework/Versions/Current/lib/mono/Xamarin.iOS/mscorlib.dll /warn:4
Tool /Library/Frameworks/Xamarin.iOS.framework/Versions/Current/bin/smcs execution finished.
Done executing task "Csc"
Done building target "CoreCompile" in project "/Users/mac360_xamarin/Desktop/untitled folder/TestProject 2/UnifiedTest/UnifiedTest/UnifiedTest.csproj".
Done building target "CoreCompile" in project "/Users/mac360_xamarin/Desktop/untitled folder/TestProject 2/UnifiedTest/UnifiedTest/UnifiedTest.csproj" ("/Library/Frameworks/Mono.framework/Versions/3.12.0/lib/mono/4.5/Microsoft.CSharp.targets"); "Compile" depends on it.
Building target "_TimestampAfterCompile" in project "/Users/mac360_xamarin/Desktop/untitled folder/TestProject 2/UnifiedTest/UnifiedTest/UnifiedTest.csproj" ("/Library/Frameworks/Mono.framework/Versions/3.12.0/lib/mono/4.5/Microsoft.Common.targets"); "Compile" depends on it.
Target _TimestampAfterCompile skipped due to false condition: '$(RunPostBuildEvent)' == 'OnOutputUpdated'
Done building target "_TimestampAfterCompile" in project "/Users/mac360_xamarin/Desktop/untitled folder/TestProject 2/UnifiedTest/UnifiedTest/UnifiedTest.csproj" ("/Library/Frameworks/Mono.framework/Versions/3.12.0/lib/mono/4.5/Microsoft.Common.targets"); "Compile" depends on it.
Building target "AfterCompile" in project "/Users/mac360_xamarin/Desktop/untitled folder/TestProject 2/UnifiedTest/UnifiedTest/UnifiedTest.csproj" ("/Library/Frameworks/Mono.framework/Versions/3.12.0/lib/mono/4.5/Microsoft.Common.targets"); "Compile" depends on it.
Done building target "AfterCompile" in project "/Users/mac360_xamarin/Desktop/untitled folder/TestProject 2/UnifiedTest/UnifiedTest/UnifiedTest.csproj" ("/Library/Frameworks/Mono.framework/Versions/3.12.0/lib/mono/4.5/Microsoft.Common.targets"); "Compile" depends on it.
Done building target "Compile" in project "/Users/mac360_xamarin/Desktop/untitled folder/TestProject 2/UnifiedTest/UnifiedTest/UnifiedTest.csproj" ("/Library/Frameworks/Mono.framework/Versions/3.12.0/lib/mono/4.5/Microsoft.Common.targets"); "CoreBuild" depends on it.
Building target "PrepareForRun" in project "/Users/mac360_xamarin/Desktop/untitled folder/TestProject 2/UnifiedTest/UnifiedTest/UnifiedTest.csproj" ("/Library/Frameworks/Mono.framework/Versions/3.12.0/lib/mono/4.5/Microsoft.Common.targets"); "CoreBuild" depends on it.
Building target "DeployOutputFiles" in project "/Users/mac360_xamarin/Desktop/untitled folder/TestProject 2/UnifiedTest/UnifiedTest/UnifiedTest.csproj" ("/Library/Frameworks/Mono.framework/Versions/3.12.0/lib/mono/4.5/Microsoft.Common.targets"); "PrepareForRun" depends on it.
Building target "_CopyDeployFilesToOutputDirectory" in project "/Users/mac360_xamarin/Desktop/untitled folder/TestProject 2/UnifiedTest/UnifiedTest/UnifiedTest.csproj" ("/Library/Frameworks/Mono.framework/Versions/3.12.0/lib/mono/4.5/Microsoft.Common.targets"); "DeployOutputFiles" depends on it.
Building target "GetCopyToOutputDirectoryItems" in project "/Users/mac360_xamarin/Desktop/untitled folder/TestProject 2/UnifiedTest/UnifiedTest/UnifiedTest.csproj" ("/Library/Frameworks/Mono.framework/Versions/3.12.0/lib/mono/4.5/Microsoft.Common.targets"); "_CopyDeployFilesToOutputDirectory" depends on it.
Done building target "GetCopyToOutputDirectoryItems" in project "/Users/mac360_xamarin/Desktop/untitled folder/TestProject 2/UnifiedTest/UnifiedTest/UnifiedTest.csproj" ("/Library/Frameworks/Mono.framework/Versions/3.12.0/lib/mono/4.5/Microsoft.Common.targets"); "_CopyDeployFilesToOutputDirectory" depends on it.
Building target "_CopyDeployFilesToOutputDirectoryAlways" in project "/Users/mac360_xamarin/Desktop/untitled folder/TestProject 2/UnifiedTest/UnifiedTest/UnifiedTest.csproj" ("/Library/Frameworks/Mono.framework/Versions/3.12.0/lib/mono/4.5/Microsoft.Common.targets"); "_CopyDeployFilesToOutputDirectory" depends on it.
Target _CopyDeployFilesToOutputDirectoryAlways skipped due to false condition: '@(ItemsToCopyToOutputDirectoryAlways)' != ''
Done building target "_CopyDeployFilesToOutputDirectoryAlways" in project "/Users/mac360_xamarin/Desktop/untitled folder/TestProject 2/UnifiedTest/UnifiedTest/UnifiedTest.csproj" ("/Library/Frameworks/Mono.framework/Versions/3.12.0/lib/mono/4.5/Microsoft.Common.targets"); "_CopyDeployFilesToOutputDirectory" depends on it.
Building target "_CopyDeployFilesToOutputDirectoryPreserveNewest" in project "/Users/mac360_xamarin/Desktop/untitled folder/TestProject 2/UnifiedTest/UnifiedTest/UnifiedTest.csproj" ("/Library/Frameworks/Mono.framework/Versions/3.12.0/lib/mono/4.5/Microsoft.Common.targets"); "_CopyDeployFilesToOutputDirectory" depends on it.
Target _CopyDeployFilesToOutputDirectoryPreserveNewest skipped due to false condition: '@(ItemsToCopyToOutputDirectoryPreserveNewest)' != ''
Done building target "_CopyDeployFilesToOutputDirectoryPreserveNewest" in project "/Users/mac360_xamarin/Desktop/untitled folder/TestProject 2/UnifiedTest/UnifiedTest/UnifiedTest.csproj" ("/Library/Frameworks/Mono.framework/Versions/3.12.0/lib/mono/4.5/Microsoft.Common.targets"); "_CopyDeployFilesToOutputDirectory" depends on it.
Done building target "_CopyDeployFilesToOutputDirectory" in project "/Users/mac360_xamarin/Desktop/untitled folder/TestProject 2/UnifiedTest/UnifiedTest/UnifiedTest.csproj" ("/Library/Frameworks/Mono.framework/Versions/3.12.0/lib/mono/4.5/Microsoft.Common.targets"); "DeployOutputFiles" depends on it.
Building target "_CopyAppConfigFile" in project "/Users/mac360_xamarin/Desktop/untitled folder/TestProject 2/UnifiedTest/UnifiedTest/UnifiedTest.csproj" ("/Library/Frameworks/Mono.framework/Versions/3.12.0/lib/mono/4.5/Microsoft.Common.targets"); "DeployOutputFiles" depends on it.
Target _CopyAppConfigFile skipped due to false condition: '@(AppConfigWithTargetPath)' != ''
Done building target "_CopyAppConfigFile" in project "/Users/mac360_xamarin/Desktop/untitled folder/TestProject 2/UnifiedTest/UnifiedTest/UnifiedTest.csproj" ("/Library/Frameworks/Mono.framework/Versions/3.12.0/lib/mono/4.5/Microsoft.Common.targets"); "DeployOutputFiles" depends on it.
Target DeployOutputFiles:
Task "Copy"
Using task Copy from Microsoft.Build.Tasks.Copy, Xamarin.iOS.Tasks, Version=0.0.0.0, Culture=neutral, PublicKeyToken=null
Copying file from '/Users/mac360_xamarin/Desktop/untitled folder/TestProject 2/UnifiedTest/UnifiedTest/obj/iPhoneSimulator/Debug/UnifiedTest.exe.mdb' to '/Users/mac360_xamarin/Desktop/untitled folder/TestProject 2/UnifiedTest/UnifiedTest/bin/iPhoneSimulator/Debug/UnifiedTest.exe.mdb'
Done executing task "Copy"
Task "Copy"
Using task Copy from Microsoft.Build.Tasks.Copy, Xamarin.iOS.Tasks, Version=0.0.0.0, Culture=neutral, PublicKeyToken=null
Copying file from '/Users/mac360_xamarin/Desktop/untitled folder/TestProject 2/UnifiedTest/UnifiedTest/obj/iPhoneSimulator/Debug/UnifiedTest.exe' to '/Users/mac360_xamarin/Desktop/untitled folder/TestProject 2/UnifiedTest/UnifiedTest/bin/iPhoneSimulator/Debug/UnifiedTest.exe'
Done executing task "Copy"
Done building target "DeployOutputFiles" in project "/Users/mac360_xamarin/Desktop/untitled folder/TestProject 2/UnifiedTest/UnifiedTest/UnifiedTest.csproj".
Done building target "DeployOutputFiles" in project "/Users/mac360_xamarin/Desktop/untitled folder/TestProject 2/UnifiedTest/UnifiedTest/UnifiedTest.csproj" ("/Library/Frameworks/Mono.framework/Versions/3.12.0/lib/mono/4.5/Microsoft.Common.targets"); "PrepareForRun" depends on it.
Done building target "PrepareForRun" in project "/Users/mac360_xamarin/Desktop/untitled folder/TestProject 2/UnifiedTest/UnifiedTest/UnifiedTest.csproj" ("/Library/Frameworks/Mono.framework/Versions/3.12.0/lib/mono/4.5/Microsoft.Common.targets"); "CoreBuild" depends on it.
Building target "_RecordCleanFile" in project "/Users/mac360_xamarin/Desktop/untitled folder/TestProject 2/UnifiedTest/UnifiedTest/UnifiedTest.csproj" ("/Library/Frameworks/Mono.framework/Versions/3.12.0/lib/mono/4.5/Microsoft.Common.targets"); "CoreBuild" depends on it.
Building target "_GetCompileOutputsForClean" in project "/Users/mac360_xamarin/Desktop/untitled folder/TestProject 2/UnifiedTest/UnifiedTest/UnifiedTest.csproj" ("/Library/Frameworks/Mono.framework/Versions/3.12.0/lib/mono/4.5/Microsoft.Common.targets"); "_RecordCleanFile" depends on it.
Target _GetCompileOutputsForClean:
Task "CreateItem"
Using task CreateItem from Microsoft.Build.Tasks.CreateItem, Microsoft.Build.Tasks.v4.0, Version=4.0.0.0, Culture=neutral, PublicKeyToken=b03f5f7f11d50a3a
Done executing task "CreateItem"
Task "CreateItem"
Using task CreateItem from Microsoft.Build.Tasks.CreateItem, Microsoft.Build.Tasks.v4.0, Version=4.0.0.0, Culture=neutral, PublicKeyToken=b03f5f7f11d50a3a
Done executing task "CreateItem"
Done building target "_GetCompileOutputsForClean" in project "/Users/mac360_xamarin/Desktop/untitled folder/TestProject 2/UnifiedTest/UnifiedTest/UnifiedTest.csproj".
Done building target "_GetCompileOutputsForClean" in project "/Users/mac360_xamarin/Desktop/untitled folder/TestProject 2/UnifiedTest/UnifiedTest/UnifiedTest.csproj" ("/Library/Frameworks/Mono.framework/Versions/3.12.0/lib/mono/4.5/Microsoft.Common.targets"); "_RecordCleanFile" depends on it.
Target _RecordCleanFile:
Task "ReadLinesFromFile"
Using task ReadLinesFromFile from Microsoft.Build.Tasks.ReadLinesFromFile, Microsoft.Build.Tasks.v4.0, Version=4.0.0.0, Culture=neutral, PublicKeyToken=b03f5f7f11d50a3a
Done executing task "ReadLinesFromFile"
Task "FindUnderPath"
Using task FindUnderPath from Microsoft.Build.Tasks.FindUnderPath, Microsoft.Build.Tasks.v4.0, Version=4.0.0.0, Culture=neutral, PublicKeyToken=b03f5f7f11d50a3a
Done executing task "FindUnderPath"
Task "RemoveDuplicates"
Using task RemoveDuplicates from Microsoft.Build.Tasks.RemoveDuplicates, Microsoft.Build.Tasks.v4.0, Version=4.0.0.0, Culture=neutral, PublicKeyToken=b03f5f7f11d50a3a
Done executing task "RemoveDuplicates"
Task "WriteLinesToFile"
Using task WriteLinesToFile from Microsoft.Build.Tasks.WriteLinesToFile, Microsoft.Build.Tasks.v4.0, Version=4.0.0.0, Culture=neutral, PublicKeyToken=b03f5f7f11d50a3a
Done executing task "WriteLinesToFile"
Done building target "_RecordCleanFile" in project "/Users/mac360_xamarin/Desktop/untitled folder/TestProject 2/UnifiedTest/UnifiedTest/UnifiedTest.csproj".
Done building target "_RecordCleanFile" in project "/Users/mac360_xamarin/Desktop/untitled folder/TestProject 2/UnifiedTest/UnifiedTest/UnifiedTest.csproj" ("/Library/Frameworks/Mono.framework/Versions/3.12.0/lib/mono/4.5/Microsoft.Common.targets"); "CoreBuild" depends on it.
Building target "PostBuildEvent" in project "/Users/mac360_xamarin/Desktop/untitled folder/TestProject 2/UnifiedTest/UnifiedTest/UnifiedTest.csproj" ("/Library/Frameworks/Mono.framework/Versions/3.12.0/lib/mono/4.5/Microsoft.Common.targets"); "CoreBuild" depends on it.
Target PostBuildEvent skipped due to false condition: '$(PostBuildEvent)' != '' and
('$(RunPostBuildEvent)' != 'OnOutputUpdated' or
'$(_AssemblyModifiedTimeBeforeCompile)' != '$(_AssemblyModifiedTimeAfterCompile)')
Done building target "PostBuildEvent" in project "/Users/mac360_xamarin/Desktop/untitled folder/TestProject 2/UnifiedTest/UnifiedTest/UnifiedTest.csproj" ("/Library/Frameworks/Mono.framework/Versions/3.12.0/lib/mono/4.5/Microsoft.Common.targets"); "CoreBuild" depends on it.
Done building target "CoreBuild" in project "/Users/mac360_xamarin/Desktop/untitled folder/TestProject 2/UnifiedTest/UnifiedTest/UnifiedTest.csproj" ("/Library/Frameworks/Mono.framework/Versions/3.12.0/lib/mono/4.5/Microsoft.Common.targets"); "Build" depends on it.
Building target "AfterBuild" in project "/Users/mac360_xamarin/Desktop/untitled folder/TestProject 2/UnifiedTest/UnifiedTest/UnifiedTest.csproj" ("/Library/Frameworks/Mono.framework/Versions/3.12.0/lib/mono/4.5/Microsoft.Common.targets"); "Build" depends on it.
Done building target "AfterBuild" in project "/Users/mac360_xamarin/Desktop/untitled folder/TestProject 2/UnifiedTest/UnifiedTest/UnifiedTest.csproj" ("/Library/Frameworks/Mono.framework/Versions/3.12.0/lib/mono/4.5/Microsoft.Common.targets"); "Build" depends on it.
Building target "_CreateAppBundle" in project "/Users/mac360_xamarin/Desktop/untitled folder/TestProject 2/UnifiedTest/UnifiedTest/UnifiedTest.csproj" ("/Library/Frameworks/Mono.framework/External/xbuild/Xamarin/iOS/Xamarin.iOS.Common.targets"); "Build" depends on it.
Building target "_DetectSigningIdentity" in project "/Users/mac360_xamarin/Desktop/untitled folder/TestProject 2/UnifiedTest/UnifiedTest/UnifiedTest.csproj" ("/Library/Frameworks/Mono.framework/External/xbuild/Xamarin/iOS/Xamarin.iOS.Common.targets"); "_CreateAppBundle" depends on it.
Target _DetectSigningIdentity:
Task "ReadLinesFromFile"
Using task ReadLinesFromFile from Microsoft.Build.Tasks.ReadLinesFromFile, Microsoft.Build.Tasks.v4.0, Version=4.0.0.0, Culture=neutral, PublicKeyToken=b03f5f7f11d50a3a
Done executing task "ReadLinesFromFile"
Task "DetectSigningIdentityTask"
Using task DetectSigningIdentityTask from Xamarin.iOS.Tasks.DetectSigningIdentityTask, Xamarin.iOS.Tasks, Version=0.0.0.0, Culture=neutral, PublicKeyToken=null
DetectSigningIdentity Task
AppBundleName: UnifiedTest
AppManifest: Info.plist
RequireCodesigning: False
Platform: iPhoneSimulator
ProvisioningProfile: <null>
SigningKey: iPhone Developer
Done executing task "DetectSigningIdentityTask"
Done building target "_DetectSigningIdentity" in project "/Users/mac360_xamarin/Desktop/untitled folder/TestProject 2/UnifiedTest/UnifiedTest/UnifiedTest.csproj".
Done building target "_DetectSigningIdentity" in project "/Users/mac360_xamarin/Desktop/untitled folder/TestProject 2/UnifiedTest/UnifiedTest/UnifiedTest.csproj" ("/Library/Frameworks/Mono.framework/External/xbuild/Xamarin/iOS/Xamarin.iOS.Common.targets"); "_CreateAppBundle" depends on it.
Building target "_GenerateBundleName" in project "/Users/mac360_xamarin/Desktop/untitled folder/TestProject 2/UnifiedTest/UnifiedTest/UnifiedTest.csproj" ("/Library/Frameworks/Mono.framework/External/xbuild/Xamarin/iOS/Xamarin.iOS.Common.targets"); "_CreateAppBundle" depends on it.
Done building target "_GenerateBundleName" in project "/Users/mac360_xamarin/Desktop/untitled folder/TestProject 2/UnifiedTest/UnifiedTest/UnifiedTest.csproj" ("/Library/Frameworks/Mono.framework/External/xbuild/Xamarin/iOS/Xamarin.iOS.Common.targets"); "_CreateAppBundle" depends on it.
Building target "_CopyContentToBundle" in project "/Users/mac360_xamarin/Desktop/untitled folder/TestProject 2/UnifiedTest/UnifiedTest/UnifiedTest.csproj" ("/Library/Frameworks/Mono.framework/External/xbuild/Xamarin/iOS/Xamarin.iOS.Common.targets"); "_CreateAppBundle" depends on it.
Target _CopyContentToBundle:
Target _CopyContentToBundle needs to be built as input file 'obj/iPhoneSimulator/Debug/ibtool/DiscoveryViewControlleriPad.nib' does not exist.
Task "Copy"
Using task Copy from Microsoft.Build.Tasks.Copy, Xamarin.iOS.Tasks, Version=0.0.0.0, Culture=neutral, PublicKeyToken=null
/Library/Frameworks/Mono.framework/External/xbuild/Xamarin/iOS/Xamarin.iOS.Common.targets: error : Cannot copy /Users/mac360_xamarin/Desktop/untitled folder/TestProject 2/UnifiedTest/UnifiedTest/obj/iPhoneSimulator/Debug/ibtool/DiscoveryViewControlleriPad.nib to /Users/mac360_xamarin/Desktop/untitled folder/TestProject 2/UnifiedTest/UnifiedTest/bin/iPhoneSimulator/Debug/UnifiedTest.app/DiscoveryViewControlleriPad.nib, as the source file doesn't exist.
Creating directory '/Users/mac360_xamarin/Desktop/untitled folder/TestProject 2/UnifiedTest/UnifiedTest/bin/iPhoneSimulator/Debug/UnifiedTest.app'
Copying file from '/Users/mac360_xamarin/Desktop/untitled folder/TestProject 2/UnifiedTest/UnifiedTest/obj/iPhoneSimulator/Debug/Default-568h@2x.png' to '/Users/mac360_xamarin/Desktop/untitled folder/TestProject 2/UnifiedTest/UnifiedTest/bin/iPhoneSimulator/Debug/UnifiedTest.app/Default-568h@2x.png'
Task "Copy" execution -- FAILED
Done building target "_CopyContentToBundle" in project "/Users/mac360_xamarin/Desktop/untitled folder/TestProject 2/UnifiedTest/UnifiedTest/UnifiedTest.csproj".-- FAILED
Done building target "_CopyContentToBundle" in project "/Users/mac360_xamarin/Desktop/untitled folder/TestProject 2/UnifiedTest/UnifiedTest/UnifiedTest.csproj" ("/Library/Frameworks/Mono.framework/External/xbuild/Xamarin/iOS/Xamarin.iOS.Common.targets"); "_CreateAppBundle" depends on it.
Done building target "_CreateAppBundle" in project "/Users/mac360_xamarin/Desktop/untitled folder/TestProject 2/UnifiedTest/UnifiedTest/UnifiedTest.csproj" ("/Library/Frameworks/Mono.framework/External/xbuild/Xamarin/iOS/Xamarin.iOS.Common.targets"); "Build" depends on it.
Done building target "Build" in project "/Users/mac360_xamarin/Desktop/untitled folder/TestProject 2/UnifiedTest/UnifiedTest/UnifiedTest.csproj" ("/Library/Frameworks/Mono.framework/Versions/3.12.0/lib/mono/4.5/Microsoft.Common.targets").
Done building project "/Users/mac360_xamarin/Desktop/untitled folder/TestProject 2/UnifiedTest/UnifiedTest/UnifiedTest.csproj".-- FAILED
Target perfomance summary:
0.729 ms _AddCorlibReference 1 calls
0.854 ms _AfterCoreOptimizePngImages 1 calls
1.211 ms _CollectBundleResources 1 calls
1.212 ms _CollectColladaAssets 1 calls
0.927 ms _CollectITunesArtwork 1 calls
0.392 ms _CollectPngImages 1 calls
7.481 ms _CopyContentToBundle 1 calls
0.246 ms _CoreCompileColladaAssets 1 calls
0.167 ms _CoreCompileImageAssets 1 calls
2.015 ms _CoreCompileInterfaceDefinitions 1 calls
1.566 ms _CoreCompileSceneKitAssets 1 calls
1.507 ms _CoreCompileTextureAtlases 1 calls
63.295 ms _CoreOptimizePngImages 1 calls
1.142 ms _DetectAppManifest 1 calls
1.889 ms _DetectSdkLocations 1 calls
3.199 ms _DetectSigningIdentity 1 calls
0.047 ms _GenerateBundleName 1 calls
1.282 ms _GetCompileOutputsForClean 1 calls
3.402 ms _RecordCleanFile 1 calls
0.137 ms _SeparateAppExtensionReferences 1 calls
4.179 ms _UnpackLibraryResources 1 calls
0.132 ms _ValidateEssentialProperties 1 calls
1.101 ms AssignTargetPaths 1 calls
0.688 ms CopyFilesMarkedCopyLocal 1 calls
231.166 ms CoreCompile 1 calls
0.181 ms CreateManifestResourceNames 1 calls
2.766 ms DeployOutputFiles 1 calls
0.165 ms GenerateResources 1 calls
0.371 ms GenerateSatelliteAssemblies 1 calls
1.422 ms GenerateTargetFrameworkMonikerAttribute 1 calls
0.980 ms GetCopyToOutputDirectoryItems 1 calls
3.829 ms GetReferenceAssemblyPaths 1 calls
4.160 ms ImplicitlyExpandDesignTimeFacades 1 calls
1.380 ms PrepareForBuild 1 calls
6.518 ms ResolveAssemblyReferences 1 calls
0.232 ms ResolveProjectReferences 1 calls
0.094 ms SplitProjectReferencesByExistent 1 calls
1.416 ms SplitResourcesByCulture 1 calls
Tasks perfomance summary:
0.339 ms AssignCulture 1 calls
0.846 ms AssignTargetPath 3 calls
2.078 ms CollectBundleResourcesTask 2 calls
0.733 ms CollectITunesArtworkTask 1 calls
1.361 ms CompileSceneKitAssetsTask 1 calls
9.571 ms Copy 4 calls
2.678 ms CreateItem 7 calls
0.342 ms CreateProperty 1 calls
229.961 ms Csc 1 calls
1.736 ms DetectSdkLocationsTask 1 calls
1.616 ms DetectSigningIdentityTask 1 calls
0.242 ms FindAppConfigFile 1 calls
0.943 ms FindItemWithLogicalNameTask 1 calls
0.350 ms FindUnderPath 1 calls
0.735 ms GetReferenceAssemblyPaths 1 calls
1.803 ms IBToolTask 1 calls
0.488 ms MakeDir 1 calls
0.364 ms Message 1 calls
62.647 ms OptimizeImageTask 1 calls
1.210 ms ReadLinesFromFile 2 calls
1.112 ms RemoveDuplicates 1 calls
5.412 ms ResolveAssemblyReference 1 calls
1.291 ms TextureAtlasTask 1 calls
3.892 ms UnpackLibraryResourcesTask 1 calls
1.401 ms WriteLinesToFile 2 calls
Build FAILED.
Errors:
/Users/mac360_xamarin/Desktop/untitled folder/TestProject 2/UnifiedTest/UnifiedTest/UnifiedTest.csproj (Build) ->
/Library/Frameworks/Mono.framework/External/xbuild/Xamarin/iOS/Xamarin.iOS.Common.targets (_CopyContentToBundle target) ->
/Library/Frameworks/Mono.framework/External/xbuild/Xamarin/iOS/Xamarin.iOS.Common.targets: error : Cannot copy /Users/mac360_xamarin/Desktop/untitled folder/TestProject 2/UnifiedTest/UnifiedTest/obj/iPhoneSimulator/Debug/ibtool/DiscoveryViewControlleriPad.nib to /Users/mac360_xamarin/Desktop/untitled folder/TestProject 2/UnifiedTest/UnifiedTest/bin/iPhoneSimulator/Debug/UnifiedTest.app/DiscoveryViewControlleriPad.nib, as the source file doesn't exist.
0 Warning(s)
1 Error(s)
Time Elapsed 00:00:00.4032780
---------------------- Done ----------------------
Build: 1 error, 0 warnings
Sign up for free to join this conversation on GitHub. Already have an account? Sign in to comment