Create a gist now

Instantly share code, notes, and snippets.

What would you like to do?
RubySpec を走らせる

RubySpec とは

RubySpec は Ruby で動くコードによって Ruby そのものの挙動を記述しようとするテストの集まりです。詳しくは http://rubyspec.org

これを動かしてみましょう。

RubySpec をクローンする。

git clone git://github.com/rubyspec/rubyspec.git

RubySpec を動かす為のライブラリである mspec をクローンする。

git clone git://github.com/rubyspec/mspec.git

実際に RubySpec を走らせる。

ruby1.9 mspec/bin/mspec -t r19 -B rubyspec/ruby.2.0.mspec rubyspec

-t はターゲットとなり RubySpec を動かす Ruby を指定します。

j で JRuby、x で Rubinius といった具合です。ここでは MRI 1.9 (実際には trunk を用いているので 2.0.0dev) を指定しています。

$ ruby1.9 mspec/bin/mspec -t r19 rubyspec
ruby 2.0.0dev (2011-11-21 trunk 33804) [x86_64-darwin11.2.0]
........................................................................................................................................................................................E......................................................................................................................................................................................................................................................................................................................................................................E........................................F......................................................................................................................................................................................................................................................................F.........F.........................................................................................................................................................................................................................................................................................................................................F..........................................................................................................................................................F..........................................................................................................................................................................................................................................................................................................................................................................................................................................................................................................................................................................................................................................................................................................................................................................................................................................................E............................................................................................................................................................................FF....E.........................................................................................................................................................................................................................................................................................................................................................................................................................................................................................................................................................................................................................................................................................................................................................................................................................................F..........................F..FF.F..F..FEFFFFFF........................................................................................................................................................................................................................................................................................................................F.........................[!] Compiling Ruby-FFI fixtures
cc -O2 -fno-omit-frame-pointer -fno-strict-aliasing -W -Werror -Wall -Wno-unused -Wno-parentheses -I"build" -D_REENTRANT -arch ppc -DTARGET_RT_MAC_CFM=0 -fno-common -c fixtures/Benchmark.c -o fixtures/build/libtest/Benchmark.o
gcc-4.2: error trying to exec '/usr/bin/powerpc-apple-darwin11-gcc-4.2.1': execvp: No such file or directory
make: *** [fixtures/build/libtest/Benchmark.o] Error 255
E[!] Compiling Ruby-FFI fixtures
cc -O2 -fno-omit-frame-pointer -fno-strict-aliasing -W -Werror -Wall -Wno-unused -Wno-parentheses -I"build" -D_REENTRANT -arch ppc -DTARGET_RT_MAC_CFM=0 -fno-common -c fixtures/Benchmark.c -o fixtures/build/libtest/Benchmark.o
gcc-4.2: error trying to exec '/usr/bin/powerpc-apple-darwin11-gcc-4.2.1': execvp: No such file or directory
make: *** [fixtures/build/libtest/Benchmark.o] Error 255
E[!] Compiling Ruby-FFI fixtures
cc -O2 -fno-omit-frame-pointer -fno-strict-aliasing -W -Werror -Wall -Wno-unused -Wno-parentheses -I"build" -D_REENTRANT -arch ppc -DTARGET_RT_MAC_CFM=0 -fno-common -c fixtures/Benchmark.c -o fixtures/build/libtest/Benchmark.o
gcc-4.2: error trying to exec '/usr/bin/powerpc-apple-darwin11-gcc-4.2.1': execvp: No such file or directory
make: *** [fixtures/build/libtest/Benchmark.o] Error 255
E[!] Compiling Ruby-FFI fixtures
cc -O2 -fno-omit-frame-pointer -fno-strict-aliasing -W -Werror -Wall -Wno-unused -Wno-parentheses -I"build" -D_REENTRANT -arch ppc -DTARGET_RT_MAC_CFM=0 -fno-common -c fixtures/Benchmark.c -o fixtures/build/libtest/Benchmark.o
gcc-4.2: error trying to exec '/usr/bin/powerpc-apple-darwin11-gcc-4.2.1': execvp: No such file or directory
make: *** [fixtures/build/libtest/Benchmark.o] Error 255
E[!] Compiling Ruby-FFI fixtures
cc -O2 -fno-omit-frame-pointer -fno-strict-aliasing -W -Werror -Wall -Wno-unused -Wno-parentheses -I"build" -D_REENTRANT -arch ppc -DTARGET_RT_MAC_CFM=0 -fno-common -c fixtures/Benchmark.c -o fixtures/build/libtest/Benchmark.o
gcc-4.2: error trying to exec '/usr/bin/powerpc-apple-darwin11-gcc-4.2.1': execvp: No such file or directory
make: *** [fixtures/build/libtest/Benchmark.o] Error 255
E[!] Compiling Ruby-FFI fixtures
cc -O2 -fno-omit-frame-pointer -fno-strict-aliasing -W -Werror -Wall -Wno-unused -Wno-parentheses -I"build" -D_REENTRANT -arch ppc -DTARGET_RT_MAC_CFM=0 -fno-common -c fixtures/Benchmark.c -o fixtures/build/libtest/Benchmark.o
gcc-4.2: error trying to exec '/usr/bin/powerpc-apple-darwin11-gcc-4.2.1': execvp: No such file or directory
make: *** [fixtures/build/libtest/Benchmark.o] Error 255
E[!] Compiling Ruby-FFI fixtures
cc -O2 -fno-omit-frame-pointer -fno-strict-aliasing -W -Werror -Wall -Wno-unused -Wno-parentheses -I"build" -D_REENTRANT -arch ppc -DTARGET_RT_MAC_CFM=0 -fno-common -c fixtures/Benchmark.c -o fixtures/build/libtest/Benchmark.o
gcc-4.2: error trying to exec '/usr/bin/powerpc-apple-darwin11-gcc-4.2.1': execvp: No such file or directory
make: *** [fixtures/build/libtest/Benchmark.o] Error 255
E[!] Compiling Ruby-FFI fixtures
cc -O2 -fno-omit-frame-pointer -fno-strict-aliasing -W -Werror -Wall -Wno-unused -Wno-parentheses -I"build" -D_REENTRANT -arch ppc -DTARGET_RT_MAC_CFM=0 -fno-common -c fixtures/Benchmark.c -o fixtures/build/libtest/Benchmark.o
gcc-4.2: error trying to exec '/usr/bin/powerpc-apple-darwin11-gcc-4.2.1': execvp: No such file or directory
make: *** [fixtures/build/libtest/Benchmark.o] Error 255
E[!] Compiling Ruby-FFI fixtures
cc -O2 -fno-omit-frame-pointer -fno-strict-aliasing -W -Werror -Wall -Wno-unused -Wno-parentheses -I"build" -D_REENTRANT -arch ppc -DTARGET_RT_MAC_CFM=0 -fno-common -c fixtures/Benchmark.c -o fixtures/build/libtest/Benchmark.o
gcc-4.2: error trying to exec '/usr/bin/powerpc-apple-darwin11-gcc-4.2.1': execvp: No such file or directory
make: *** [fixtures/build/libtest/Benchmark.o] Error 255
E[!] Compiling Ruby-FFI fixtures
cc -O2 -fno-omit-frame-pointer -fno-strict-aliasing -W -Werror -Wall -Wno-unused -Wno-parentheses -I"build" -D_REENTRANT -arch ppc -DTARGET_RT_MAC_CFM=0 -fno-common -c fixtures/Benchmark.c -o fixtures/build/libtest/Benchmark.o
gcc-4.2: error trying to exec '/usr/bin/powerpc-apple-darwin11-gcc-4.2.1': execvp: No such file or directory
make: *** [fixtures/build/libtest/Benchmark.o] Error 255
E[!] Compiling Ruby-FFI fixtures
cc -O2 -fno-omit-frame-pointer -fno-strict-aliasing -W -Werror -Wall -Wno-unused -Wno-parentheses -I"build" -D_REENTRANT -arch ppc -DTARGET_RT_MAC_CFM=0 -fno-common -c fixtures/Benchmark.c -o fixtures/build/libtest/Benchmark.o
gcc-4.2: error trying to exec '/usr/bin/powerpc-apple-darwin11-gcc-4.2.1': execvp: No such file or directory
make: *** [fixtures/build/libtest/Benchmark.o] Error 255
E[!] Compiling Ruby-FFI fixtures
cc -O2 -fno-omit-frame-pointer -fno-strict-aliasing -W -Werror -Wall -Wno-unused -Wno-parentheses -I"build" -D_REENTRANT -arch ppc -DTARGET_RT_MAC_CFM=0 -fno-common -c fixtures/Benchmark.c -o fixtures/build/libtest/Benchmark.o
gcc-4.2: error trying to exec '/usr/bin/powerpc-apple-darwin11-gcc-4.2.1': execvp: No such file or directory
make: *** [fixtures/build/libtest/Benchmark.o] Error 255
E[!] Compiling Ruby-FFI fixtures
cc -O2 -fno-omit-frame-pointer -fno-strict-aliasing -W -Werror -Wall -Wno-unused -Wno-parentheses -I"build" -D_REENTRANT -arch ppc -DTARGET_RT_MAC_CFM=0 -fno-common -c fixtures/Benchmark.c -o fixtures/build/libtest/Benchmark.o
gcc-4.2: error trying to exec '/usr/bin/powerpc-apple-darwin11-gcc-4.2.1': execvp: No such file or directory
make: *** [fixtures/build/libtest/Benchmark.o] Error 255
E[!] Compiling Ruby-FFI fixtures
cc -O2 -fno-omit-frame-pointer -fno-strict-aliasing -W -Werror -Wall -Wno-unused -Wno-parentheses -I"build" -D_REENTRANT -arch ppc -DTARGET_RT_MAC_CFM=0 -fno-common -c fixtures/Benchmark.c -o fixtures/build/libtest/Benchmark.o
gcc-4.2: error trying to exec '/usr/bin/powerpc-apple-darwin11-gcc-4.2.1': execvp: No such file or directory
make: *** [fixtures/build/libtest/Benchmark.o] Error 255
E[!] Compiling Ruby-FFI fixtures
cc -O2 -fno-omit-frame-pointer -fno-strict-aliasing -W -Werror -Wall -Wno-unused -Wno-parentheses -I"build" -D_REENTRANT -arch ppc -DTARGET_RT_MAC_CFM=0 -fno-common -c fixtures/Benchmark.c -o fixtures/build/libtest/Benchmark.o
gcc-4.2: error trying to exec '/usr/bin/powerpc-apple-darwin11-gcc-4.2.1': execvp: No such file or directory
make: *** [fixtures/build/libtest/Benchmark.o] Error 255
E[!] Compiling Ruby-FFI fixtures
cc -O2 -fno-omit-frame-pointer -fno-strict-aliasing -W -Werror -Wall -Wno-unused -Wno-parentheses -I"build" -D_REENTRANT -arch ppc -DTARGET_RT_MAC_CFM=0 -fno-common -c fixtures/Benchmark.c -o fixtures/build/libtest/Benchmark.o
gcc-4.2: error trying to exec '/usr/bin/powerpc-apple-darwin11-gcc-4.2.1': execvp: No such file or directory
make: *** [fixtures/build/libtest/Benchmark.o] Error 255
E[!] Compiling Ruby-FFI fixtures
cc -O2 -fno-omit-frame-pointer -fno-strict-aliasing -W -Werror -Wall -Wno-unused -Wno-parentheses -I"build" -D_REENTRANT -arch ppc -DTARGET_RT_MAC_CFM=0 -fno-common -c fixtures/Benchmark.c -o fixtures/build/libtest/Benchmark.o
gcc-4.2: error trying to exec '/usr/bin/powerpc-apple-darwin11-gcc-4.2.1': execvp: No such file or directory
make: *** [fixtures/build/libtest/Benchmark.o] Error 255
E[!] Compiling Ruby-FFI fixtures
cc -O2 -fno-omit-frame-pointer -fno-strict-aliasing -W -Werror -Wall -Wno-unused -Wno-parentheses -I"build" -D_REENTRANT -arch ppc -DTARGET_RT_MAC_CFM=0 -fno-common -c fixtures/Benchmark.c -o fixtures/build/libtest/Benchmark.o
gcc-4.2: error trying to exec '/usr/bin/powerpc-apple-darwin11-gcc-4.2.1': execvp: No such file or directory
make: *** [fixtures/build/libtest/Benchmark.o] Error 255
E
1)
Bignum#/ does NOT raise ZeroDivisionError if other is zero and is a Float ERROR
ZeroDivisionError: divided by 0
/Users/asari/rubyspec/core/bignum/divide_spec.rb:12:in `/'
/Users/asari/rubyspec/core/bignum/divide_spec.rb:12:in `block (2 levels) in <top (required)>'
/Users/asari/mspec/lib/mspec/runner/mspec.rb:68:in `instance_eval'
/Users/asari/mspec/lib/mspec/runner/mspec.rb:68:in `protect'
/Users/asari/mspec/lib/mspec/runner/context.rb:179:in `block in protect'
/Users/asari/mspec/lib/mspec/runner/context.rb:179:in `each'
/Users/asari/mspec/lib/mspec/runner/context.rb:179:in `all?'
/Users/asari/mspec/lib/mspec/runner/context.rb:179:in `protect'
/Users/asari/mspec/lib/mspec/runner/context.rb:207:in `block in process'
/Users/asari/mspec/lib/mspec/runner/context.rb:199:in `each'
/Users/asari/mspec/lib/mspec/runner/context.rb:199:in `process'
/Users/asari/mspec/lib/mspec/runner/mspec.rb:37:in `describe'
/Users/asari/mspec/lib/mspec/runner/object.rb:11:in `describe'
/Users/asari/rubyspec/core/bignum/divide_spec.rb:4:in `<top (required)>'
/Users/asari/mspec/lib/mspec/runner/mspec.rb:56:in `load'
/Users/asari/mspec/lib/mspec/runner/mspec.rb:56:in `block (2 levels) in files'
/Users/asari/mspec/lib/mspec/runner/mspec.rb:68:in `instance_eval'
/Users/asari/mspec/lib/mspec/runner/mspec.rb:68:in `protect'
/Users/asari/mspec/lib/mspec/runner/mspec.rb:56:in `block in files'
/Users/asari/mspec/lib/mspec/runner/mspec.rb:50:in `each'
/Users/asari/mspec/lib/mspec/runner/mspec.rb:50:in `files'
/Users/asari/mspec/lib/mspec/runner/mspec.rb:42:in `process'
/Users/asari/mspec/lib/mspec/commands/mspec-run.rb:87:in `run'
/Users/asari/mspec/lib/mspec/utils/script.rb:218:in `main'
/Users/asari/mspec/bin/mspec-run:8:in `<main>'
2)
An exception occurred during: loading /Users/asari/rubyspec/core/file/stat/chardev_spec.rb ERROR
Errno::EBADF: Bad file descriptor - /Users/asari/rubyspec/core/file/stat/chardev_spec.rb
/Users/asari/mspec/lib/mspec/runner/mspec.rb:56:in `load'
/Users/asari/mspec/lib/mspec/runner/mspec.rb:56:in `block (2 levels) in files'
/Users/asari/mspec/lib/mspec/runner/mspec.rb:68:in `instance_eval'
/Users/asari/mspec/lib/mspec/runner/mspec.rb:68:in `protect'
/Users/asari/mspec/lib/mspec/runner/mspec.rb:56:in `block in files'
/Users/asari/mspec/lib/mspec/runner/mspec.rb:50:in `each'
/Users/asari/mspec/lib/mspec/runner/mspec.rb:50:in `files'
/Users/asari/mspec/lib/mspec/runner/mspec.rb:42:in `process'
/Users/asari/mspec/lib/mspec/commands/mspec-run.rb:87:in `run'
/Users/asari/mspec/lib/mspec/utils/script.rb:218:in `main'
/Users/asari/mspec/bin/mspec-run:8:in `<main>'
3)
File#to_path preserves the encoding of the path FAILED
Expected #<Encoding:US-ASCII>
to equal #<Encoding:EUC-JP>
/Users/asari/mspec/lib/mspec/expectations/expectations.rb:15:in `fail_with'
/Users/asari/mspec/lib/mspec/matchers/base.rb:8:in `=='
/Users/asari/rubyspec/core/file/to_path_spec.rb:45:in `block (3 levels) in <top (required)>'
/Users/asari/mspec/lib/mspec/runner/mspec.rb:68:in `instance_eval'
/Users/asari/mspec/lib/mspec/runner/mspec.rb:68:in `protect'
/Users/asari/mspec/lib/mspec/runner/context.rb:179:in `block in protect'
/Users/asari/mspec/lib/mspec/runner/context.rb:179:in `each'
/Users/asari/mspec/lib/mspec/runner/context.rb:179:in `all?'
/Users/asari/mspec/lib/mspec/runner/context.rb:179:in `protect'
/Users/asari/mspec/lib/mspec/runner/context.rb:207:in `block in process'
/Users/asari/mspec/lib/mspec/runner/context.rb:199:in `each'
/Users/asari/mspec/lib/mspec/runner/context.rb:199:in `process'
/Users/asari/mspec/lib/mspec/runner/mspec.rb:37:in `describe'
/Users/asari/mspec/lib/mspec/runner/object.rb:11:in `describe'
/Users/asari/rubyspec/core/file/to_path_spec.rb:4:in `block in <top (required)>'
/Users/asari/mspec/lib/mspec/guards/version.rb:34:in `ruby_version_is'
/Users/asari/rubyspec/core/file/to_path_spec.rb:3:in `<top (required)>'
/Users/asari/mspec/lib/mspec/runner/mspec.rb:56:in `load'
/Users/asari/mspec/lib/mspec/runner/mspec.rb:56:in `block (2 levels) in files'
/Users/asari/mspec/lib/mspec/runner/mspec.rb:68:in `instance_eval'
/Users/asari/mspec/lib/mspec/runner/mspec.rb:68:in `protect'
/Users/asari/mspec/lib/mspec/runner/mspec.rb:56:in `block in files'
/Users/asari/mspec/lib/mspec/runner/mspec.rb:50:in `each'
/Users/asari/mspec/lib/mspec/runner/mspec.rb:50:in `files'
/Users/asari/mspec/lib/mspec/runner/mspec.rb:42:in `process'
/Users/asari/mspec/lib/mspec/commands/mspec-run.rb:87:in `run'
/Users/asari/mspec/lib/mspec/utils/script.rb:218:in `main'
/Users/asari/mspec/bin/mspec-run:8:in `<main>'
4)
IO#read with encodings ignores unicode encoding FAILED
Expected "Qui \xC3"
to equal "Qui \xC3"
/Users/asari/mspec/lib/mspec/expectations/expectations.rb:15:in `fail_with'
/Users/asari/mspec/lib/mspec/matchers/base.rb:8:in `=='
/Users/asari/rubyspec/core/io/read_spec.rb:285:in `block (2 levels) in <top (required)>'
/Users/asari/mspec/lib/mspec/runner/mspec.rb:68:in `instance_eval'
/Users/asari/mspec/lib/mspec/runner/mspec.rb:68:in `protect'
/Users/asari/mspec/lib/mspec/runner/context.rb:179:in `block in protect'
/Users/asari/mspec/lib/mspec/runner/context.rb:179:in `each'
/Users/asari/mspec/lib/mspec/runner/context.rb:179:in `all?'
/Users/asari/mspec/lib/mspec/runner/context.rb:179:in `protect'
/Users/asari/mspec/lib/mspec/runner/context.rb:207:in `block in process'
/Users/asari/mspec/lib/mspec/runner/context.rb:199:in `each'
/Users/asari/mspec/lib/mspec/runner/context.rb:199:in `process'
/Users/asari/mspec/lib/mspec/runner/mspec.rb:37:in `describe'
/Users/asari/mspec/lib/mspec/runner/object.rb:11:in `describe'
/Users/asari/rubyspec/core/io/read_spec.rb:273:in `<top (required)>'
/Users/asari/mspec/lib/mspec/runner/mspec.rb:56:in `load'
/Users/asari/mspec/lib/mspec/runner/mspec.rb:56:in `block (2 levels) in files'
/Users/asari/mspec/lib/mspec/runner/mspec.rb:68:in `instance_eval'
/Users/asari/mspec/lib/mspec/runner/mspec.rb:68:in `protect'
/Users/asari/mspec/lib/mspec/runner/mspec.rb:56:in `block in files'
/Users/asari/mspec/lib/mspec/runner/mspec.rb:50:in `each'
/Users/asari/mspec/lib/mspec/runner/mspec.rb:50:in `files'
/Users/asari/mspec/lib/mspec/runner/mspec.rb:42:in `process'
/Users/asari/mspec/lib/mspec/commands/mspec-run.rb:87:in `run'
/Users/asari/mspec/lib/mspec/utils/script.rb:218:in `main'
/Users/asari/mspec/bin/mspec-run:8:in `<main>'
5)
IO#set_encoding ignores the internal encoding if the same as external when passed Encoding objects FAILED
Expected #<Encoding:UTF-8> to be nil
/Users/asari/mspec/lib/mspec/expectations/expectations.rb:15:in `fail_with'
/Users/asari/mspec/lib/mspec/expectations/should.rb:8:in `should'
/Users/asari/rubyspec/core/io/set_encoding_spec.rb:38:in `block (4 levels) in <top (required)>'
/Users/asari/mspec/lib/mspec/runner/mspec.rb:68:in `instance_eval'
/Users/asari/mspec/lib/mspec/runner/mspec.rb:68:in `protect'
/Users/asari/mspec/lib/mspec/runner/context.rb:179:in `block in protect'
/Users/asari/mspec/lib/mspec/runner/context.rb:179:in `each'
/Users/asari/mspec/lib/mspec/runner/context.rb:179:in `all?'
/Users/asari/mspec/lib/mspec/runner/context.rb:179:in `protect'
/Users/asari/mspec/lib/mspec/runner/context.rb:207:in `block in process'
/Users/asari/mspec/lib/mspec/runner/context.rb:199:in `each'
/Users/asari/mspec/lib/mspec/runner/context.rb:199:in `process'
/Users/asari/mspec/lib/mspec/runner/mspec.rb:37:in `describe'
/Users/asari/mspec/lib/mspec/runner/object.rb:11:in `describe'
/Users/asari/rubyspec/core/io/set_encoding_spec.rb:4:in `block in <top (required)>'
/Users/asari/mspec/lib/mspec/guards/version.rb:34:in `ruby_version_is'
/Users/asari/rubyspec/core/io/set_encoding_spec.rb:3:in `<top (required)>'
/Users/asari/mspec/lib/mspec/runner/mspec.rb:56:in `load'
/Users/asari/mspec/lib/mspec/runner/mspec.rb:56:in `block (2 levels) in files'
/Users/asari/mspec/lib/mspec/runner/mspec.rb:68:in `instance_eval'
/Users/asari/mspec/lib/mspec/runner/mspec.rb:68:in `protect'
/Users/asari/mspec/lib/mspec/runner/mspec.rb:56:in `block in files'
/Users/asari/mspec/lib/mspec/runner/mspec.rb:50:in `each'
/Users/asari/mspec/lib/mspec/runner/mspec.rb:50:in `files'
/Users/asari/mspec/lib/mspec/runner/mspec.rb:42:in `process'
/Users/asari/mspec/lib/mspec/commands/mspec-run.rb:87:in `run'
/Users/asari/mspec/lib/mspec/utils/script.rb:218:in `main'
/Users/asari/mspec/bin/mspec-run:8:in `<main>'
6)
IO#set_encoding raises an ArgumentError if passed the name of a nonexistent Encoding FAILED
Expected ArgumentError but no exception was raised
/Users/asari/mspec/lib/mspec/expectations/expectations.rb:15:in `fail_with'
/Users/asari/mspec/lib/mspec/expectations/should.rb:8:in `should'
/Users/asari/rubyspec/core/io/set_encoding_spec.rb:60:in `block (4 levels) in <top (required)>'
/Users/asari/mspec/lib/mspec/runner/mspec.rb:68:in `instance_eval'
/Users/asari/mspec/lib/mspec/runner/mspec.rb:68:in `protect'
/Users/asari/mspec/lib/mspec/runner/context.rb:179:in `block in protect'
/Users/asari/mspec/lib/mspec/runner/context.rb:179:in `each'
/Users/asari/mspec/lib/mspec/runner/context.rb:179:in `all?'
/Users/asari/mspec/lib/mspec/runner/context.rb:179:in `protect'
/Users/asari/mspec/lib/mspec/runner/context.rb:207:in `block in process'
/Users/asari/mspec/lib/mspec/runner/context.rb:199:in `each'
/Users/asari/mspec/lib/mspec/runner/context.rb:199:in `process'
/Users/asari/mspec/lib/mspec/runner/mspec.rb:37:in `describe'
/Users/asari/mspec/lib/mspec/runner/object.rb:11:in `describe'
/Users/asari/rubyspec/core/io/set_encoding_spec.rb:4:in `block in <top (required)>'
/Users/asari/mspec/lib/mspec/guards/version.rb:34:in `ruby_version_is'
/Users/asari/rubyspec/core/io/set_encoding_spec.rb:3:in `<top (required)>'
/Users/asari/mspec/lib/mspec/runner/mspec.rb:56:in `load'
/Users/asari/mspec/lib/mspec/runner/mspec.rb:56:in `block (2 levels) in files'
/Users/asari/mspec/lib/mspec/runner/mspec.rb:68:in `instance_eval'
/Users/asari/mspec/lib/mspec/runner/mspec.rb:68:in `protect'
/Users/asari/mspec/lib/mspec/runner/mspec.rb:56:in `block in files'
/Users/asari/mspec/lib/mspec/runner/mspec.rb:50:in `each'
/Users/asari/mspec/lib/mspec/runner/mspec.rb:50:in `files'
/Users/asari/mspec/lib/mspec/runner/mspec.rb:42:in `process'
/Users/asari/mspec/lib/mspec/commands/mspec-run.rb:87:in `run'
/Users/asari/mspec/lib/mspec/utils/script.rb:218:in `main'
/Users/asari/mspec/bin/mspec-run:8:in `<main>'
7)
Numeric#step Numeric#step with [stop, +step] when self, stop or step is a Float is careful about not yielding a value greater than limit FAILED
Expected [1.0, 2.3, 3.6, 4.9, 6.2, 7.5, 8.8, 10.1, 11.4, 12.700000000000001]
to have same value and type as [1.0, 2.3, 3.6, 4.9, 6.2, 7.5, 8.8, 10.1, 11.4, 12.7]
/Users/asari/mspec/lib/mspec/expectations/expectations.rb:15:in `fail_with'
/Users/asari/mspec/lib/mspec/expectations/should.rb:8:in `should'
/Users/asari/rubyspec/core/numeric/step_spec.rb:158:in `block (4 levels) in <top (required)>'
/Users/asari/mspec/lib/mspec/runner/mspec.rb:68:in `instance_eval'
/Users/asari/mspec/lib/mspec/runner/mspec.rb:68:in `protect'
/Users/asari/mspec/lib/mspec/runner/context.rb:179:in `block in protect'
/Users/asari/mspec/lib/mspec/runner/context.rb:179:in `each'
/Users/asari/mspec/lib/mspec/runner/context.rb:179:in `all?'
/Users/asari/mspec/lib/mspec/runner/context.rb:179:in `protect'
/Users/asari/mspec/lib/mspec/runner/context.rb:207:in `block in process'
/Users/asari/mspec/lib/mspec/runner/context.rb:199:in `each'
/Users/asari/mspec/lib/mspec/runner/context.rb:199:in `process'
/Users/asari/mspec/lib/mspec/runner/context.rb:228:in `block in process'
/Users/asari/mspec/lib/mspec/runner/context.rb:228:in `each'
/Users/asari/mspec/lib/mspec/runner/context.rb:228:in `process'
/Users/asari/mspec/lib/mspec/runner/mspec.rb:37:in `describe'
/Users/asari/mspec/lib/mspec/runner/object.rb:11:in `describe'
/Users/asari/rubyspec/core/numeric/step_spec.rb:4:in `<top (required)>'
/Users/asari/mspec/lib/mspec/runner/mspec.rb:56:in `load'
/Users/asari/mspec/lib/mspec/runner/mspec.rb:56:in `block (2 levels) in files'
/Users/asari/mspec/lib/mspec/runner/mspec.rb:68:in `instance_eval'
/Users/asari/mspec/lib/mspec/runner/mspec.rb:68:in `protect'
/Users/asari/mspec/lib/mspec/runner/mspec.rb:56:in `block in files'
/Users/asari/mspec/lib/mspec/runner/mspec.rb:50:in `each'
/Users/asari/mspec/lib/mspec/runner/mspec.rb:50:in `files'
/Users/asari/mspec/lib/mspec/runner/mspec.rb:42:in `process'
/Users/asari/mspec/lib/mspec/commands/mspec-run.rb:87:in `run'
/Users/asari/mspec/lib/mspec/utils/script.rb:218:in `main'
/Users/asari/mspec/bin/mspec-run:8:in `<main>'
8)
Numeric#step Numeric#step with [stop, -step] when self, stop or step is a Float is careful about not yielding a value smaller than limit FAILED
Expected [-1.0, -2.3, -3.6, -4.9, -6.2, -7.5, -8.8, -10.1, -11.4, -12.700000000000001]
to have same value and type as [-1.0, -2.3, -3.6, -4.9, -6.2, -7.5, -8.8, -10.1, -11.4, -12.7]
/Users/asari/mspec/lib/mspec/expectations/expectations.rb:15:in `fail_with'
/Users/asari/mspec/lib/mspec/expectations/should.rb:8:in `should'
/Users/asari/rubyspec/core/numeric/step_spec.rb:183:in `block (4 levels) in <top (required)>'
/Users/asari/mspec/lib/mspec/runner/mspec.rb:68:in `instance_eval'
/Users/asari/mspec/lib/mspec/runner/mspec.rb:68:in `protect'
/Users/asari/mspec/lib/mspec/runner/context.rb:179:in `block in protect'
/Users/asari/mspec/lib/mspec/runner/context.rb:179:in `each'
/Users/asari/mspec/lib/mspec/runner/context.rb:179:in `all?'
/Users/asari/mspec/lib/mspec/runner/context.rb:179:in `protect'
/Users/asari/mspec/lib/mspec/runner/context.rb:207:in `block in process'
/Users/asari/mspec/lib/mspec/runner/context.rb:199:in `each'
/Users/asari/mspec/lib/mspec/runner/context.rb:199:in `process'
/Users/asari/mspec/lib/mspec/runner/context.rb:228:in `block in process'
/Users/asari/mspec/lib/mspec/runner/context.rb:228:in `each'
/Users/asari/mspec/lib/mspec/runner/context.rb:228:in `process'
/Users/asari/mspec/lib/mspec/runner/mspec.rb:37:in `describe'
/Users/asari/mspec/lib/mspec/runner/object.rb:11:in `describe'
/Users/asari/rubyspec/core/numeric/step_spec.rb:4:in `<top (required)>'
/Users/asari/mspec/lib/mspec/runner/mspec.rb:56:in `load'
/Users/asari/mspec/lib/mspec/runner/mspec.rb:56:in `block (2 levels) in files'
/Users/asari/mspec/lib/mspec/runner/mspec.rb:68:in `instance_eval'
/Users/asari/mspec/lib/mspec/runner/mspec.rb:68:in `protect'
/Users/asari/mspec/lib/mspec/runner/mspec.rb:56:in `block in files'
/Users/asari/mspec/lib/mspec/runner/mspec.rb:50:in `each'
/Users/asari/mspec/lib/mspec/runner/mspec.rb:50:in `files'
/Users/asari/mspec/lib/mspec/runner/mspec.rb:42:in `process'
/Users/asari/mspec/lib/mspec/commands/mspec-run.rb:87:in `run'
/Users/asari/mspec/lib/mspec/utils/script.rb:218:in `main'
/Users/asari/mspec/bin/mspec-run:8:in `<main>'
9)
Range#step with inclusive end and Float values returns Float values of 'step * n + begin <= end' FAILED
Expected [1.0,
2.8,
4.6,
6.4,
1.0,
2.3,
3.6,
4.9,
6.2,
7.5,
8.8,
10.1,
11.4,
12.700000000000001]
to have same value and type as [1.0, 2.8, 4.6, 6.4, 1.0, 2.3, 3.6, 4.9, 6.2, 7.5, 8.8, 10.1, 11.4, 12.7]
/Users/asari/mspec/lib/mspec/expectations/expectations.rb:15:in `fail_with'
/Users/asari/mspec/lib/mspec/expectations/should.rb:8:in `should'
/Users/asari/rubyspec/core/range/step_spec.rb:126:in `block (5 levels) in <top (required)>'
/Users/asari/mspec/lib/mspec/runner/mspec.rb:68:in `instance_eval'
/Users/asari/mspec/lib/mspec/runner/mspec.rb:68:in `protect'
/Users/asari/mspec/lib/mspec/runner/context.rb:179:in `block in protect'
/Users/asari/mspec/lib/mspec/runner/context.rb:179:in `each'
/Users/asari/mspec/lib/mspec/runner/context.rb:179:in `all?'
/Users/asari/mspec/lib/mspec/runner/context.rb:179:in `protect'
/Users/asari/mspec/lib/mspec/runner/context.rb:207:in `block in process'
/Users/asari/mspec/lib/mspec/runner/context.rb:199:in `each'
/Users/asari/mspec/lib/mspec/runner/context.rb:199:in `process'
/Users/asari/mspec/lib/mspec/runner/context.rb:228:in `block in process'
/Users/asari/mspec/lib/mspec/runner/context.rb:228:in `each'
/Users/asari/mspec/lib/mspec/runner/context.rb:228:in `process'
/Users/asari/mspec/lib/mspec/runner/context.rb:228:in `block in process'
/Users/asari/mspec/lib/mspec/runner/context.rb:228:in `each'
/Users/asari/mspec/lib/mspec/runner/context.rb:228:in `process'
/Users/asari/mspec/lib/mspec/runner/mspec.rb:37:in `describe'
/Users/asari/mspec/lib/mspec/runner/object.rb:11:in `describe'
/Users/asari/rubyspec/core/range/step_spec.rb:3:in `<top (required)>'
/Users/asari/mspec/lib/mspec/runner/mspec.rb:56:in `load'
/Users/asari/mspec/lib/mspec/runner/mspec.rb:56:in `block (2 levels) in files'
/Users/asari/mspec/lib/mspec/runner/mspec.rb:68:in `instance_eval'
/Users/asari/mspec/lib/mspec/runner/mspec.rb:68:in `protect'
/Users/asari/mspec/lib/mspec/runner/mspec.rb:56:in `block in files'
/Users/asari/mspec/lib/mspec/runner/mspec.rb:50:in `each'
/Users/asari/mspec/lib/mspec/runner/mspec.rb:50:in `files'
/Users/asari/mspec/lib/mspec/runner/mspec.rb:42:in `process'
/Users/asari/mspec/lib/mspec/commands/mspec-run.rb:87:in `run'
/Users/asari/mspec/lib/mspec/utils/script.rb:218:in `main'
/Users/asari/mspec/bin/mspec-run:8:in `<main>'
10)
Range#step with exclusive end and Float values returns Float values of 'step * n + begin < end' FAILED
Expected [1.0, 2.8, 4.6, 1.0, 19.2, 37.4, 55.599999999999994]
to have same value and type as [1.0, 2.8, 4.6, 1.0, 19.2, 37.4]
/Users/asari/mspec/lib/mspec/expectations/expectations.rb:15:in `fail_with'
/Users/asari/mspec/lib/mspec/expectations/should.rb:8:in `should'
/Users/asari/rubyspec/core/range/step_spec.rb:268:in `block (5 levels) in <top (required)>'
/Users/asari/mspec/lib/mspec/runner/mspec.rb:68:in `instance_eval'
/Users/asari/mspec/lib/mspec/runner/mspec.rb:68:in `protect'
/Users/asari/mspec/lib/mspec/runner/context.rb:179:in `block in protect'
/Users/asari/mspec/lib/mspec/runner/context.rb:179:in `each'
/Users/asari/mspec/lib/mspec/runner/context.rb:179:in `all?'
/Users/asari/mspec/lib/mspec/runner/context.rb:179:in `protect'
/Users/asari/mspec/lib/mspec/runner/context.rb:207:in `block in process'
/Users/asari/mspec/lib/mspec/runner/context.rb:199:in `each'
/Users/asari/mspec/lib/mspec/runner/context.rb:199:in `process'
/Users/asari/mspec/lib/mspec/runner/context.rb:228:in `block in process'
/Users/asari/mspec/lib/mspec/runner/context.rb:228:in `each'
/Users/asari/mspec/lib/mspec/runner/context.rb:228:in `process'
/Users/asari/mspec/lib/mspec/runner/context.rb:228:in `block in process'
/Users/asari/mspec/lib/mspec/runner/context.rb:228:in `each'
/Users/asari/mspec/lib/mspec/runner/context.rb:228:in `process'
/Users/asari/mspec/lib/mspec/runner/mspec.rb:37:in `describe'
/Users/asari/mspec/lib/mspec/runner/object.rb:11:in `describe'
/Users/asari/rubyspec/core/range/step_spec.rb:3:in `<top (required)>'
/Users/asari/mspec/lib/mspec/runner/mspec.rb:56:in `load'
/Users/asari/mspec/lib/mspec/runner/mspec.rb:56:in `block (2 levels) in files'
/Users/asari/mspec/lib/mspec/runner/mspec.rb:68:in `instance_eval'
/Users/asari/mspec/lib/mspec/runner/mspec.rb:68:in `protect'
/Users/asari/mspec/lib/mspec/runner/mspec.rb:56:in `block in files'
/Users/asari/mspec/lib/mspec/runner/mspec.rb:50:in `each'
/Users/asari/mspec/lib/mspec/runner/mspec.rb:50:in `files'
/Users/asari/mspec/lib/mspec/runner/mspec.rb:42:in `process'
/Users/asari/mspec/lib/mspec/commands/mspec-run.rb:87:in `run'
/Users/asari/mspec/lib/mspec/utils/script.rb:218:in `main'
/Users/asari/mspec/bin/mspec-run:8:in `<main>'
11)
Delegator#methods returns singleton methods when passed false ERROR
ArgumentError: wrong number of arguments (1 for 0)
/usr/local/ruby1.9/lib/ruby/1.9.1/delegate.rb:95:in `methods'
/Users/asari/rubyspec/library/delegate/delegator/methods_spec.rb:44:in `block (4 levels) in <top (required)>'
/Users/asari/mspec/lib/mspec/runner/mspec.rb:68:in `instance_eval'
/Users/asari/mspec/lib/mspec/runner/mspec.rb:68:in `protect'
/Users/asari/mspec/lib/mspec/runner/context.rb:179:in `block in protect'
/Users/asari/mspec/lib/mspec/runner/context.rb:179:in `each'
/Users/asari/mspec/lib/mspec/runner/context.rb:179:in `all?'
/Users/asari/mspec/lib/mspec/runner/context.rb:179:in `protect'
/Users/asari/mspec/lib/mspec/runner/context.rb:207:in `block in process'
/Users/asari/mspec/lib/mspec/runner/context.rb:199:in `each'
/Users/asari/mspec/lib/mspec/runner/context.rb:199:in `process'
/Users/asari/mspec/lib/mspec/runner/mspec.rb:37:in `describe'
/Users/asari/mspec/lib/mspec/runner/object.rb:11:in `describe'
/Users/asari/rubyspec/library/delegate/delegator/methods_spec.rb:4:in `<top (required)>'
/Users/asari/mspec/lib/mspec/runner/mspec.rb:56:in `load'
/Users/asari/mspec/lib/mspec/runner/mspec.rb:56:in `block (2 levels) in files'
/Users/asari/mspec/lib/mspec/runner/mspec.rb:68:in `instance_eval'
/Users/asari/mspec/lib/mspec/runner/mspec.rb:68:in `protect'
/Users/asari/mspec/lib/mspec/runner/mspec.rb:56:in `block in files'
/Users/asari/mspec/lib/mspec/runner/mspec.rb:50:in `each'
/Users/asari/mspec/lib/mspec/runner/mspec.rb:50:in `files'
/Users/asari/mspec/lib/mspec/runner/mspec.rb:42:in `process'
/Users/asari/mspec/lib/mspec/commands/mspec-run.rb:87:in `run'
/Users/asari/mspec/lib/mspec/utils/script.rb:218:in `main'
/Users/asari/mspec/bin/mspec-run:8:in `<main>'
12)
Iconv#close returns a string containing the byte sequence to change the output buffer to its initial shift state FAILED
Expected "\e\x28\x42"
to equal "\e(B"
/Users/asari/mspec/lib/mspec/expectations/expectations.rb:15:in `fail_with'
/Users/asari/mspec/lib/mspec/matchers/base.rb:8:in `=='
/Users/asari/rubyspec/library/iconv/close_spec.rb:20:in `block (3 levels) in <top (required)>'
/Users/asari/rubyspec/library/iconv/close_spec.rb:18:in `open'
/Users/asari/rubyspec/library/iconv/close_spec.rb:18:in `block (2 levels) in <top (required)>'
/Users/asari/mspec/lib/mspec/runner/mspec.rb:68:in `instance_eval'
/Users/asari/mspec/lib/mspec/runner/mspec.rb:68:in `protect'
/Users/asari/mspec/lib/mspec/runner/context.rb:179:in `block in protect'
/Users/asari/mspec/lib/mspec/runner/context.rb:179:in `each'
/Users/asari/mspec/lib/mspec/runner/context.rb:179:in `all?'
/Users/asari/mspec/lib/mspec/runner/context.rb:179:in `protect'
/Users/asari/mspec/lib/mspec/runner/context.rb:207:in `block in process'
/Users/asari/mspec/lib/mspec/runner/context.rb:199:in `each'
/Users/asari/mspec/lib/mspec/runner/context.rb:199:in `process'
/Users/asari/mspec/lib/mspec/runner/mspec.rb:37:in `describe'
/Users/asari/mspec/lib/mspec/runner/object.rb:11:in `describe'
/Users/asari/rubyspec/library/iconv/close_spec.rb:4:in `<top (required)>'
/Users/asari/mspec/lib/mspec/runner/mspec.rb:56:in `load'
/Users/asari/mspec/lib/mspec/runner/mspec.rb:56:in `block (2 levels) in files'
/Users/asari/mspec/lib/mspec/runner/mspec.rb:68:in `instance_eval'
/Users/asari/mspec/lib/mspec/runner/mspec.rb:68:in `protect'
/Users/asari/mspec/lib/mspec/runner/mspec.rb:56:in `block in files'
/Users/asari/mspec/lib/mspec/runner/mspec.rb:50:in `each'
/Users/asari/mspec/lib/mspec/runner/mspec.rb:50:in `files'
/Users/asari/mspec/lib/mspec/runner/mspec.rb:42:in `process'
/Users/asari/mspec/lib/mspec/commands/mspec-run.rb:87:in `run'
/Users/asari/mspec/lib/mspec/utils/script.rb:218:in `main'
/Users/asari/mspec/bin/mspec-run:8:in `<main>'
13)
Iconv.conv acts exactly as if opening a converter and invoking #iconv once FAILED
Expected "exposé"
to equal "expos\xC3\xA9"
/Users/asari/mspec/lib/mspec/expectations/expectations.rb:15:in `fail_with'
/Users/asari/mspec/lib/mspec/matchers/base.rb:8:in `=='
/Users/asari/rubyspec/library/iconv/conv_spec.rb:9:in `block (2 levels) in <top (required)>'
/Users/asari/mspec/lib/mspec/runner/mspec.rb:68:in `instance_eval'
/Users/asari/mspec/lib/mspec/runner/mspec.rb:68:in `protect'
/Users/asari/mspec/lib/mspec/runner/context.rb:179:in `block in protect'
/Users/asari/mspec/lib/mspec/runner/context.rb:179:in `each'
/Users/asari/mspec/lib/mspec/runner/context.rb:179:in `all?'
/Users/asari/mspec/lib/mspec/runner/context.rb:179:in `protect'
/Users/asari/mspec/lib/mspec/runner/context.rb:207:in `block in process'
/Users/asari/mspec/lib/mspec/runner/context.rb:199:in `each'
/Users/asari/mspec/lib/mspec/runner/context.rb:199:in `process'
/Users/asari/mspec/lib/mspec/runner/mspec.rb:37:in `describe'
/Users/asari/mspec/lib/mspec/runner/object.rb:11:in `describe'
/Users/asari/rubyspec/library/iconv/conv_spec.rb:5:in `<top (required)>'
/Users/asari/mspec/lib/mspec/runner/mspec.rb:56:in `load'
/Users/asari/mspec/lib/mspec/runner/mspec.rb:56:in `block (2 levels) in files'
/Users/asari/mspec/lib/mspec/runner/mspec.rb:68:in `instance_eval'
/Users/asari/mspec/lib/mspec/runner/mspec.rb:68:in `protect'
/Users/asari/mspec/lib/mspec/runner/mspec.rb:56:in `block in files'
/Users/asari/mspec/lib/mspec/runner/mspec.rb:50:in `each'
/Users/asari/mspec/lib/mspec/runner/mspec.rb:50:in `files'
/Users/asari/mspec/lib/mspec/runner/mspec.rb:42:in `process'
/Users/asari/mspec/lib/mspec/commands/mspec-run.rb:87:in `run'
/Users/asari/mspec/lib/mspec/utils/script.rb:218:in `main'
/Users/asari/mspec/bin/mspec-run:8:in `<main>'
14)
Iconv#iconv keeps context between calls ERROR
ArgumentError: invalid byte sequence in UTF-8
/Users/asari/mspec/lib/mspec/matchers/equal_utf16.rb:14:in `gsub'
/Users/asari/mspec/lib/mspec/matchers/equal_utf16.rb:14:in `block in expected_swapped'
/Users/asari/mspec/lib/mspec/matchers/equal_utf16.rb:14:in `map'
/Users/asari/mspec/lib/mspec/matchers/equal_utf16.rb:14:in `expected_swapped'
/Users/asari/mspec/lib/mspec/matchers/equal_utf16.rb:10:in `matches?'
/Users/asari/mspec/lib/mspec/expectations/should.rb:7:in `should'
/Users/asari/rubyspec/library/iconv/iconv_spec.rb:30:in `block (3 levels) in <top (required)>'
/Users/asari/rubyspec/library/iconv/iconv_spec.rb:28:in `open'
/Users/asari/rubyspec/library/iconv/iconv_spec.rb:28:in `block (2 levels) in <top (required)>'
/Users/asari/mspec/lib/mspec/runner/mspec.rb:68:in `instance_eval'
/Users/asari/mspec/lib/mspec/runner/mspec.rb:68:in `protect'
/Users/asari/mspec/lib/mspec/runner/context.rb:179:in `block in protect'
/Users/asari/mspec/lib/mspec/runner/context.rb:179:in `each'
/Users/asari/mspec/lib/mspec/runner/context.rb:179:in `all?'
/Users/asari/mspec/lib/mspec/runner/context.rb:179:in `protect'
/Users/asari/mspec/lib/mspec/runner/context.rb:207:in `block in process'
/Users/asari/mspec/lib/mspec/runner/context.rb:199:in `each'
/Users/asari/mspec/lib/mspec/runner/context.rb:199:in `process'
/Users/asari/mspec/lib/mspec/runner/mspec.rb:37:in `describe'
/Users/asari/mspec/lib/mspec/runner/object.rb:11:in `describe'
/Users/asari/rubyspec/library/iconv/iconv_spec.rb:10:in `<top (required)>'
/Users/asari/mspec/lib/mspec/runner/mspec.rb:56:in `load'
/Users/asari/mspec/lib/mspec/runner/mspec.rb:56:in `block (2 levels) in files'
/Users/asari/mspec/lib/mspec/runner/mspec.rb:68:in `instance_eval'
/Users/asari/mspec/lib/mspec/runner/mspec.rb:68:in `protect'
/Users/asari/mspec/lib/mspec/runner/mspec.rb:56:in `block in files'
/Users/asari/mspec/lib/mspec/runner/mspec.rb:50:in `each'
/Users/asari/mspec/lib/mspec/runner/mspec.rb:50:in `files'
/Users/asari/mspec/lib/mspec/runner/mspec.rb:42:in `process'
/Users/asari/mspec/lib/mspec/commands/mspec-run.rb:87:in `run'
/Users/asari/mspec/lib/mspec/utils/script.rb:218:in `main'
/Users/asari/mspec/bin/mspec-run:8:in `<main>'
15)
Iconv.iconv converts a series of strings with a single converter FAILED
Expected ["abc", "de"]
to equal ["\u0000a\u0000b\u0000c", "\u0000d\u0000e"]
/Users/asari/mspec/lib/mspec/expectations/expectations.rb:15:in `fail_with'
/Users/asari/mspec/lib/mspec/matchers/base.rb:8:in `=='
/Users/asari/rubyspec/library/iconv/iconv_spec.rb:121:in `block (2 levels) in <top (required)>'
/Users/asari/mspec/lib/mspec/runner/mspec.rb:68:in `instance_eval'
/Users/asari/mspec/lib/mspec/runner/mspec.rb:68:in `protect'
/Users/asari/mspec/lib/mspec/runner/context.rb:179:in `block in protect'
/Users/asari/mspec/lib/mspec/runner/context.rb:179:in `each'
/Users/asari/mspec/lib/mspec/runner/context.rb:179:in `all?'
/Users/asari/mspec/lib/mspec/runner/context.rb:179:in `protect'
/Users/asari/mspec/lib/mspec/runner/context.rb:207:in `block in process'
/Users/asari/mspec/lib/mspec/runner/context.rb:199:in `each'
/Users/asari/mspec/lib/mspec/runner/context.rb:199:in `process'
/Users/asari/mspec/lib/mspec/runner/mspec.rb:37:in `describe'
/Users/asari/mspec/lib/mspec/runner/object.rb:11:in `describe'
/Users/asari/rubyspec/library/iconv/iconv_spec.rb:118:in `<top (required)>'
/Users/asari/mspec/lib/mspec/runner/mspec.rb:56:in `load'
/Users/asari/mspec/lib/mspec/runner/mspec.rb:56:in `block (2 levels) in files'
/Users/asari/mspec/lib/mspec/runner/mspec.rb:68:in `instance_eval'
/Users/asari/mspec/lib/mspec/runner/mspec.rb:68:in `protect'
/Users/asari/mspec/lib/mspec/runner/mspec.rb:56:in `block in files'
/Users/asari/mspec/lib/mspec/runner/mspec.rb:50:in `each'
/Users/asari/mspec/lib/mspec/runner/mspec.rb:50:in `files'
/Users/asari/mspec/lib/mspec/runner/mspec.rb:42:in `process'
/Users/asari/mspec/lib/mspec/commands/mspec-run.rb:87:in `run'
/Users/asari/mspec/lib/mspec/utils/script.rb:218:in `main'
/Users/asari/mspec/bin/mspec-run:8:in `<main>'
16)
The 'utf-16' encoder emits a byte-order mark on first non-empty output ERROR
ArgumentError: invalid byte sequence in UTF-8
/Users/asari/mspec/lib/mspec/matchers/equal_utf16.rb:14:in `gsub'
/Users/asari/mspec/lib/mspec/matchers/equal_utf16.rb:14:in `block in expected_swapped'
/Users/asari/mspec/lib/mspec/matchers/equal_utf16.rb:14:in `map'
/Users/asari/mspec/lib/mspec/matchers/equal_utf16.rb:14:in `expected_swapped'
/Users/asari/mspec/lib/mspec/matchers/equal_utf16.rb:10:in `matches?'
/Users/asari/mspec/lib/mspec/expectations/should.rb:7:in `should'
/Users/asari/rubyspec/library/iconv/iconv_spec.rb:176:in `block (2 levels) in <top (required)>'
/Users/asari/mspec/lib/mspec/runner/mspec.rb:68:in `instance_eval'
/Users/asari/mspec/lib/mspec/runner/mspec.rb:68:in `protect'
/Users/asari/mspec/lib/mspec/runner/context.rb:179:in `block in protect'
/Users/asari/mspec/lib/mspec/runner/context.rb:179:in `each'
/Users/asari/mspec/lib/mspec/runner/context.rb:179:in `all?'
/Users/asari/mspec/lib/mspec/runner/context.rb:179:in `protect'
/Users/asari/mspec/lib/mspec/runner/context.rb:207:in `block in process'
/Users/asari/mspec/lib/mspec/runner/context.rb:199:in `each'
/Users/asari/mspec/lib/mspec/runner/context.rb:199:in `process'
/Users/asari/mspec/lib/mspec/runner/mspec.rb:37:in `describe'
/Users/asari/mspec/lib/mspec/runner/object.rb:11:in `describe'
/Users/asari/rubyspec/library/iconv/iconv_spec.rb:151:in `<top (required)>'
/Users/asari/mspec/lib/mspec/runner/mspec.rb:56:in `load'
/Users/asari/mspec/lib/mspec/runner/mspec.rb:56:in `block (2 levels) in files'
/Users/asari/mspec/lib/mspec/runner/mspec.rb:68:in `instance_eval'
/Users/asari/mspec/lib/mspec/runner/mspec.rb:68:in `protect'
/Users/asari/mspec/lib/mspec/runner/mspec.rb:56:in `block in files'
/Users/asari/mspec/lib/mspec/runner/mspec.rb:50:in `each'
/Users/asari/mspec/lib/mspec/runner/mspec.rb:50:in `files'
/Users/asari/mspec/lib/mspec/runner/mspec.rb:42:in `process'
/Users/asari/mspec/lib/mspec/commands/mspec-run.rb:87:in `run'
/Users/asari/mspec/lib/mspec/utils/script.rb:218:in `main'
/Users/asari/mspec/bin/mspec-run:8:in `<main>'
17)
The 'utf-16be' decoder does not emit a byte-order mark FAILED
Expected ["ab"]
to equal ["\u0000a\u0000b"]
/Users/asari/mspec/lib/mspec/expectations/expectations.rb:15:in `fail_with'
/Users/asari/mspec/lib/mspec/matchers/base.rb:8:in `=='
/Users/asari/rubyspec/library/iconv/iconv_spec.rb:183:in `block (2 levels) in <top (required)>'
/Users/asari/mspec/lib/mspec/runner/mspec.rb:68:in `instance_eval'
/Users/asari/mspec/lib/mspec/runner/mspec.rb:68:in `protect'
/Users/asari/mspec/lib/mspec/runner/context.rb:179:in `block in protect'
/Users/asari/mspec/lib/mspec/runner/context.rb:179:in `each'
/Users/asari/mspec/lib/mspec/runner/context.rb:179:in `all?'
/Users/asari/mspec/lib/mspec/runner/context.rb:179:in `protect'
/Users/asari/mspec/lib/mspec/runner/context.rb:207:in `block in process'
/Users/asari/mspec/lib/mspec/runner/context.rb:199:in `each'
/Users/asari/mspec/lib/mspec/runner/context.rb:199:in `process'
/Users/asari/mspec/lib/mspec/runner/mspec.rb:37:in `describe'
/Users/asari/mspec/lib/mspec/runner/object.rb:11:in `describe'
/Users/asari/rubyspec/library/iconv/iconv_spec.rb:181:in `<top (required)>'
/Users/asari/mspec/lib/mspec/runner/mspec.rb:56:in `load'
/Users/asari/mspec/lib/mspec/runner/mspec.rb:56:in `block (2 levels) in files'
/Users/asari/mspec/lib/mspec/runner/mspec.rb:68:in `instance_eval'
/Users/asari/mspec/lib/mspec/runner/mspec.rb:68:in `protect'
/Users/asari/mspec/lib/mspec/runner/mspec.rb:56:in `block in files'
/Users/asari/mspec/lib/mspec/runner/mspec.rb:50:in `each'
/Users/asari/mspec/lib/mspec/runner/mspec.rb:50:in `files'
/Users/asari/mspec/lib/mspec/runner/mspec.rb:42:in `process'
/Users/asari/mspec/lib/mspec/commands/mspec-run.rb:87:in `run'
/Users/asari/mspec/lib/mspec/utils/script.rb:218:in `main'
/Users/asari/mspec/bin/mspec-run:8:in `<main>'
18)
The 'utf-16le' decoder does not emit a byte-order mark FAILED
Expected ["ab"]
to equal ["a\u0000b\u0000"]
/Users/asari/mspec/lib/mspec/expectations/expectations.rb:15:in `fail_with'
/Users/asari/mspec/lib/mspec/matchers/base.rb:8:in `=='
/Users/asari/rubyspec/library/iconv/iconv_spec.rb:194:in `block (2 levels) in <top (required)>'
/Users/asari/mspec/lib/mspec/runner/mspec.rb:68:in `instance_eval'
/Users/asari/mspec/lib/mspec/runner/mspec.rb:68:in `protect'
/Users/asari/mspec/lib/mspec/runner/context.rb:179:in `block in protect'
/Users/asari/mspec/lib/mspec/runner/context.rb:179:in `each'
/Users/asari/mspec/lib/mspec/runner/context.rb:179:in `all?'
/Users/asari/mspec/lib/mspec/runner/context.rb:179:in `protect'
/Users/asari/mspec/lib/mspec/runner/context.rb:207:in `block in process'
/Users/asari/mspec/lib/mspec/runner/context.rb:199:in `each'
/Users/asari/mspec/lib/mspec/runner/context.rb:199:in `process'
/Users/asari/mspec/lib/mspec/runner/mspec.rb:37:in `describe'
/Users/asari/mspec/lib/mspec/runner/object.rb:11:in `describe'
/Users/asari/rubyspec/library/iconv/iconv_spec.rb:192:in `<top (required)>'
/Users/asari/mspec/lib/mspec/runner/mspec.rb:56:in `load'
/Users/asari/mspec/lib/mspec/runner/mspec.rb:56:in `block (2 levels) in files'
/Users/asari/mspec/lib/mspec/runner/mspec.rb:68:in `instance_eval'
/Users/asari/mspec/lib/mspec/runner/mspec.rb:68:in `protect'
/Users/asari/mspec/lib/mspec/runner/mspec.rb:56:in `block in files'
/Users/asari/mspec/lib/mspec/runner/mspec.rb:50:in `each'
/Users/asari/mspec/lib/mspec/runner/mspec.rb:50:in `files'
/Users/asari/mspec/lib/mspec/runner/mspec.rb:42:in `process'
/Users/asari/mspec/lib/mspec/commands/mspec-run.rb:87:in `run'
/Users/asari/mspec/lib/mspec/utils/script.rb:218:in `main'
/Users/asari/mspec/bin/mspec-run:8:in `<main>'
19)
StringScanner#getch is multi-byte character sensitive FAILED
Expected "\xA4"
to equal "\xA4\xA2"
/Users/asari/mspec/lib/mspec/expectations/expectations.rb:15:in `fail_with'
/Users/asari/mspec/lib/mspec/matchers/base.rb:8:in `=='
/Users/asari/rubyspec/library/stringscanner/getch_spec.rb:28:in `block (2 levels) in <top (required)>'
/Users/asari/mspec/lib/mspec/runner/mspec.rb:68:in `instance_eval'
/Users/asari/mspec/lib/mspec/runner/mspec.rb:68:in `protect'
/Users/asari/mspec/lib/mspec/runner/context.rb:179:in `block in protect'
/Users/asari/mspec/lib/mspec/runner/context.rb:179:in `each'
/Users/asari/mspec/lib/mspec/runner/context.rb:179:in `all?'
/Users/asari/mspec/lib/mspec/runner/context.rb:179:in `protect'
/Users/asari/mspec/lib/mspec/runner/context.rb:207:in `block in process'
/Users/asari/mspec/lib/mspec/runner/context.rb:199:in `each'
/Users/asari/mspec/lib/mspec/runner/context.rb:199:in `process'
/Users/asari/mspec/lib/mspec/runner/mspec.rb:37:in `describe'
/Users/asari/mspec/lib/mspec/runner/object.rb:11:in `describe'
/Users/asari/rubyspec/library/stringscanner/getch_spec.rb:5:in `<top (required)>'
/Users/asari/mspec/lib/mspec/runner/mspec.rb:56:in `load'
/Users/asari/mspec/lib/mspec/runner/mspec.rb:56:in `block (2 levels) in files'
/Users/asari/mspec/lib/mspec/runner/mspec.rb:68:in `instance_eval'
/Users/asari/mspec/lib/mspec/runner/mspec.rb:68:in `protect'
/Users/asari/mspec/lib/mspec/runner/mspec.rb:56:in `block in files'
/Users/asari/mspec/lib/mspec/runner/mspec.rb:50:in `each'
/Users/asari/mspec/lib/mspec/runner/mspec.rb:50:in `files'
/Users/asari/mspec/lib/mspec/runner/mspec.rb:42:in `process'
/Users/asari/mspec/lib/mspec/commands/mspec-run.rb:87:in `run'
/Users/asari/mspec/lib/mspec/utils/script.rb:218:in `main'
/Users/asari/mspec/bin/mspec-run:8:in `<main>'
20)
Syslog.alert logs a message FAILED
Expected (STDERR): "rubyspec: Hello\n"
but got: "Dec 4 23:58:28 aotearoa.local rubyspec[50377] <Alert>: Hello\n"
Backtrace
/Users/asari/mspec/lib/mspec/expectations/expectations.rb:15:in `fail_with'
/Users/asari/mspec/lib/mspec/expectations/should.rb:8:in `should'
/Users/asari/rubyspec/library/syslog/shared/log.rb:12:in `block (3 levels) in <top (required)>'
/Users/asari/mspec/lib/mspec/runner/mspec.rb:68:in `instance_eval'
/Users/asari/mspec/lib/mspec/runner/mspec.rb:68:in `protect'
/Users/asari/mspec/lib/mspec/runner/context.rb:179:in `block in protect'
/Users/asari/mspec/lib/mspec/runner/context.rb:179:in `each'
/Users/asari/mspec/lib/mspec/runner/context.rb:179:in `all?'
/Users/asari/mspec/lib/mspec/runner/context.rb:179:in `protect'
/Users/asari/mspec/lib/mspec/runner/context.rb:207:in `block in process'
/Users/asari/mspec/lib/mspec/runner/context.rb:199:in `each'
/Users/asari/mspec/lib/mspec/runner/context.rb:199:in `process'
/Users/asari/mspec/lib/mspec/runner/mspec.rb:37:in `describe'
/Users/asari/mspec/lib/mspec/runner/object.rb:11:in `describe'
/Users/asari/rubyspec/library/syslog/alert_spec.rb:5:in `<top (required)>'
/Users/asari/mspec/lib/mspec/runner/mspec.rb:56:in `load'
/Users/asari/mspec/lib/mspec/runner/mspec.rb:56:in `block (2 levels) in files'
/Users/asari/mspec/lib/mspec/runner/mspec.rb:68:in `instance_eval'
/Users/asari/mspec/lib/mspec/runner/mspec.rb:68:in `protect'
/Users/asari/mspec/lib/mspec/runner/mspec.rb:56:in `block in files'
/Users/asari/mspec/lib/mspec/runner/mspec.rb:50:in `each'
/Users/asari/mspec/lib/mspec/runner/mspec.rb:50:in `files'
/Users/asari/mspec/lib/mspec/runner/mspec.rb:42:in `process'
/Users/asari/mspec/lib/mspec/commands/mspec-run.rb:87:in `run'
/Users/asari/mspec/lib/mspec/utils/script.rb:218:in `main'
/Users/asari/mspec/bin/mspec-run:8:in `<main>'
21)
Syslog.alert accepts sprintf arguments FAILED
Expected (STDERR): "rubyspec: Hello world\nrubyspec: 2 dogs\n"
but got: "Dec 4 23:58:28 aotearoa.local rubyspec[50377] <Alert>: Hello world\nDec 4 23:58:28 aotearoa.local rubyspec[50377] <Alert>: 2 dogs\n"
Backtrace
/Users/asari/mspec/lib/mspec/expectations/expectations.rb:15:in `fail_with'
/Users/asari/mspec/lib/mspec/expectations/should.rb:8:in `should'
/Users/asari/rubyspec/library/syslog/shared/log.rb:20:in `block (3 levels) in <top (required)>'
/Users/asari/mspec/lib/mspec/runner/mspec.rb:68:in `instance_eval'
/Users/asari/mspec/lib/mspec/runner/mspec.rb:68:in `protect'
/Users/asari/mspec/lib/mspec/runner/context.rb:179:in `block in protect'
/Users/asari/mspec/lib/mspec/runner/context.rb:179:in `each'
/Users/asari/mspec/lib/mspec/runner/context.rb:179:in `all?'
/Users/asari/mspec/lib/mspec/runner/context.rb:179:in `protect'
/Users/asari/mspec/lib/mspec/runner/context.rb:207:in `block in process'
/Users/asari/mspec/lib/mspec/runner/context.rb:199:in `each'
/Users/asari/mspec/lib/mspec/runner/context.rb:199:in `process'
/Users/asari/mspec/lib/mspec/runner/mspec.rb:37:in `describe'
/Users/asari/mspec/lib/mspec/runner/object.rb:11:in `describe'
/Users/asari/rubyspec/library/syslog/alert_spec.rb:5:in `<top (required)>'
/Users/asari/mspec/lib/mspec/runner/mspec.rb:56:in `load'
/Users/asari/mspec/lib/mspec/runner/mspec.rb:56:in `block (2 levels) in files'
/Users/asari/mspec/lib/mspec/runner/mspec.rb:68:in `instance_eval'
/Users/asari/mspec/lib/mspec/runner/mspec.rb:68:in `protect'
/Users/asari/mspec/lib/mspec/runner/mspec.rb:56:in `block in files'
/Users/asari/mspec/lib/mspec/runner/mspec.rb:50:in `each'
/Users/asari/mspec/lib/mspec/runner/mspec.rb:50:in `files'
/Users/asari/mspec/lib/mspec/runner/mspec.rb:42:in `process'
/Users/asari/mspec/lib/mspec/commands/mspec-run.rb:87:in `run'
/Users/asari/mspec/lib/mspec/utils/script.rb:218:in `main'
/Users/asari/mspec/bin/mspec-run:8:in `<main>'
22)
Syslog.alert works as an alias for Syslog.log FAILED
Expected (STDERR): "rubyspec: Hello\nrubyspec: Hello\n"
but got: "Dec 4 23:58:28 aotearoa.local rubyspec[50377] <Alert>: Hello\nDec 4 23:58:28 aotearoa.local rubyspec[50377] <Alert>: Hello\n"
Backtrace
/Users/asari/mspec/lib/mspec/expectations/expectations.rb:15:in `fail_with'
/Users/asari/mspec/lib/mspec/expectations/should.rb:8:in `should'
/Users/asari/rubyspec/library/syslog/shared/log.rb:31:in `block (3 levels) in <top (required)>'
/Users/asari/mspec/lib/mspec/runner/mspec.rb:68:in `instance_eval'
/Users/asari/mspec/lib/mspec/runner/mspec.rb:68:in `protect'
/Users/asari/mspec/lib/mspec/runner/context.rb:179:in `block in protect'
/Users/asari/mspec/lib/mspec/runner/context.rb:179:in `each'
/Users/asari/mspec/lib/mspec/runner/context.rb:179:in `all?'
/Users/asari/mspec/lib/mspec/runner/context.rb:179:in `protect'
/Users/asari/mspec/lib/mspec/runner/context.rb:207:in `block in process'
/Users/asari/mspec/lib/mspec/runner/context.rb:199:in `each'
/Users/asari/mspec/lib/mspec/runner/context.rb:199:in `process'
/Users/asari/mspec/lib/mspec/runner/mspec.rb:37:in `describe'
/Users/asari/mspec/lib/mspec/runner/object.rb:11:in `describe'
/Users/asari/rubyspec/library/syslog/alert_spec.rb:5:in `<top (required)>'
/Users/asari/mspec/lib/mspec/runner/mspec.rb:56:in `load'
/Users/asari/mspec/lib/mspec/runner/mspec.rb:56:in `block (2 levels) in files'
/Users/asari/mspec/lib/mspec/runner/mspec.rb:68:in `instance_eval'
/Users/asari/mspec/lib/mspec/runner/mspec.rb:68:in `protect'
/Users/asari/mspec/lib/mspec/runner/mspec.rb:56:in `block in files'
/Users/asari/mspec/lib/mspec/runner/mspec.rb:50:in `each'
/Users/asari/mspec/lib/mspec/runner/mspec.rb:50:in `files'
/Users/asari/mspec/lib/mspec/runner/mspec.rb:42:in `process'
/Users/asari/mspec/lib/mspec/commands/mspec-run.rb:87:in `run'
/Users/asari/mspec/lib/mspec/utils/script.rb:218:in `main'
/Users/asari/mspec/bin/mspec-run:8:in `<main>'
23)
Syslog.crit logs a message FAILED
Expected (STDERR): "rubyspec: Hello\n"
but got: "Dec 4 23:58:28 aotearoa.local rubyspec[50377] <Critical>: Hello\n"
Backtrace
/Users/asari/mspec/lib/mspec/expectations/expectations.rb:15:in `fail_with'
/Users/asari/mspec/lib/mspec/expectations/should.rb:8:in `should'
/Users/asari/rubyspec/library/syslog/shared/log.rb:12:in `block (3 levels) in <top (required)>'
/Users/asari/mspec/lib/mspec/runner/mspec.rb:68:in `instance_eval'
/Users/asari/mspec/lib/mspec/runner/mspec.rb:68:in `protect'
/Users/asari/mspec/lib/mspec/runner/context.rb:179:in `block in protect'
/Users/asari/mspec/lib/mspec/runner/context.rb:179:in `each'
/Users/asari/mspec/lib/mspec/runner/context.rb:179:in `all?'
/Users/asari/mspec/lib/mspec/runner/context.rb:179:in `protect'
/Users/asari/mspec/lib/mspec/runner/context.rb:207:in `block in process'
/Users/asari/mspec/lib/mspec/runner/context.rb:199:in `each'
/Users/asari/mspec/lib/mspec/runner/context.rb:199:in `process'
/Users/asari/mspec/lib/mspec/runner/mspec.rb:37:in `describe'
/Users/asari/mspec/lib/mspec/runner/object.rb:11:in `describe'
/Users/asari/rubyspec/library/syslog/crit_spec.rb:5:in `<top (required)>'
/Users/asari/mspec/lib/mspec/runner/mspec.rb:56:in `load'
/Users/asari/mspec/lib/mspec/runner/mspec.rb:56:in `block (2 levels) in files'
/Users/asari/mspec/lib/mspec/runner/mspec.rb:68:in `instance_eval'
/Users/asari/mspec/lib/mspec/runner/mspec.rb:68:in `protect'
/Users/asari/mspec/lib/mspec/runner/mspec.rb:56:in `block in files'
/Users/asari/mspec/lib/mspec/runner/mspec.rb:50:in `each'
/Users/asari/mspec/lib/mspec/runner/mspec.rb:50:in `files'
/Users/asari/mspec/lib/mspec/runner/mspec.rb:42:in `process'
/Users/asari/mspec/lib/mspec/commands/mspec-run.rb:87:in `run'
/Users/asari/mspec/lib/mspec/utils/script.rb:218:in `main'
/Users/asari/mspec/bin/mspec-run:8:in `<main>'
24)
Syslog.crit accepts sprintf arguments FAILED
Expected (STDERR): "rubyspec: Hello world\nrubyspec: 2 dogs\n"
but got: "Dec 4 23:58:28 aotearoa.local rubyspec[50377] <Critical>: Hello world\nDec 4 23:58:28 aotearoa.local rubyspec[50377] <Critical>: 2 dogs\n"
Backtrace
/Users/asari/mspec/lib/mspec/expectations/expectations.rb:15:in `fail_with'
/Users/asari/mspec/lib/mspec/expectations/should.rb:8:in `should'
/Users/asari/rubyspec/library/syslog/shared/log.rb:20:in `block (3 levels) in <top (required)>'
/Users/asari/mspec/lib/mspec/runner/mspec.rb:68:in `instance_eval'
/Users/asari/mspec/lib/mspec/runner/mspec.rb:68:in `protect'
/Users/asari/mspec/lib/mspec/runner/context.rb:179:in `block in protect'
/Users/asari/mspec/lib/mspec/runner/context.rb:179:in `each'
/Users/asari/mspec/lib/mspec/runner/context.rb:179:in `all?'
/Users/asari/mspec/lib/mspec/runner/context.rb:179:in `protect'
/Users/asari/mspec/lib/mspec/runner/context.rb:207:in `block in process'
/Users/asari/mspec/lib/mspec/runner/context.rb:199:in `each'
/Users/asari/mspec/lib/mspec/runner/context.rb:199:in `process'
/Users/asari/mspec/lib/mspec/runner/mspec.rb:37:in `describe'
/Users/asari/mspec/lib/mspec/runner/object.rb:11:in `describe'
/Users/asari/rubyspec/library/syslog/crit_spec.rb:5:in `<top (required)>'
/Users/asari/mspec/lib/mspec/runner/mspec.rb:56:in `load'
/Users/asari/mspec/lib/mspec/runner/mspec.rb:56:in `block (2 levels) in files'
/Users/asari/mspec/lib/mspec/runner/mspec.rb:68:in `instance_eval'
/Users/asari/mspec/lib/mspec/runner/mspec.rb:68:in `protect'
/Users/asari/mspec/lib/mspec/runner/mspec.rb:56:in `block in files'
/Users/asari/mspec/lib/mspec/runner/mspec.rb:50:in `each'
/Users/asari/mspec/lib/mspec/runner/mspec.rb:50:in `files'
/Users/asari/mspec/lib/mspec/runner/mspec.rb:42:in `process'
/Users/asari/mspec/lib/mspec/commands/mspec-run.rb:87:in `run'
/Users/asari/mspec/lib/mspec/utils/script.rb:218:in `main'
/Users/asari/mspec/bin/mspec-run:8:in `<main>'
25)
Syslog.crit works as an alias for Syslog.log FAILED
Expected (STDERR): "rubyspec: Hello\nrubyspec: Hello\n"
but got: "Dec 4 23:58:28 aotearoa.local rubyspec[50377] <Critical>: Hello\nDec 4 23:58:28 aotearoa.local rubyspec[50377] <Critical>: Hello\n"
Backtrace
/Users/asari/mspec/lib/mspec/expectations/expectations.rb:15:in `fail_with'
/Users/asari/mspec/lib/mspec/expectations/should.rb:8:in `should'
/Users/asari/rubyspec/library/syslog/shared/log.rb:31:in `block (3 levels) in <top (required)>'
/Users/asari/mspec/lib/mspec/runner/mspec.rb:68:in `instance_eval'
/Users/asari/mspec/lib/mspec/runner/mspec.rb:68:in `protect'
/Users/asari/mspec/lib/mspec/runner/context.rb:179:in `block in protect'
/Users/asari/mspec/lib/mspec/runner/context.rb:179:in `each'
/Users/asari/mspec/lib/mspec/runner/context.rb:179:in `all?'
/Users/asari/mspec/lib/mspec/runner/context.rb:179:in `protect'
/Users/asari/mspec/lib/mspec/runner/context.rb:207:in `block in process'
/Users/asari/mspec/lib/mspec/runner/context.rb:199:in `each'
/Users/asari/mspec/lib/mspec/runner/context.rb:199:in `process'
/Users/asari/mspec/lib/mspec/runner/mspec.rb:37:in `describe'
/Users/asari/mspec/lib/mspec/runner/object.rb:11:in `describe'
/Users/asari/rubyspec/library/syslog/crit_spec.rb:5:in `<top (required)>'
/Users/asari/mspec/lib/mspec/runner/mspec.rb:56:in `load'
/Users/asari/mspec/lib/mspec/runner/mspec.rb:56:in `block (2 levels) in files'
/Users/asari/mspec/lib/mspec/runner/mspec.rb:68:in `instance_eval'
/Users/asari/mspec/lib/mspec/runner/mspec.rb:68:in `protect'
/Users/asari/mspec/lib/mspec/runner/mspec.rb:56:in `block in files'
/Users/asari/mspec/lib/mspec/runner/mspec.rb:50:in `each'
/Users/asari/mspec/lib/mspec/runner/mspec.rb:50:in `files'
/Users/asari/mspec/lib/mspec/runner/mspec.rb:42:in `process'
/Users/asari/mspec/lib/mspec/commands/mspec-run.rb:87:in `run'
/Users/asari/mspec/lib/mspec/utils/script.rb:218:in `main'
/Users/asari/mspec/bin/mspec-run:8:in `<main>'
26)
Syslog.debug logs a message FAILED
Expected (STDERR): "rubyspec: Hello\n"
but got: "Dec 4 23:58:28 aotearoa.local rubyspec[50377] <Debug>: Hello\n"
Backtrace
/Users/asari/mspec/lib/mspec/expectations/expectations.rb:15:in `fail_with'
/Users/asari/mspec/lib/mspec/expectations/should.rb:8:in `should'
/Users/asari/rubyspec/library/syslog/shared/log.rb:12:in `block (3 levels) in <top (required)>'
/Users/asari/mspec/lib/mspec/runner/mspec.rb:68:in `instance_eval'
/Users/asari/mspec/lib/mspec/runner/mspec.rb:68:in `protect'
/Users/asari/mspec/lib/mspec/runner/context.rb:179:in `block in protect'
/Users/asari/mspec/lib/mspec/runner/context.rb:179:in `each'
/Users/asari/mspec/lib/mspec/runner/context.rb:179:in `all?'
/Users/asari/mspec/lib/mspec/runner/context.rb:179:in `protect'
/Users/asari/mspec/lib/mspec/runner/context.rb:207:in `block in process'
/Users/asari/mspec/lib/mspec/runner/context.rb:199:in `each'
/Users/asari/mspec/lib/mspec/runner/context.rb:199:in `process'
/Users/asari/mspec/lib/mspec/runner/mspec.rb:37:in `describe'
/Users/asari/mspec/lib/mspec/runner/object.rb:11:in `describe'
/Users/asari/rubyspec/library/syslog/debug_spec.rb:5:in `<top (required)>'
/Users/asari/mspec/lib/mspec/runner/mspec.rb:56:in `load'
/Users/asari/mspec/lib/mspec/runner/mspec.rb:56:in `block (2 levels) in files'
/Users/asari/mspec/lib/mspec/runner/mspec.rb:68:in `instance_eval'
/Users/asari/mspec/lib/mspec/runner/mspec.rb:68:in `protect'
/Users/asari/mspec/lib/mspec/runner/mspec.rb:56:in `block in files'
/Users/asari/mspec/lib/mspec/runner/mspec.rb:50:in `each'
/Users/asari/mspec/lib/mspec/runner/mspec.rb:50:in `files'
/Users/asari/mspec/lib/mspec/runner/mspec.rb:42:in `process'
/Users/asari/mspec/lib/mspec/commands/mspec-run.rb:87:in `run'
/Users/asari/mspec/lib/mspec/utils/script.rb:218:in `main'
/Users/asari/mspec/bin/mspec-run:8:in `<main>'
27)
Syslog.debug accepts sprintf arguments FAILED
Expected (STDERR): "rubyspec: Hello world\nrubyspec: 2 dogs\n"
but got: "Dec 4 23:58:28 aotearoa.local rubyspec[50377] <Debug>: Hello world\nDec 4 23:58:28 aotearoa.local rubyspec[50377] <Debug>: 2 dogs\n"
Backtrace
/Users/asari/mspec/lib/mspec/expectations/expectations.rb:15:in `fail_with'
/Users/asari/mspec/lib/mspec/expectations/should.rb:8:in `should'
/Users/asari/rubyspec/library/syslog/shared/log.rb:20:in `block (3 levels) in <top (required)>'
/Users/asari/mspec/lib/mspec/runner/mspec.rb:68:in `instance_eval'
/Users/asari/mspec/lib/mspec/runner/mspec.rb:68:in `protect'
/Users/asari/mspec/lib/mspec/runner/context.rb:179:in `block in protect'
/Users/asari/mspec/lib/mspec/runner/context.rb:179:in `each'
/Users/asari/mspec/lib/mspec/runner/context.rb:179:in `all?'
/Users/asari/mspec/lib/mspec/runner/context.rb:179:in `protect'
/Users/asari/mspec/lib/mspec/runner/context.rb:207:in `block in process'
/Users/asari/mspec/lib/mspec/runner/context.rb:199:in `each'
/Users/asari/mspec/lib/mspec/runner/context.rb:199:in `process'
/Users/asari/mspec/lib/mspec/runner/mspec.rb:37:in `describe'
/Users/asari/mspec/lib/mspec/runner/object.rb:11:in `describe'
/Users/asari/rubyspec/library/syslog/debug_spec.rb:5:in `<top (required)>'
/Users/asari/mspec/lib/mspec/runner/mspec.rb:56:in `load'
/Users/asari/mspec/lib/mspec/runner/mspec.rb:56:in `block (2 levels) in files'
/Users/asari/mspec/lib/mspec/runner/mspec.rb:68:in `instance_eval'
/Users/asari/mspec/lib/mspec/runner/mspec.rb:68:in `protect'
/Users/asari/mspec/lib/mspec/runner/mspec.rb:56:in `block in files'
/Users/asari/mspec/lib/mspec/runner/mspec.rb:50:in `each'
/Users/asari/mspec/lib/mspec/runner/mspec.rb:50:in `files'
/Users/asari/mspec/lib/mspec/runner/mspec.rb:42:in `process'
/Users/asari/mspec/lib/mspec/commands/mspec-run.rb:87:in `run'
/Users/asari/mspec/lib/mspec/utils/script.rb:218:in `main'
/Users/asari/mspec/bin/mspec-run:8:in `<main>'
28)
Syslog.debug works as an alias for Syslog.log FAILED
Expected (STDERR): "rubyspec: Hello\nrubyspec: Hello\n"
but got: "Dec 4 23:58:28 aotearoa.local rubyspec[50377] <Debug>: Hello\nDec 4 23:58:28 aotearoa.local rubyspec[50377] <Debug>: Hello\n"
Backtrace
/Users/asari/mspec/lib/mspec/expectations/expectations.rb:15:in `fail_with'
/Users/asari/mspec/lib/mspec/expectations/should.rb:8:in `should'
/Users/asari/rubyspec/library/syslog/shared/log.rb:31:in `block (3 levels) in <top (required)>'
/Users/asari/mspec/lib/mspec/runner/mspec.rb:68:in `instance_eval'
/Users/asari/mspec/lib/mspec/runner/mspec.rb:68:in `protect'
/Users/asari/mspec/lib/mspec/runner/context.rb:179:in `block in protect'
/Users/asari/mspec/lib/mspec/runner/context.rb:179:in `each'
/Users/asari/mspec/lib/mspec/runner/context.rb:179:in `all?'
/Users/asari/mspec/lib/mspec/runner/context.rb:179:in `protect'
/Users/asari/mspec/lib/mspec/runner/context.rb:207:in `block in process'
/Users/asari/mspec/lib/mspec/runner/context.rb:199:in `each'
/Users/asari/mspec/lib/mspec/runner/context.rb:199:in `process'
/Users/asari/mspec/lib/mspec/runner/mspec.rb:37:in `describe'
/Users/asari/mspec/lib/mspec/runner/object.rb:11:in `describe'
/Users/asari/rubyspec/library/syslog/debug_spec.rb:5:in `<top (required)>'
/Users/asari/mspec/lib/mspec/runner/mspec.rb:56:in `load'
/Users/asari/mspec/lib/mspec/runner/mspec.rb:56:in `block (2 levels) in files'
/Users/asari/mspec/lib/mspec/runner/mspec.rb:68:in `instance_eval'
/Users/asari/mspec/lib/mspec/runner/mspec.rb:68:in `protect'
/Users/asari/mspec/lib/mspec/runner/mspec.rb:56:in `block in files'
/Users/asari/mspec/lib/mspec/runner/mspec.rb:50:in `each'
/Users/asari/mspec/lib/mspec/runner/mspec.rb:50:in `files'
/Users/asari/mspec/lib/mspec/runner/mspec.rb:42:in `process'
/Users/asari/mspec/lib/mspec/commands/mspec-run.rb:87:in `run'
/Users/asari/mspec/lib/mspec/utils/script.rb:218:in `main'
/Users/asari/mspec/bin/mspec-run:8:in `<main>'
29)
Syslog.err logs a message FAILED
Expected (STDERR): "rubyspec: Hello\n"
but got: "Dec 4 23:58:28 aotearoa.local rubyspec[50377] <Error>: Hello\n"
Backtrace
/Users/asari/mspec/lib/mspec/expectations/expectations.rb:15:in `fail_with'
/Users/asari/mspec/lib/mspec/expectations/should.rb:8:in `should'
/Users/asari/rubyspec/library/syslog/shared/log.rb:12:in `block (3 levels) in <top (required)>'
/Users/asari/mspec/lib/mspec/runner/mspec.rb:68:in `instance_eval'
/Users/asari/mspec/lib/mspec/runner/mspec.rb:68:in `protect'
/Users/asari/mspec/lib/mspec/runner/context.rb:179:in `block in protect'
/Users/asari/mspec/lib/mspec/runner/context.rb:179:in `each'
/Users/asari/mspec/lib/mspec/runner/context.rb:179:in `all?'
/Users/asari/mspec/lib/mspec/runner/context.rb:179:in `protect'
/Users/asari/mspec/lib/mspec/runner/context.rb:207:in `block in process'
/Users/asari/mspec/lib/mspec/runner/context.rb:199:in `each'
/Users/asari/mspec/lib/mspec/runner/context.rb:199:in `process'
/Users/asari/mspec/lib/mspec/runner/mspec.rb:37:in `describe'
/Users/asari/mspec/lib/mspec/runner/object.rb:11:in `describe'
/Users/asari/rubyspec/library/syslog/err_spec.rb:5:in `<top (required)>'
/Users/asari/mspec/lib/mspec/runner/mspec.rb:56:in `load'
/Users/asari/mspec/lib/mspec/runner/mspec.rb:56:in `block (2 levels) in files'
/Users/asari/mspec/lib/mspec/runner/mspec.rb:68:in `instance_eval'
/Users/asari/mspec/lib/mspec/runner/mspec.rb:68:in `protect'
/Users/asari/mspec/lib/mspec/runner/mspec.rb:56:in `block in files'
/Users/asari/mspec/lib/mspec/runner/mspec.rb:50:in `each'
/Users/asari/mspec/lib/mspec/runner/mspec.rb:50:in `files'
/Users/asari/mspec/lib/mspec/runner/mspec.rb:42:in `process'
/Users/asari/mspec/lib/mspec/commands/mspec-run.rb:87:in `run'
/Users/asari/mspec/lib/mspec/utils/script.rb:218:in `main'
/Users/asari/mspec/bin/mspec-run:8:in `<main>'
30)
Syslog.err accepts sprintf arguments FAILED
Expected (STDERR): "rubyspec: Hello world\nrubyspec: 2 dogs\n"
but got: "Dec 4 23:58:28 aotearoa.local rubyspec[50377] <Error>: Hello world\nDec 4 23:58:28 aotearoa.local rubyspec[50377] <Error>: 2 dogs\n"
Backtrace
/Users/asari/mspec/lib/mspec/expectations/expectations.rb:15:in `fail_with'
/Users/asari/mspec/lib/mspec/expectations/should.rb:8:in `should'
/Users/asari/rubyspec/library/syslog/shared/log.rb:20:in `block (3 levels) in <top (required)>'
/Users/asari/mspec/lib/mspec/runner/mspec.rb:68:in `instance_eval'
/Users/asari/mspec/lib/mspec/runner/mspec.rb:68:in `protect'
/Users/asari/mspec/lib/mspec/runner/context.rb:179:in `block in protect'
/Users/asari/mspec/lib/mspec/runner/context.rb:179:in `each'
/Users/asari/mspec/lib/mspec/runner/context.rb:179:in `all?'
/Users/asari/mspec/lib/mspec/runner/context.rb:179:in `protect'
/Users/asari/mspec/lib/mspec/runner/context.rb:207:in `block in process'
/Users/asari/mspec/lib/mspec/runner/context.rb:199:in `each'
/Users/asari/mspec/lib/mspec/runner/context.rb:199:in `process'
/Users/asari/mspec/lib/mspec/runner/mspec.rb:37:in `describe'
/Users/asari/mspec/lib/mspec/runner/object.rb:11:in `describe'
/Users/asari/rubyspec/library/syslog/err_spec.rb:5:in `<top (required)>'
/Users/asari/mspec/lib/mspec/runner/mspec.rb:56:in `load'
/Users/asari/mspec/lib/mspec/runner/mspec.rb:56:in `block (2 levels) in files'
/Users/asari/mspec/lib/mspec/runner/mspec.rb:68:in `instance_eval'
/Users/asari/mspec/lib/mspec/runner/mspec.rb:68:in `protect'
/Users/asari/mspec/lib/mspec/runner/mspec.rb:56:in `block in files'
/Users/asari/mspec/lib/mspec/runner/mspec.rb:50:in `each'
/Users/asari/mspec/lib/mspec/runner/mspec.rb:50:in `files'
/Users/asari/mspec/lib/mspec/runner/mspec.rb:42:in `process'
/Users/asari/mspec/lib/mspec/commands/mspec-run.rb:87:in `run'
/Users/asari/mspec/lib/mspec/utils/script.rb:218:in `main'
/Users/asari/mspec/bin/mspec-run:8:in `<main>'
31)
Syslog.err works as an alias for Syslog.log FAILED
Expected (STDERR): "rubyspec: Hello\nrubyspec: Hello\n"
but got: "Dec 4 23:58:28 aotearoa.local rubyspec[50377] <Error>: Hello\nDec 4 23:58:28 aotearoa.local rubyspec[50377] <Error>: Hello\n"
Backtrace
/Users/asari/mspec/lib/mspec/expectations/expectations.rb:15:in `fail_with'
/Users/asari/mspec/lib/mspec/expectations/should.rb:8:in `should'
/Users/asari/rubyspec/library/syslog/shared/log.rb:31:in `block (3 levels) in <top (required)>'
/Users/asari/mspec/lib/mspec/runner/mspec.rb:68:in `instance_eval'
/Users/asari/mspec/lib/mspec/runner/mspec.rb:68:in `protect'
/Users/asari/mspec/lib/mspec/runner/context.rb:179:in `block in protect'
/Users/asari/mspec/lib/mspec/runner/context.rb:179:in `each'
/Users/asari/mspec/lib/mspec/runner/context.rb:179:in `all?'
/Users/asari/mspec/lib/mspec/runner/context.rb:179:in `protect'
/Users/asari/mspec/lib/mspec/runner/context.rb:207:in `block in process'
/Users/asari/mspec/lib/mspec/runner/context.rb:199:in `each'
/Users/asari/mspec/lib/mspec/runner/context.rb:199:in `process'
/Users/asari/mspec/lib/mspec/runner/mspec.rb:37:in `describe'
/Users/asari/mspec/lib/mspec/runner/object.rb:11:in `describe'
/Users/asari/rubyspec/library/syslog/err_spec.rb:5:in `<top (required)>'
/Users/asari/mspec/lib/mspec/runner/mspec.rb:56:in `load'
/Users/asari/mspec/lib/mspec/runner/mspec.rb:56:in `block (2 levels) in files'
/Users/asari/mspec/lib/mspec/runner/mspec.rb:68:in `instance_eval'
/Users/asari/mspec/lib/mspec/runner/mspec.rb:68:in `protect'
/Users/asari/mspec/lib/mspec/runner/mspec.rb:56:in `block in files'
/Users/asari/mspec/lib/mspec/runner/mspec.rb:50:in `each'
/Users/asari/mspec/lib/mspec/runner/mspec.rb:50:in `files'
/Users/asari/mspec/lib/mspec/runner/mspec.rb:42:in `process'
/Users/asari/mspec/lib/mspec/commands/mspec-run.rb:87:in `run'
/Users/asari/mspec/lib/mspec/utils/script.rb:218:in `main'
/Users/asari/mspec/bin/mspec-run:8:in `<main>'
32)
Syslog.info logs a message FAILED
Expected (STDERR): "rubyspec: Hello\n"
but got: "Dec 4 23:58:28 aotearoa.local rubyspec[50377] <Info>: Hello\n"
Backtrace
/Users/asari/mspec/lib/mspec/expectations/expectations.rb:15:in `fail_with'
/Users/asari/mspec/lib/mspec/expectations/should.rb:8:in `should'
/Users/asari/rubyspec/library/syslog/shared/log.rb:12:in `block (3 levels) in <top (required)>'
/Users/asari/mspec/lib/mspec/runner/mspec.rb:68:in `instance_eval'
/Users/asari/mspec/lib/mspec/runner/mspec.rb:68:in `protect'
/Users/asari/mspec/lib/mspec/runner/context.rb:179:in `block in protect'
/Users/asari/mspec/lib/mspec/runner/context.rb:179:in `each'
/Users/asari/mspec/lib/mspec/runner/context.rb:179:in `all?'
/Users/asari/mspec/lib/mspec/runner/context.rb:179:in `protect'
/Users/asari/mspec/lib/mspec/runner/context.rb:207:in `block in process'
/Users/asari/mspec/lib/mspec/runner/context.rb:199:in `each'
/Users/asari/mspec/lib/mspec/runner/context.rb:199:in `process'
/Users/asari/mspec/lib/mspec/runner/mspec.rb:37:in `describe'
/Users/asari/mspec/lib/mspec/runner/object.rb:11:in `describe'
/Users/asari/rubyspec/library/syslog/info_spec.rb:5:in `<top (required)>'
/Users/asari/mspec/lib/mspec/runner/mspec.rb:56:in `load'
/Users/asari/mspec/lib/mspec/runner/mspec.rb:56:in `block (2 levels) in files'
/Users/asari/mspec/lib/mspec/runner/mspec.rb:68:in `instance_eval'
/Users/asari/mspec/lib/mspec/runner/mspec.rb:68:in `protect'
/Users/asari/mspec/lib/mspec/runner/mspec.rb:56:in `block in files'
/Users/asari/mspec/lib/mspec/runner/mspec.rb:50:in `each'
/Users/asari/mspec/lib/mspec/runner/mspec.rb:50:in `files'
/Users/asari/mspec/lib/mspec/runner/mspec.rb:42:in `process'
/Users/asari/mspec/lib/mspec/commands/mspec-run.rb:87:in `run'
/Users/asari/mspec/lib/mspec/utils/script.rb:218:in `main'
/Users/asari/mspec/bin/mspec-run:8:in `<main>'
33)
Syslog.info accepts sprintf arguments FAILED
Expected (STDERR): "rubyspec: Hello world\nrubyspec: 2 dogs\n"
but got: "Dec 4 23:58:28 aotearoa.local rubyspec[50377] <Info>: Hello world\nDec 4 23:58:28 aotearoa.local rubyspec[50377] <Info>: 2 dogs\n"
Backtrace
/Users/asari/mspec/lib/mspec/expectations/expectations.rb:15:in `fail_with'
/Users/asari/mspec/lib/mspec/expectations/should.rb:8:in `should'
/Users/asari/rubyspec/library/syslog/shared/log.rb:20:in `block (3 levels) in <top (required)>'
/Users/asari/mspec/lib/mspec/runner/mspec.rb:68:in `instance_eval'
/Users/asari/mspec/lib/mspec/runner/mspec.rb:68:in `protect'
/Users/asari/mspec/lib/mspec/runner/context.rb:179:in `block in protect'
/Users/asari/mspec/lib/mspec/runner/context.rb:179:in `each'
/Users/asari/mspec/lib/mspec/runner/context.rb:179:in `all?'
/Users/asari/mspec/lib/mspec/runner/context.rb:179:in `protect'
/Users/asari/mspec/lib/mspec/runner/context.rb:207:in `block in process'
/Users/asari/mspec/lib/mspec/runner/context.rb:199:in `each'
/Users/asari/mspec/lib/mspec/runner/context.rb:199:in `process'
/Users/asari/mspec/lib/mspec/runner/mspec.rb:37:in `describe'
/Users/asari/mspec/lib/mspec/runner/object.rb:11:in `describe'
/Users/asari/rubyspec/library/syslog/info_spec.rb:5:in `<top (required)>'
/Users/asari/mspec/lib/mspec/runner/mspec.rb:56:in `load'
/Users/asari/mspec/lib/mspec/runner/mspec.rb:56:in `block (2 levels) in files'
/Users/asari/mspec/lib/mspec/runner/mspec.rb:68:in `instance_eval'
/Users/asari/mspec/lib/mspec/runner/mspec.rb:68:in `protect'
/Users/asari/mspec/lib/mspec/runner/mspec.rb:56:in `block in files'
/Users/asari/mspec/lib/mspec/runner/mspec.rb:50:in `each'
/Users/asari/mspec/lib/mspec/runner/mspec.rb:50:in `files'
/Users/asari/mspec/lib/mspec/runner/mspec.rb:42:in `process'
/Users/asari/mspec/lib/mspec/commands/mspec-run.rb:87:in `run'
/Users/asari/mspec/lib/mspec/utils/script.rb:218:in `main'
/Users/asari/mspec/bin/mspec-run:8:in `<main>'
34)
Syslog.info works as an alias for Syslog.log FAILED
Expected (STDERR): "rubyspec: Hello\nrubyspec: Hello\n"
but got: "Dec 4 23:58:28 aotearoa.local rubyspec[50377] <Info>: Hello\nDec 4 23:58:28 aotearoa.local rubyspec[50377] <Info>: Hello\n"
Backtrace
/Users/asari/mspec/lib/mspec/expectations/expectations.rb:15:in `fail_with'
/Users/asari/mspec/lib/mspec/expectations/should.rb:8:in `should'
/Users/asari/rubyspec/library/syslog/shared/log.rb:31:in `block (3 levels) in <top (required)>'
/Users/asari/mspec/lib/mspec/runner/mspec.rb:68:in `instance_eval'
/Users/asari/mspec/lib/mspec/runner/mspec.rb:68:in `protect'
/Users/asari/mspec/lib/mspec/runner/context.rb:179:in `block in protect'
/Users/asari/mspec/lib/mspec/runner/context.rb:179:in `each'
/Users/asari/mspec/lib/mspec/runner/context.rb:179:in `all?'
/Users/asari/mspec/lib/mspec/runner/context.rb:179:in `protect'
/Users/asari/mspec/lib/mspec/runner/context.rb:207:in `block in process'
/Users/asari/mspec/lib/mspec/runner/context.rb:199:in `each'
/Users/asari/mspec/lib/mspec/runner/context.rb:199:in `process'
/Users/asari/mspec/lib/mspec/runner/mspec.rb:37:in `describe'
/Users/asari/mspec/lib/mspec/runner/object.rb:11:in `describe'
/Users/asari/rubyspec/library/syslog/info_spec.rb:5:in `<top (required)>'
/Users/asari/mspec/lib/mspec/runner/mspec.rb:56:in `load'
/Users/asari/mspec/lib/mspec/runner/mspec.rb:56:in `block (2 levels) in files'
/Users/asari/mspec/lib/mspec/runner/mspec.rb:68:in `instance_eval'
/Users/asari/mspec/lib/mspec/runner/mspec.rb:68:in `protect'
/Users/asari/mspec/lib/mspec/runner/mspec.rb:56:in `block in files'
/Users/asari/mspec/lib/mspec/runner/mspec.rb:50:in `each'
/Users/asari/mspec/lib/mspec/runner/mspec.rb:50:in `files'
/Users/asari/mspec/lib/mspec/runner/mspec.rb:42:in `process'
/Users/asari/mspec/lib/mspec/commands/mspec-run.rb:87:in `run'
/Users/asari/mspec/lib/mspec/utils/script.rb:218:in `main'
/Users/asari/mspec/bin/mspec-run:8:in `<main>'
35)
Syslog.log receives a priority as first argument FAILED
Expected (STDERR): "rubyspec: Hello\nrubyspec: World\n"
but got: "Dec 4 23:58:28 aotearoa.local rubyspec[50377] <Alert>: Hello\nDec 4 23:58:28 aotearoa.local rubyspec[50377] <Critical>: World\n"
Backtrace
/Users/asari/mspec/lib/mspec/expectations/expectations.rb:15:in `fail_with'
/Users/asari/mspec/lib/mspec/expectations/should.rb:8:in `should'
/Users/asari/rubyspec/library/syslog/log_spec.rb:16:in `block (3 levels) in <top (required)>'
/Users/asari/mspec/lib/mspec/runner/mspec.rb:68:in `instance_eval'
/Users/asari/mspec/lib/mspec/runner/mspec.rb:68:in `protect'
/Users/asari/mspec/lib/mspec/runner/context.rb:179:in `block in protect'
/Users/asari/mspec/lib/mspec/runner/context.rb:179:in `each'
/Users/asari/mspec/lib/mspec/runner/context.rb:179:in `all?'
/Users/asari/mspec/lib/mspec/runner/context.rb:179:in `protect'
/Users/asari/mspec/lib/mspec/runner/context.rb:207:in `block in process'
/Users/asari/mspec/lib/mspec/runner/context.rb:199:in `each'
/Users/asari/mspec/lib/mspec/runner/context.rb:199:in `process'
/Users/asari/mspec/lib/mspec/runner/mspec.rb:37:in `describe'
/Users/asari/mspec/lib/mspec/runner/object.rb:11:in `describe'
/Users/asari/rubyspec/library/syslog/log_spec.rb:4:in `<top (required)>'
/Users/asari/mspec/lib/mspec/runner/mspec.rb:56:in `load'
/Users/asari/mspec/lib/mspec/runner/mspec.rb:56:in `block (2 levels) in files'
/Users/asari/mspec/lib/mspec/runner/mspec.rb:68:in `instance_eval'
/Users/asari/mspec/lib/mspec/runner/mspec.rb:68:in `protect'
/Users/asari/mspec/lib/mspec/runner/mspec.rb:56:in `block in files'
/Users/asari/mspec/lib/mspec/runner/mspec.rb:50:in `each'
/Users/asari/mspec/lib/mspec/runner/mspec.rb:50:in `files'
/Users/asari/mspec/lib/mspec/runner/mspec.rb:42:in `process'
/Users/asari/mspec/lib/mspec/commands/mspec-run.rb:87:in `run'
/Users/asari/mspec/lib/mspec/utils/script.rb:218:in `main'
/Users/asari/mspec/bin/mspec-run:8:in `<main>'
36)
Syslog.log accepts undefined priorites FAILED
Expected (STDERR): /rubyspec: Hello/
but got: "Dec 4 23:58:28 aotearoa.local rubyspec[50377] <Alert>: Hello\n"
Backtrace
/Users/asari/mspec/lib/mspec/expectations/expectations.rb:15:in `fail_with'
/Users/asari/mspec/lib/mspec/expectations/should.rb:8:in `should'
/Users/asari/rubyspec/library/syslog/log_spec.rb:25:in `block (3 levels) in <top (required)>'
/Users/asari/mspec/lib/mspec/runner/mspec.rb:68:in `instance_eval'
/Users/asari/mspec/lib/mspec/runner/mspec.rb:68:in `protect'
/Users/asari/mspec/lib/mspec/runner/context.rb:179:in `block in protect'
/Users/asari/mspec/lib/mspec/runner/context.rb:179:in `each'
/Users/asari/mspec/lib/mspec/runner/context.rb:179:in `all?'
/Users/asari/mspec/lib/mspec/runner/context.rb:179:in `protect'
/Users/asari/mspec/lib/mspec/runner/context.rb:207:in `block in process'
/Users/asari/mspec/lib/mspec/runner/context.rb:199:in `each'
/Users/asari/mspec/lib/mspec/runner/context.rb:199:in `process'
/Users/asari/mspec/lib/mspec/runner/mspec.rb:37:in `describe'
/Users/asari/mspec/lib/mspec/runner/object.rb:11:in `describe'
/Users/asari/rubyspec/library/syslog/log_spec.rb:4:in `<top (required)>'
/Users/asari/mspec/lib/mspec/runner/mspec.rb:56:in `load'
/Users/asari/mspec/lib/mspec/runner/mspec.rb:56:in `block (2 levels) in files'
/Users/asari/mspec/lib/mspec/runner/mspec.rb:68:in `instance_eval'
/Users/asari/mspec/lib/mspec/runner/mspec.rb:68:in `protect'
/Users/asari/mspec/lib/mspec/runner/mspec.rb:56:in `block in files'
/Users/asari/mspec/lib/mspec/runner/mspec.rb:50:in `each'
/Users/asari/mspec/lib/mspec/runner/mspec.rb:50:in `files'
/Users/asari/mspec/lib/mspec/runner/mspec.rb:42:in `process'
/Users/asari/mspec/lib/mspec/commands/mspec-run.rb:87:in `run'
/Users/asari/mspec/lib/mspec/utils/script.rb:218:in `main'
/Users/asari/mspec/bin/mspec-run:8:in `<main>'
37)
Syslog.log accepts printf parameters FAILED
Expected (STDERR): "rubyspec: chunky bacon x 2\n"
but got: "Dec 4 23:58:28 aotearoa.local rubyspec[50377] <Alert>: chunky bacon x 2\n"
Backtrace
/Users/asari/mspec/lib/mspec/expectations/expectations.rb:15:in `fail_with'
/Users/asari/mspec/lib/mspec/expectations/should.rb:8:in `should'
/Users/asari/rubyspec/library/syslog/log_spec.rb:46:in `block (3 levels) in <top (required)>'
/Users/asari/mspec/lib/mspec/runner/mspec.rb:68:in `instance_eval'
/Users/asari/mspec/lib/mspec/runner/mspec.rb:68:in `protect'
/Users/asari/mspec/lib/mspec/runner/context.rb:179:in `block in protect'
/Users/asari/mspec/lib/mspec/runner/context.rb:179:in `each'
/Users/asari/mspec/lib/mspec/runner/context.rb:179:in `all?'
/Users/asari/mspec/lib/mspec/runner/context.rb:179:in `protect'
/Users/asari/mspec/lib/mspec/runner/context.rb:207:in `block in process'
/Users/asari/mspec/lib/mspec/runner/context.rb:199:in `each'
/Users/asari/mspec/lib/mspec/runner/context.rb:199:in `process'
/Users/asari/mspec/lib/mspec/runner/mspec.rb:37:in `describe'
/Users/asari/mspec/lib/mspec/runner/object.rb:11:in `describe'
/Users/asari/rubyspec/library/syslog/log_spec.rb:4:in `<top (required)>'
/Users/asari/mspec/lib/mspec/runner/mspec.rb:56:in `load'
/Users/asari/mspec/lib/mspec/runner/mspec.rb:56:in `block (2 levels) in files'
/Users/asari/mspec/lib/mspec/runner/mspec.rb:68:in `instance_eval'
/Users/asari/mspec/lib/mspec/runner/mspec.rb:68:in `protect'
/Users/asari/mspec/lib/mspec/runner/mspec.rb:56:in `block in files'
/Users/asari/mspec/lib/mspec/runner/mspec.rb:50:in `each'
/Users/asari/mspec/lib/mspec/runner/mspec.rb:50:in `files'
/Users/asari/mspec/lib/mspec/runner/mspec.rb:42:in `process'
/Users/asari/mspec/lib/mspec/commands/mspec-run.rb:87:in `run'
/Users/asari/mspec/lib/mspec/utils/script.rb:218:in `main'
/Users/asari/mspec/bin/mspec-run:8:in `<main>'
38)
Syslog.mask persists if the log is reopened FAILED
Expected 255
to equal 64
/Users/asari/mspec/lib/mspec/expectations/expectations.rb:15:in `fail_with'
/Users/asari/mspec/lib/mspec/matchers/base.rb:8:in `=='
/Users/asari/rubyspec/library/syslog/mask_spec.rb:46:in `block (3 levels) in <top (required)>'
/Users/asari/mspec/lib/mspec/runner/mspec.rb:68:in `instance_eval'
/Users/asari/mspec/lib/mspec/runner/mspec.rb:68:in `protect'
/Users/asari/mspec/lib/mspec/runner/context.rb:179:in `block in protect'
/Users/asari/mspec/lib/mspec/runner/context.rb:179:in `each'
/Users/asari/mspec/lib/mspec/runner/context.rb:179:in `all?'
/Users/asari/mspec/lib/mspec/runner/context.rb:179:in `protect'
/Users/asari/mspec/lib/mspec/runner/context.rb:207:in `block in process'
/Users/asari/mspec/lib/mspec/runner/context.rb:199:in `each'
/Users/asari/mspec/lib/mspec/runner/context.rb:199:in `process'
/Users/asari/mspec/lib/mspec/runner/mspec.rb:37:in `describe'
/Users/asari/mspec/lib/mspec/runner/object.rb:11:in `describe'
/Users/asari/rubyspec/library/syslog/mask_spec.rb:4:in `<top (required)>'
/Users/asari/mspec/lib/mspec/runner/mspec.rb:56:in `load'
/Users/asari/mspec/lib/mspec/runner/mspec.rb:56:in `block (2 levels) in files'
/Users/asari/mspec/lib/mspec/runner/mspec.rb:68:in `instance_eval'
/Users/asari/mspec/lib/mspec/runner/mspec.rb:68:in `protect'
/Users/asari/mspec/lib/mspec/runner/mspec.rb:56:in `block in files'
/Users/asari/mspec/lib/mspec/runner/mspec.rb:50:in `each'
/Users/asari/mspec/lib/mspec/runner/mspec.rb:50:in `files'
/Users/asari/mspec/lib/mspec/runner/mspec.rb:42:in `process'
/Users/asari/mspec/lib/mspec/commands/mspec-run.rb:87:in `run'
/Users/asari/mspec/lib/mspec/utils/script.rb:218:in `main'
/Users/asari/mspec/bin/mspec-run:8:in `<main>'
39)
An exception occurred during: after :each
Syslog.mask persists if the log is reopened FAILED
Expected true to be false
/Users/asari/mspec/lib/mspec/expectations/expectations.rb:15:in `fail_with'
/Users/asari/mspec/lib/mspec/expectations/should.rb:8:in `should'
/Users/asari/rubyspec/library/syslog/mask_spec.rb:12:in `block (3 levels) in <top (required)>'
/Users/asari/mspec/lib/mspec/runner/mspec.rb:68:in `instance_eval'
/Users/asari/mspec/lib/mspec/runner/mspec.rb:68:in `protect'
/Users/asari/mspec/lib/mspec/runner/context.rb:179:in `block in protect'
/Users/asari/mspec/lib/mspec/runner/context.rb:179:in `each'
/Users/asari/mspec/lib/mspec/runner/context.rb:179:in `all?'
/Users/asari/mspec/lib/mspec/runner/context.rb:179:in `protect'
/Users/asari/mspec/lib/mspec/runner/context.rb:211:in `block in process'
/Users/asari/mspec/lib/mspec/runner/context.rb:199:in `each'
/Users/asari/mspec/lib/mspec/runner/context.rb:199:in `process'
/Users/asari/mspec/lib/mspec/runner/mspec.rb:37:in `describe'
/Users/asari/mspec/lib/mspec/runner/object.rb:11:in `describe'
/Users/asari/rubyspec/library/syslog/mask_spec.rb:4:in `<top (required)>'
/Users/asari/mspec/lib/mspec/runner/mspec.rb:56:in `load'
/Users/asari/mspec/lib/mspec/runner/mspec.rb:56:in `block (2 levels) in files'
/Users/asari/mspec/lib/mspec/runner/mspec.rb:68:in `instance_eval'
/Users/asari/mspec/lib/mspec/runner/mspec.rb:68:in `protect'
/Users/asari/mspec/lib/mspec/runner/mspec.rb:56:in `block in files'
/Users/asari/mspec/lib/mspec/runner/mspec.rb:50:in `each'
/Users/asari/mspec/lib/mspec/runner/mspec.rb:50:in `files'
/Users/asari/mspec/lib/mspec/runner/mspec.rb:42:in `process'
/Users/asari/mspec/lib/mspec/commands/mspec-run.rb:87:in `run'
/Users/asari/mspec/lib/mspec/utils/script.rb:218:in `main'
/Users/asari/mspec/bin/mspec-run:8:in `<main>'
40)
An exception occurred during: after :all ERROR
RuntimeError: syslog already open
/Users/asari/rubyspec/library/syslog/mask_spec.rb:17:in `open'
/Users/asari/rubyspec/library/syslog/mask_spec.rb:17:in `block (3 levels) in <top (required)>'
/Users/asari/mspec/lib/mspec/runner/mspec.rb:68:in `instance_eval'
/Users/asari/mspec/lib/mspec/runner/mspec.rb:68:in `protect'
/Users/asari/mspec/lib/mspec/runner/context.rb:179:in `block in protect'
/Users/asari/mspec/lib/mspec/runner/context.rb:179:in `each'
/Users/asari/mspec/lib/mspec/runner/context.rb:179:in `all?'
/Users/asari/mspec/lib/mspec/runner/context.rb:179:in `protect'
/Users/asari/mspec/lib/mspec/runner/context.rb:219:in `process'
/Users/asari/mspec/lib/mspec/runner/mspec.rb:37:in `describe'
/Users/asari/mspec/lib/mspec/runner/object.rb:11:in `describe'
/Users/asari/rubyspec/library/syslog/mask_spec.rb:4:in `<top (required)>'
/Users/asari/mspec/lib/mspec/runner/mspec.rb:56:in `load'
/Users/asari/mspec/lib/mspec/runner/mspec.rb:56:in `block (2 levels) in files'
/Users/asari/mspec/lib/mspec/runner/mspec.rb:68:in `instance_eval'
/Users/asari/mspec/lib/mspec/runner/mspec.rb:68:in `protect'
/Users/asari/mspec/lib/mspec/runner/mspec.rb:56:in `block in files'
/Users/asari/mspec/lib/mspec/runner/mspec.rb:50:in `each'
/Users/asari/mspec/lib/mspec/runner/mspec.rb:50:in `files'
/Users/asari/mspec/lib/mspec/runner/mspec.rb:42:in `process'
/Users/asari/mspec/lib/mspec/commands/mspec-run.rb:87:in `run'
/Users/asari/mspec/lib/mspec/utils/script.rb:218:in `main'
/Users/asari/mspec/bin/mspec-run:8:in `<main>'
41)
An exception occurred during: before :each
Syslog.mask= sets the log priority mask FAILED
Expected true to be false
/Users/asari/mspec/lib/mspec/expectations/expectations.rb:15:in `fail_with'
/Users/asari/mspec/lib/mspec/expectations/should.rb:8:in `should'
/Users/asari/rubyspec/library/syslog/mask_spec.rb:60:in `block (3 levels) in <top (required)>'
/Users/asari/mspec/lib/mspec/runner/mspec.rb:68:in `instance_eval'
/Users/asari/mspec/lib/mspec/runner/mspec.rb:68:in `protect'
/Users/asari/mspec/lib/mspec/runner/context.rb:179:in `block in protect'
/Users/asari/mspec/lib/mspec/runner/context.rb:179:in `each'
/Users/asari/mspec/lib/mspec/runner/context.rb:179:in `all?'
/Users/asari/mspec/lib/mspec/runner/context.rb:179:in `protect'
/Users/asari/mspec/lib/mspec/runner/context.rb:204:in `block in process'
/Users/asari/mspec/lib/mspec/runner/context.rb:199:in `each'
/Users/asari/mspec/lib/mspec/runner/context.rb:199:in `process'
/Users/asari/mspec/lib/mspec/runner/mspec.rb:37:in `describe'
/Users/asari/mspec/lib/mspec/runner/object.rb:11:in `describe'
/Users/asari/rubyspec/library/syslog/mask_spec.rb:56:in `<top (required)>'
/Users/asari/mspec/lib/mspec/runner/mspec.rb:56:in `load'
/Users/asari/mspec/lib/mspec/runner/mspec.rb:56:in `block (2 levels) in files'
/Users/asari/mspec/lib/mspec/runner/mspec.rb:68:in `instance_eval'
/Users/asari/mspec/lib/mspec/runner/mspec.rb:68:in `protect'
/Users/asari/mspec/lib/mspec/runner/mspec.rb:56:in `block in files'
/Users/asari/mspec/lib/mspec/runner/mspec.rb:50:in `each'
/Users/asari/mspec/lib/mspec/runner/mspec.rb:50:in `files'
/Users/asari/mspec/lib/mspec/runner/mspec.rb:42:in `process'
/Users/asari/mspec/lib/mspec/commands/mspec-run.rb:87:in `run'
/Users/asari/mspec/lib/mspec/utils/script.rb:218:in `main'
/Users/asari/mspec/bin/mspec-run:8:in `<main>'
42)
An exception occurred during: before :each
Syslog.mask= raises an error if the log is closed FAILED
Expected true to be false
/Users/asari/mspec/lib/mspec/expectations/expectations.rb:15:in `fail_with'
/Users/asari/mspec/lib/mspec/expectations/should.rb:8:in `should'
/Users/asari/rubyspec/library/syslog/mask_spec.rb:60:in `block (3 levels) in <top (required)>'
/Users/asari/mspec/lib/mspec/runner/mspec.rb:68:in `instance_eval'
/Users/asari/mspec/lib/mspec/runner/mspec.rb:68:in `protect'
/Users/asari/mspec/lib/mspec/runner/context.rb:179:in `block in protect'
/Users/asari/mspec/lib/mspec/runner/context.rb:179:in `each'
/Users/asari/mspec/lib/mspec/runner/context.rb:179:in `all?'
/Users/asari/mspec/lib/mspec/runner/context.rb:179:in `protect'
/Users/asari/mspec/lib/mspec/runner/context.rb:204:in `block in process'
/Users/asari/mspec/lib/mspec/runner/context.rb:199:in `each'
/Users/asari/mspec/lib/mspec/runner/context.rb:199:in `process'
/Users/asari/mspec/lib/mspec/runner/mspec.rb:37:in `describe'
/Users/asari/mspec/lib/mspec/runner/object.rb:11:in `describe'
/Users/asari/rubyspec/library/syslog/mask_spec.rb:56:in `<top (required)>'
/Users/asari/mspec/lib/mspec/runner/mspec.rb:56:in `load'
/Users/asari/mspec/lib/mspec/runner/mspec.rb:56:in `block (2 levels) in files'
/Users/asari/mspec/lib/mspec/runner/mspec.rb:68:in `instance_eval'
/Users/asari/mspec/lib/mspec/runner/mspec.rb:68:in `protect'
/Users/asari/mspec/lib/mspec/runner/mspec.rb:56:in `block in files'
/Users/asari/mspec/lib/mspec/runner/mspec.rb:50:in `each'
/Users/asari/mspec/lib/mspec/runner/mspec.rb:50:in `files'
/Users/asari/mspec/lib/mspec/runner/mspec.rb:42:in `process'
/Users/asari/mspec/lib/mspec/commands/mspec-run.rb:87:in `run'
/Users/asari/mspec/lib/mspec/utils/script.rb:218:in `main'
/Users/asari/mspec/bin/mspec-run:8:in `<main>'
43)
An exception occurred during: before :each
Syslog.mask= only accepts numbers FAILED
Expected true to be false
/Users/asari/mspec/lib/mspec/expectations/expectations.rb:15:in `fail_with'
/Users/asari/mspec/lib/mspec/expectations/should.rb:8:in `should'
/Users/asari/rubyspec/library/syslog/mask_spec.rb:60:in `block (3 levels) in <top (required)>'
/Users/asari/mspec/lib/mspec/runner/mspec.rb:68:in `instance_eval'
/Users/asari/mspec/lib/mspec/runner/mspec.rb:68:in `protect'
/Users/asari/mspec/lib/mspec/runner/context.rb:179:in `block in protect'
/Users/asari/mspec/lib/mspec/runner/context.rb:179:in `each'
/Users/asari/mspec/lib/mspec/runner/context.rb:179:in `all?'
/Users/asari/mspec/lib/mspec/runner/context.rb:179:in `protect'
/Users/asari/mspec/lib/mspec/runner/context.rb:204:in `block in process'
/Users/asari/mspec/lib/mspec/runner/context.rb:199:in `each'
/Users/asari/mspec/lib/mspec/runner/context.rb:199:in `process'
/Users/asari/mspec/lib/mspec/runner/mspec.rb:37:in `describe'
/Users/asari/mspec/lib/mspec/runner/object.rb:11:in `describe'
/Users/asari/rubyspec/library/syslog/mask_spec.rb:56:in `<top (required)>'
/Users/asari/mspec/lib/mspec/runner/mspec.rb:56:in `load'
/Users/asari/mspec/lib/mspec/runner/mspec.rb:56:in `block (2 levels) in files'
/Users/asari/mspec/lib/mspec/runner/mspec.rb:68:in `instance_eval'
/Users/asari/mspec/lib/mspec/runner/mspec.rb:68:in `protect'
/Users/asari/mspec/lib/mspec/runner/mspec.rb:56:in `block in files'
/Users/asari/mspec/lib/mspec/runner/mspec.rb:50:in `each'
/Users/asari/mspec/lib/mspec/runner/mspec.rb:50:in `files'
/Users/asari/mspec/lib/mspec/runner/mspec.rb:42:in `process'
/Users/asari/mspec/lib/mspec/commands/mspec-run.rb:87:in `run'
/Users/asari/mspec/lib/mspec/utils/script.rb:218:in `main'
/Users/asari/mspec/bin/mspec-run:8:in `<main>'
44)
An exception occurred during: after :all ERROR
RuntimeError: syslog already open
/Users/asari/rubyspec/library/syslog/mask_spec.rb:69:in `open'
/Users/asari/rubyspec/library/syslog/mask_spec.rb:69:in `block (3 levels) in <top (required)>'
/Users/asari/mspec/lib/mspec/runner/mspec.rb:68:in `instance_eval'
/Users/asari/mspec/lib/mspec/runner/mspec.rb:68:in `protect'
/Users/asari/mspec/lib/mspec/runner/context.rb:179:in `block in protect'
/Users/asari/mspec/lib/mspec/runner/context.rb:179:in `each'
/Users/asari/mspec/lib/mspec/runner/context.rb:179:in `all?'
/Users/asari/mspec/lib/mspec/runner/context.rb:179:in `protect'
/Users/asari/mspec/lib/mspec/runner/context.rb:219:in `process'
/Users/asari/mspec/lib/mspec/runner/mspec.rb:37:in `describe'
/Users/asari/mspec/lib/mspec/runner/object.rb:11:in `describe'
/Users/asari/rubyspec/library/syslog/mask_spec.rb:56:in `<top (required)>'
/Users/asari/mspec/lib/mspec/runner/mspec.rb:56:in `load'
/Users/asari/mspec/lib/mspec/runner/mspec.rb:56:in `block (2 levels) in files'
/Users/asari/mspec/lib/mspec/runner/mspec.rb:68:in `instance_eval'
/Users/asari/mspec/lib/mspec/runner/mspec.rb:68:in `protect'
/Users/asari/mspec/lib/mspec/runner/mspec.rb:56:in `block in files'
/Users/asari/mspec/lib/mspec/runner/mspec.rb:50:in `each'
/Users/asari/mspec/lib/mspec/runner/mspec.rb:50:in `files'
/Users/asari/mspec/lib/mspec/runner/mspec.rb:42:in `process'
/Users/asari/mspec/lib/mspec/commands/mspec-run.rb:87:in `run'
/Users/asari/mspec/lib/mspec/utils/script.rb:218:in `main'
/Users/asari/mspec/bin/mspec-run:8:in `<main>'
45)
An exception occurred during: before :each
Syslog.notice logs a message FAILED
Expected true to be false
/Users/asari/mspec/lib/mspec/expectations/expectations.rb:15:in `fail_with'
/Users/asari/mspec/lib/mspec/expectations/should.rb:8:in `should'
/Users/asari/rubyspec/library/syslog/shared/log.rb:4:in `block (3 levels) in <top (required)>'
/Users/asari/mspec/lib/mspec/runner/mspec.rb:68:in `instance_eval'
/Users/asari/mspec/lib/mspec/runner/mspec.rb:68:in `protect'
/Users/asari/mspec/lib/mspec/runner/context.rb:179:in `block in protect'
/Users/asari/mspec/lib/mspec/runner/context.rb:179:in `each'
/Users/asari/mspec/lib/mspec/runner/context.rb:179:in `all?'
/Users/asari/mspec/lib/mspec/runner/context.rb:179:in `protect'
/Users/asari/mspec/lib/mspec/runner/context.rb:204:in `block in process'
/Users/asari/mspec/lib/mspec/runner/context.rb:199:in `each'
/Users/asari/mspec/lib/mspec/runner/context.rb:199:in `process'
/Users/asari/mspec/lib/mspec/runner/mspec.rb:37:in `describe'
/Users/asari/mspec/lib/mspec/runner/object.rb:11:in `describe'
/Users/asari/rubyspec/library/syslog/notice_spec.rb:5:in `<top (required)>'
/Users/asari/mspec/lib/mspec/runner/mspec.rb:56:in `load'
/Users/asari/mspec/lib/mspec/runner/mspec.rb:56:in `block (2 levels) in files'
/Users/asari/mspec/lib/mspec/runner/mspec.rb:68:in `instance_eval'
/Users/asari/mspec/lib/mspec/runner/mspec.rb:68:in `protect'
/Users/asari/mspec/lib/mspec/runner/mspec.rb:56:in `block in files'
/Users/asari/mspec/lib/mspec/runner/mspec.rb:50:in `each'
/Users/asari/mspec/lib/mspec/runner/mspec.rb:50:in `files'
/Users/asari/mspec/lib/mspec/runner/mspec.rb:42:in `process'
/Users/asari/mspec/lib/mspec/commands/mspec-run.rb:87:in `run'
/Users/asari/mspec/lib/mspec/utils/script.rb:218:in `main'
/Users/asari/mspec/bin/mspec-run:8:in `<main>'
46)
An exception occurred during: before :each
Syslog.notice accepts sprintf arguments FAILED
Expected true to be false
/Users/asari/mspec/lib/mspec/expectations/expectations.rb:15:in `fail_with'
/Users/asari/mspec/lib/mspec/expectations/should.rb:8:in `should'
/Users/asari/rubyspec/library/syslog/shared/log.rb:4:in `block (3 levels) in <top (required)>'
/Users/asari/mspec/lib/mspec/runner/mspec.rb:68:in `instance_eval'
/Users/asari/mspec/lib/mspec/runner/mspec.rb:68:in `protect'
/Users/asari/mspec/lib/mspec/runner/context.rb:179:in `block in protect'
/Users/asari/mspec/lib/mspec/runner/context.rb:179:in `each'
/Users/asari/mspec/lib/mspec/runner/context.rb:179:in `all?'
/Users/asari/mspec/lib/mspec/runner/context.rb:179:in `protect'
/Users/asari/mspec/lib/mspec/runner/context.rb:204:in `block in process'
/Users/asari/mspec/lib/mspec/runner/context.rb:199:in `each'
/Users/asari/mspec/lib/mspec/runner/context.rb:199:in `process'
/Users/asari/mspec/lib/mspec/runner/mspec.rb:37:in `describe'
/Users/asari/mspec/lib/mspec/runner/object.rb:11:in `describe'
/Users/asari/rubyspec/library/syslog/notice_spec.rb:5:in `<top (required)>'
/Users/asari/mspec/lib/mspec/runner/mspec.rb:56:in `load'
/Users/asari/mspec/lib/mspec/runner/mspec.rb:56:in `block (2 levels) in files'
/Users/asari/mspec/lib/mspec/runner/mspec.rb:68:in `instance_eval'
/Users/asari/mspec/lib/mspec/runner/mspec.rb:68:in `protect'
/Users/asari/mspec/lib/mspec/runner/mspec.rb:56:in `block in files'
/Users/asari/mspec/lib/mspec/runner/mspec.rb:50:in `each'
/Users/asari/mspec/lib/mspec/runner/mspec.rb:50:in `files'
/Users/asari/mspec/lib/mspec/runner/mspec.rb:42:in `process'
/Users/asari/mspec/lib/mspec/commands/mspec-run.rb:87:in `run'
/Users/asari/mspec/lib/mspec/utils/script.rb:218:in `main'
/Users/asari/mspec/bin/mspec-run:8:in `<main>'
47)
An exception occurred during: before :each
Syslog.notice works as an alias for Syslog.log FAILED
Expected true to be false
/Users/asari/mspec/lib/mspec/expectations/expectations.rb:15:in `fail_with'
/Users/asari/mspec/lib/mspec/expectations/should.rb:8:in `should'
/Users/asari/rubyspec/library/syslog/shared/log.rb:4:in `block (3 levels) in <top (required)>'
/Users/asari/mspec/lib/mspec/runner/mspec.rb:68:in `instance_eval'
/Users/asari/mspec/lib/mspec/runner/mspec.rb:68:in `protect'
/Users/asari/mspec/lib/mspec/runner/context.rb:179:in `block in protect'
/Users/asari/mspec/lib/mspec/runner/context.rb:179:in `each'
/Users/asari/mspec/lib/mspec/runner/context.rb:179:in `all?'
/Users/asari/mspec/lib/mspec/runner/context.rb:179:in `protect'
/Users/asari/mspec/lib/mspec/runner/context.rb:204:in `block in process'
/Users/asari/mspec/lib/mspec/runner/context.rb:199:in `each'
/Users/asari/mspec/lib/mspec/runner/context.rb:199:in `process'
/Users/asari/mspec/lib/mspec/runner/mspec.rb:37:in `describe'
/Users/asari/mspec/lib/mspec/runner/object.rb:11:in `describe'
/Users/asari/rubyspec/library/syslog/notice_spec.rb:5:in `<top (required)>'
/Users/asari/mspec/lib/mspec/runner/mspec.rb:56:in `load'
/Users/asari/mspec/lib/mspec/runner/mspec.rb:56:in `block (2 levels) in files'
/Users/asari/mspec/lib/mspec/runner/mspec.rb:68:in `instance_eval'
/Users/asari/mspec/lib/mspec/runner/mspec.rb:68:in `protect'
/Users/asari/mspec/lib/mspec/runner/mspec.rb:56:in `block in files'
/Users/asari/mspec/lib/mspec/runner/mspec.rb:50:in `each'
/Users/asari/mspec/lib/mspec/runner/mspec.rb:50:in `files'
/Users/asari/mspec/lib/mspec/runner/mspec.rb:42:in `process'
/Users/asari/mspec/lib/mspec/commands/mspec-run.rb:87:in `run'
/Users/asari/mspec/lib/mspec/utils/script.rb:218:in `main'
/Users/asari/mspec/bin/mspec-run:8:in `<main>'
48)
An exception occurred during: before :each
Syslog.open returns the module FAILED
Expected true to be false
/Users/asari/mspec/lib/mspec/expectations/expectations.rb:15:in `fail_with'
/Users/asari/mspec/lib/mspec/expectations/should.rb:8:in `should'
/Users/asari/rubyspec/library/syslog/open_spec.rb:9:in `block (3 levels) in <top (required)>'
/Users/asari/mspec/lib/mspec/runner/mspec.rb:68:in `instance_eval'
/Users/asari/mspec/lib/mspec/runner/mspec.rb:68:in `protect'
/Users/asari/mspec/lib/mspec/runner/context.rb:179:in `block in protect'
/Users/asari/mspec/lib/mspec/runner/context.rb:179:in `each'
/Users/asari/mspec/lib/mspec/runner/context.rb:179:in `all?'
/Users/asari/mspec/lib/mspec/runner/context.rb:179:in `protect'
/Users/asari/mspec/lib/mspec/runner/context.rb:204:in `block in process'
/Users/asari/mspec/lib/mspec/runner/context.rb:199:in `each'
/Users/asari/mspec/lib/mspec/runner/context.rb:199:in `process'
/Users/asari/mspec/lib/mspec/runner/mspec.rb:37:in `describe'
/Users/asari/mspec/lib/mspec/runner/object.rb:11:in `describe'
/Users/asari/rubyspec/library/syslog/open_spec.rb:5:in `<top (required)>'
/Users/asari/mspec/lib/mspec/runner/mspec.rb:56:in `load'
/Users/asari/mspec/lib/mspec/runner/mspec.rb:56:in `block (2 levels) in files'
/Users/asari/mspec/lib/mspec/runner/mspec.rb:68:in `instance_eval'
/Users/asari/mspec/lib/mspec/runner/mspec.rb:68:in `protect'
/Users/asari/mspec/lib/mspec/runner/mspec.rb:56:in `block in files'
/Users/asari/mspec/lib/mspec/runner/mspec.rb:50:in `each'
/Users/asari/mspec/lib/mspec/runner/mspec.rb:50:in `files'
/Users/asari/mspec/lib/mspec/runner/mspec.rb:42:in `process'
/Users/asari/mspec/lib/mspec/commands/mspec-run.rb:87:in `run'
/Users/asari/mspec/lib/mspec/utils/script.rb:218:in `main'
/Users/asari/mspec/bin/mspec-run:8:in `<main>'
49)
An exception occurred during: before :each
Syslog.open receives an identity as first argument FAILED
Expected true to be false
/Users/asari/mspec/lib/mspec/expectations/expectations.rb:15:in `fail_with'
/Users/asari/mspec/lib/mspec/expectations/should.rb:8:in `should'
/Users/asari/rubyspec/library/syslog/open_spec.rb:9:in `block (3 levels) in <top (required)>'
/Users/asari/mspec/lib/mspec/runner/mspec.rb:68:in `instance_eval'
/Users/asari/mspec/lib/mspec/runner/mspec.rb:68:in `protect'
/Users/asari/mspec/lib/mspec/runner/context.rb:179:in `block in protect'
/Users/asari/mspec/lib/mspec/runner/context.rb:179:in `each'
/Users/asari/mspec/lib/mspec/runner/context.rb:179:in `all?'
/Users/asari/mspec/lib/mspec/runner/context.rb:179:in `protect'
/Users/asari/mspec/lib/mspec/runner/context.rb:204:in `block in process'
/Users/asari/mspec/lib/mspec/runner/context.rb:199:in `each'
/Users/asari/mspec/lib/mspec/runner/context.rb:199:in `process'
/Users/asari/mspec/lib/mspec/runner/mspec.rb:37:in `describe'
/Users/asari/mspec/lib/mspec/runner/object.rb:11:in `describe'
/Users/asari/rubyspec/library/syslog/open_spec.rb:5:in `<top (required)>'
/Users/asari/mspec/lib/mspec/runner/mspec.rb:56:in `load'
/Users/asari/mspec/lib/mspec/runner/mspec.rb:56:in `block (2 levels) in files'
/Users/asari/mspec/lib/mspec/runner/mspec.rb:68:in `instance_eval'
/Users/asari/mspec/lib/mspec/runner/mspec.rb:68:in `protect'
/Users/asari/mspec/lib/mspec/runner/mspec.rb:56:in `block in files'
/Users/asari/mspec/lib/mspec/runner/mspec.rb:50:in `each'
/Users/asari/mspec/lib/mspec/runner/mspec.rb:50:in `files'
/Users/asari/mspec/lib/mspec/runner/mspec.rb:42:in `process'
/Users/asari/mspec/lib/mspec/commands/mspec-run.rb:87:in `run'
/Users/asari/mspec/lib/mspec/utils/script.rb:218:in `main'
/Users/asari/mspec/bin/mspec-run:8:in `<main>'
50)
An exception occurred during: before :each
Syslog.open defaults the identity to $0 FAILED
Expected true to be false
/Users/asari/mspec/lib/mspec/expectations/expectations.rb:15:in `fail_with'
/Users/asari/mspec/lib/mspec/expectations/should.rb:8:in `should'
/Users/asari/rubyspec/library/syslog/open_spec.rb:9:in `block (3 levels) in <top (required)>'
/Users/asari/mspec/lib/mspec/runner/mspec.rb:68:in `instance_eval'
/Users/asari/mspec/lib/mspec/runner/mspec.rb:68:in `protect'
/Users/asari/mspec/lib/mspec/runner/context.rb:179:in `block in protect'
/Users/asari/mspec/lib/mspec/runner/context.rb:179:in `each'
/Users/asari/mspec/lib/mspec/runner/context.rb:179:in `all?'
/Users/asari/mspec/lib/mspec/runner/context.rb:179:in `protect'
/Users/asari/mspec/lib/mspec/runner/context.rb:204:in `block in process'
/Users/asari/mspec/lib/mspec/runner/context.rb:199:in `each'
/Users/asari/mspec/lib/mspec/runner/context.rb:199:in `process'
/Users/asari/mspec/lib/mspec/runner/mspec.rb:37:in `describe'
/Users/asari/mspec/lib/mspec/runner/object.rb:11:in `describe'
/Users/asari/rubyspec/library/syslog/open_spec.rb:5:in `<top (required)>'
/Users/asari/mspec/lib/mspec/runner/mspec.rb:56:in `load'
/Users/asari/mspec/lib/mspec/runner/mspec.rb:56:in `block (2 levels) in files'
/Users/asari/mspec/lib/mspec/runner/mspec.rb:68:in `instance_eval'
/Users/asari/mspec/lib/mspec/runner/mspec.rb:68:in `protect'
/Users/asari/mspec/lib/mspec/runner/mspec.rb:56:in `block in files'
/Users/asari/mspec/lib/mspec/runner/mspec.rb:50:in `each'
/Users/asari/mspec/lib/mspec/runner/mspec.rb:50:in `files'
/Users/asari/mspec/lib/mspec/runner/mspec.rb:42:in `process'
/Users/asari/mspec/lib/mspec/commands/mspec-run.rb:87:in `run'
/Users/asari/mspec/lib/mspec/utils/script.rb:218:in `main'
/Users/asari/mspec/bin/mspec-run:8:in `<main>'
51)
An exception occurred during: before :each
Syslog.open receives the logging options as second argument FAILED
Expected true to be false
/Users/asari/mspec/lib/mspec/expectations/expectations.rb:15:in `fail_with'
/Users/asari/mspec/lib/mspec/expectations/should.rb:8:in `should'
/Users/asari/rubyspec/library/syslog/open_spec.rb:9:in `block (3 levels) in <top (required)>'
/Users/asari/mspec/lib/mspec/runner/mspec.rb:68:in `instance_eval'
/Users/asari/mspec/lib/mspec/runner/mspec.rb:68:in `protect'
/Users/asari/mspec/lib/mspec/runner/context.rb:179:in `block in protect'
/Users/asari/mspec/lib/mspec/runner/context.rb:179:in `each'
/Users/asari/mspec/lib/mspec/runner/context.rb:179:in `all?'
/Users/asari/mspec/lib/mspec/runner/context.rb:179:in `protect'
/Users/asari/mspec/lib/mspec/runner/context.rb:204:in `block in process'
/Users/asari/mspec/lib/mspec/runner/context.rb:199:in `each'
/Users/asari/mspec/lib/mspec/runner/context.rb:199:in `process'
/Users/asari/mspec/lib/mspec/runner/mspec.rb:37:in `describe'
/Users/asari/mspec/lib/mspec/runner/object.rb:11:in `describe'
/Users/asari/rubyspec/library/syslog/open_spec.rb:5:in `<top (required)>'
/Users/asari/mspec/lib/mspec/runner/mspec.rb:56:in `load'
/Users/asari/mspec/lib/mspec/runner/mspec.rb:56:in `block (2 levels) in files'
/Users/asari/mspec/lib/mspec/runner/mspec.rb:68:in `instance_eval'
/Users/asari/mspec/lib/mspec/runner/mspec.rb:68:in `protect'
/Users/asari/mspec/lib/mspec/runner/mspec.rb:56:in `block in files'
/Users/asari/mspec/lib/mspec/runner/mspec.rb:50:in `each'
/Users/asari/mspec/lib/mspec/runner/mspec.rb:50:in `files'
/Users/asari/mspec/lib/mspec/runner/mspec.rb:42:in `process'
/Users/asari/mspec/lib/mspec/commands/mspec-run.rb:87:in `run'
/Users/asari/mspec/lib/mspec/utils/script.rb:218:in `main'
/Users/asari/mspec/bin/mspec-run:8:in `<main>'
52)
An exception occurred during: before :each
Syslog.open defaults the logging options to LOG_PID | LOG_CONS FAILED
Expected true to be false
/Users/asari/mspec/lib/mspec/expectations/expectations.rb:15:in `fail_with'
/Users/asari/mspec/lib/mspec/expectations/should.rb:8:in `should'
/Users/asari/rubyspec/library/syslog/open_spec.rb:9:in `block (3 levels) in <top (required)>'
/Users/asari/mspec/lib/mspec/runner/mspec.rb:68:in `instance_eval'
/Users/asari/mspec/lib/mspec/runner/mspec.rb:68:in `protect'
/Users/asari/mspec/lib/mspec/runner/context.rb:179:in `block in protect'
/Users/asari/mspec/lib/mspec/runner/context.rb:179:in `each'
/Users/asari/mspec/lib/mspec/runner/context.rb:179:in `all?'
/Users/asari/mspec/lib/mspec/runner/context.rb:179:in `protect'
/Users/asari/mspec/lib/mspec/runner/context.rb:204:in `block in process'
/Users/asari/mspec/lib/mspec/runner/context.rb:199:in `each'
/Users/asari/mspec/lib/mspec/runner/context.rb:199:in `process'
/Users/asari/mspec/lib/mspec/runner/mspec.rb:37:in `describe'
/Users/asari/mspec/lib/mspec/runner/object.rb:11:in `describe'
/Users/asari/rubyspec/library/syslog/open_spec.rb:5:in `<top (required)>'
/Users/asari/mspec/lib/mspec/runner/mspec.rb:56:in `load'
/Users/asari/mspec/lib/mspec/runner/mspec.rb:56:in `block (2 levels) in files'
/Users/asari/mspec/lib/mspec/runner/mspec.rb:68:in `instance_eval'
/Users/asari/mspec/lib/mspec/runner/mspec.rb:68:in `protect'
/Users/asari/mspec/lib/mspec/runner/mspec.rb:56:in `block in files'
/Users/asari/mspec/lib/mspec/runner/mspec.rb:50:in `each'
/Users/asari/mspec/lib/mspec/runner/mspec.rb:50:in `files'
/Users/asari/mspec/lib/mspec/runner/mspec.rb:42:in `process'
/Users/asari/mspec/lib/mspec/commands/mspec-run.rb:87:in `run'
/Users/asari/mspec/lib/mspec/utils/script.rb:218:in `main'
/Users/asari/mspec/bin/mspec-run:8:in `<main>'
53)
An exception occurred during: before :each
Syslog.open receives a facility as third argument FAILED
Expected true to be false
/Users/asari/mspec/lib/mspec/expectations/expectations.rb:15:in `fail_with'
/Users/asari/mspec/lib/mspec/expectations/should.rb:8:in `should'
/Users/asari/rubyspec/library/syslog/open_spec.rb:9:in `block (3 levels) in <top (required)>'
/Users/asari/mspec/lib/mspec/runner/mspec.rb:68:in `instance_eval'
/Users/asari/mspec/lib/mspec/runner/mspec.rb:68:in `protect'
/Users/asari/mspec/lib/mspec/runner/context.rb:179:in `block in protect'
/Users/asari/mspec/lib/mspec/runner/context.rb:179:in `each'
/Users/asari/mspec/lib/mspec/runner/context.rb:179:in `all?'
/Users/asari/mspec/lib/mspec/runner/context.rb:179:in `protect'
/Users/asari/mspec/lib/mspec/runner/context.rb:204:in `block in process'
/Users/asari/mspec/lib/mspec/runner/context.rb:199:in `each'
/Users/asari/mspec/lib/mspec/runner/context.rb:199:in `process'
/Users/asari/mspec/lib/mspec/runner/mspec.rb:37:in `describe'
/Users/asari/mspec/lib/mspec/runner/object.rb:11:in `describe'
/Users/asari/rubyspec/library/syslog/open_spec.rb:5:in `<top (required)>'
/Users/asari/mspec/lib/mspec/runner/mspec.rb:56:in `load'
/Users/asari/mspec/lib/mspec/runner/mspec.rb:56:in `block (2 levels) in files'
/Users/asari/mspec/lib/mspec/runner/mspec.rb:68:in `instance_eval'
/Users/asari/mspec/lib/mspec/runner/mspec.rb:68:in `protect'
/Users/asari/mspec/lib/mspec/runner/mspec.rb:56:in `block in files'
/Users/asari/mspec/lib/mspec/runner/mspec.rb:50:in `each'
/Users/asari/mspec/lib/mspec/runner/mspec.rb:50:in `files'
/Users/asari/mspec/lib/mspec/runner/mspec.rb:42:in `process'
/Users/asari/mspec/lib/mspec/commands/mspec-run.rb:87:in `run'
/Users/asari/mspec/lib/mspec/utils/script.rb:218:in `main'
/Users/asari/mspec/bin/mspec-run:8:in `<main>'
54)
An exception occurred during: before :each
Syslog.open defaults the facility to LOG_USER FAILED
Expected true to be false
/Users/asari/mspec/lib/mspec/expectations/expectations.rb:15:in `fail_with'
/Users/asari/mspec/lib/mspec/expectations/should.rb:8:in `should'
/Users/asari/rubyspec/library/syslog/open_spec.rb:9:in `block (3 levels) in <top (required)>'
/Users/asari/mspec/lib/mspec/runner/mspec.rb:68:in `instance_eval'
/Users/asari/mspec/lib/mspec/runner/mspec.rb:68:in `protect'
/Users/asari/mspec/lib/mspec/runner/context.rb:179:in `block in protect'
/Users/asari/mspec/lib/mspec/runner/context.rb:179:in `each'
/Users/asari/mspec/lib/mspec/runner/context.rb:179:in `all?'
/Users/asari/mspec/lib/mspec/runner/context.rb:179:in `protect'
/Users/asari/mspec/lib/mspec/runner/context.rb:204:in `block in process'
/Users/asari/mspec/lib/mspec/runner/context.rb:199:in `each'
/Users/asari/mspec/lib/mspec/runner/context.rb:199:in `process'
/Users/asari/mspec/lib/mspec/runner/mspec.rb:37:in `describe'
/Users/asari/mspec/lib/mspec/runner/object.rb:11:in `describe'
/Users/asari/rubyspec/library/syslog/open_spec.rb:5:in `<top (required)>'
/Users/asari/mspec/lib/mspec/runner/mspec.rb:56:in `load'
/Users/asari/mspec/lib/mspec/runner/mspec.rb:56:in `block (2 levels) in files'
/Users/asari/mspec/lib/mspec/runner/mspec.rb:68:in `instance_eval'
/Users/asari/mspec/lib/mspec/runner/mspec.rb:68:in `protect'
/Users/asari/mspec/lib/mspec/runner/mspec.rb:56:in `block in files'
/Users/asari/mspec/lib/mspec/runner/mspec.rb:50:in `each'
/Users/asari/mspec/lib/mspec/runner/mspec.rb:50:in `files'
/Users/asari/mspec/lib/mspec/runner/mspec.rb:42:in `process'
/Users/asari/mspec/lib/mspec/commands/mspec-run.rb:87:in `run'
/Users/asari/mspec/lib/mspec/utils/script.rb:218:in `main'
/Users/asari/mspec/bin/mspec-run:8:in `<main>'
55)
An exception occurred during: before :each
Syslog.open receives a block and calls it with the module FAILED
Expected true to be false
/Users/asari/mspec/lib/mspec/expectations/expectations.rb:15:in `fail_with'
/Users/asari/mspec/lib/mspec/expectations/should.rb:8:in `should'
/Users/asari/rubyspec/library/syslog/open_spec.rb:9:in `block (3 levels) in <top (required)>'
/Users/asari/mspec/lib/mspec/runner/mspec.rb:68:in `instance_eval'
/Users/asari/mspec/lib/mspec/runner/mspec.rb:68:in `protect'
/Users/asari/mspec/lib/mspec/runner/context.rb:179:in `block in protect'
/Users/asari/mspec/lib/mspec/runner/context.rb:179:in `each'
/Users/asari/mspec/lib/mspec/runner/context.rb:179:in `all?'
/Users/asari/mspec/lib/mspec/runner/context.rb:179:in `protect'
/Users/asari/mspec/lib/mspec/runner/context.rb:204:in `block in process'
/Users/asari/mspec/lib/mspec/runner/context.rb:199:in `each'
/Users/asari/mspec/lib/mspec/runner/context.rb:199:in `process'
/Users/asari/mspec/lib/mspec/runner/mspec.rb:37:in `describe'
/Users/asari/mspec/lib/mspec/runner/object.rb:11:in `describe'
/Users/asari/rubyspec/library/syslog/open_spec.rb:5:in `<top (required)>'
/Users/asari/mspec/lib/mspec/runner/mspec.rb:56:in `load'
/Users/asari/mspec/lib/mspec/runner/mspec.rb:56:in `block (2 levels) in files'
/Users/asari/mspec/lib/mspec/runner/mspec.rb:68:in `instance_eval'
/Users/asari/mspec/lib/mspec/runner/mspec.rb:68:in `protect'
/Users/asari/mspec/lib/mspec/runner/mspec.rb:56:in `block in files'
/Users/asari/mspec/lib/mspec/runner/mspec.rb:50:in `each'
/Users/asari/mspec/lib/mspec/runner/mspec.rb:50:in `files'
/Users/asari/mspec/lib/mspec/runner/mspec.rb:42:in `process'
/Users/asari/mspec/lib/mspec/commands/mspec-run.rb:87:in `run'
/Users/asari/mspec/lib/mspec/utils/script.rb:218:in `main'
/Users/asari/mspec/bin/mspec-run:8:in `<main>'
56)
An exception occurred during: before :each
Syslog.open closes the log if after it receives a block FAILED
Expected true to be false
/Users/asari/mspec/lib/mspec/expectations/expectations.rb:15:in `fail_with'
/Users/asari/mspec/lib/mspec/expectations/should.rb:8:in `should'
/Users/asari/rubyspec/library/syslog/open_spec.rb:9:in `block (3 levels) in <top (required)>'
/Users/asari/mspec/lib/mspec/runner/mspec.rb:68:in `instance_eval'
/Users/asari/mspec/lib/mspec/runner/mspec.rb:68:in `protect'
/Users/asari/mspec/lib/mspec/runner/context.rb:179:in `block in protect'
/Users/asari/mspec/lib/mspec/runner/context.rb:179:in `each'
/Users/asari/mspec/lib/mspec/runner/context.rb:179:in `all?'
/Users/asari/mspec/lib/mspec/runner/context.rb:179:in `protect'
/Users/asari/mspec/lib/mspec/runner/context.rb:204:in `block in process'
/Users/asari/mspec/lib/mspec/runner/context.rb:199:in `each'
/Users/asari/mspec/lib/mspec/runner/context.rb:199:in `process'
/Users/asari/mspec/lib/mspec/runner/mspec.rb:37:in `describe'
/Users/asari/mspec/lib/mspec/runner/object.rb:11:in `describe'
/Users/asari/rubyspec/library/syslog/open_spec.rb:5:in `<top (required)>'
/Users/asari/mspec/lib/mspec/runner/mspec.rb:56:in `load'
/Users/asari/mspec/lib/mspec/runner/mspec.rb:56:in `block (2 levels) in files'
/Users/asari/mspec/lib/mspec/runner/mspec.rb:68:in `instance_eval'
/Users/asari/mspec/lib/mspec/runner/mspec.rb:68:in `protect'
/Users/asari/mspec/lib/mspec/runner/mspec.rb:56:in `block in files'
/Users/asari/mspec/lib/mspec/runner/mspec.rb:50:in `each'
/Users/asari/mspec/lib/mspec/runner/mspec.rb:50:in `files'
/Users/asari/mspec/lib/mspec/runner/mspec.rb:42:in `process'
/Users/asari/mspec/lib/mspec/commands/mspec-run.rb:87:in `run'
/Users/asari/mspec/lib/mspec/utils/script.rb:218:in `main'
/Users/asari/mspec/bin/mspec-run:8:in `<main>'
57)
An exception occurred during: before :each
Syslog.open raises an error if the log is opened FAILED
Expected true to be false
/Users/asari/mspec/lib/mspec/expectations/expectations.rb:15:in `fail_with'
/Users/asari/mspec/lib/mspec/expectations/should.rb:8:in `should'
/Users/asari/rubyspec/library/syslog/open_spec.rb:9:in `block (3 levels) in <top (required)>'
/Users/asari/mspec/lib/mspec/runner/mspec.rb:68:in `instance_eval'
/Users/asari/mspec/lib/mspec/runner/mspec.rb:68:in `protect'
/Users/asari/mspec/lib/mspec/runner/context.rb:179:in `block in protect'
/Users/asari/mspec/lib/mspec/runner/context.rb:179:in `each'
/Users/asari/mspec/lib/mspec/runner/context.rb:179:in `all?'
/Users/asari/mspec/lib/mspec/runner/context.rb:179:in `protect'
/Users/asari/mspec/lib/mspec/runner/context.rb:204:in `block in process'
/Users/asari/mspec/lib/mspec/runner/context.rb:199:in `each'
/Users/asari/mspec/lib/mspec/runner/context.rb:199:in `process'
/Users/asari/mspec/lib/mspec/runner/mspec.rb:37:in `describe'
/Users/asari/mspec/lib/mspec/runner/object.rb:11:in `describe'
/Users/asari/rubyspec/library/syslog/open_spec.rb:5:in `<top (required)>'
/Users/asari/mspec/lib/mspec/runner/mspec.rb:56:in `load'
/Users/asari/mspec/lib/mspec/runner/mspec.rb:56:in `block (2 levels) in files'
/Users/asari/mspec/lib/mspec/runner/mspec.rb:68:in `instance_eval'
/Users/asari/mspec/lib/mspec/runner/mspec.rb:68:in `protect'
/Users/asari/mspec/lib/mspec/runner/mspec.rb:56:in `block in files'
/Users/asari/mspec/lib/mspec/runner/mspec.rb:50:in `each'
/Users/asari/mspec/lib/mspec/runner/mspec.rb:50:in `files'
/Users/asari/mspec/lib/mspec/runner/mspec.rb:42:in `process'
/Users/asari/mspec/lib/mspec/commands/mspec-run.rb:87:in `run'
/Users/asari/mspec/lib/mspec/utils/script.rb:218:in `main'
/Users/asari/mspec/bin/mspec-run:8:in `<main>'
58)
An exception occurred during: before :each
Syslog.open! reopens the log FAILED
Expected true to be false
/Users/asari/mspec/lib/mspec/expectations/expectations.rb:15:in `fail_with'
/Users/asari/mspec/lib/mspec/expectations/should.rb:8:in `should'
/Users/asari/rubyspec/library/syslog/shared/reopen.rb:4:in `block (3 levels) in <top (required)>'
/Users/asari/mspec/lib/mspec/runner/mspec.rb:68:in `instance_eval'
/Users/asari/mspec/lib/mspec/runner/mspec.rb:68:in `protect'
/Users/asari/mspec/lib/mspec/runner/context.rb:179:in `block in protect'
/Users/asari/mspec/lib/mspec/runner/context.rb:179:in `each'
/Users/asari/mspec/lib/mspec/runner/context.rb:179:in `all?'
/Users/asari/mspec/lib/mspec/runner/context.rb:179:in `protect'
/Users/asari/mspec/lib/mspec/runner/context.rb:204:in `block in process'
/Users/asari/mspec/lib/mspec/runner/context.rb:199:in `each'
/Users/asari/mspec/lib/mspec/runner/context.rb:199:in `process'
/Users/asari/mspec/lib/mspec/runner/mspec.rb:37:in `describe'
/Users/asari/mspec/lib/mspec/runner/object.rb:11:in `describe'
/Users/asari/rubyspec/library/syslog/open_spec.rb:82:in `<top (required)>'
/Users/asari/mspec/lib/mspec/runner/mspec.rb:56:in `load'
/Users/asari/mspec/lib/mspec/runner/mspec.rb:56:in `block (2 levels) in files'
/Users/asari/mspec/lib/mspec/runner/mspec.rb:68:in `instance_eval'
/Users/asari/mspec/lib/mspec/runner/mspec.rb:68:in `protect'
/Users/asari/mspec/lib/mspec/runner/mspec.rb:56:in `block in files'
/Users/asari/mspec/lib/mspec/runner/mspec.rb:50:in `each'
/Users/asari/mspec/lib/mspec/runner/mspec.rb:50:in `files'
/Users/asari/mspec/lib/mspec/runner/mspec.rb:42:in `process'
/Users/asari/mspec/lib/mspec/commands/mspec-run.rb:87:in `run'
/Users/asari/mspec/lib/mspec/utils/script.rb:218:in `main'
/Users/asari/mspec/bin/mspec-run:8:in `<main>'
59)
An exception occurred during: before :each
Syslog.open! fails with RuntimeError if the log is closed FAILED
Expected true to be false
/Users/asari/mspec/lib/mspec/expectations/expectations.rb:15:in `fail_with'
/Users/asari/mspec/lib/mspec/expectations/should.rb:8:in `should'
/Users/asari/rubyspec/library/syslog/shared/reopen.rb:4:in `block (3 levels) in <top (required)>'
/Users/asari/mspec/lib/mspec/runner/mspec.rb:68:in `instance_eval'
/Users/asari/mspec/lib/mspec/runner/mspec.rb:68:in `protect'
/Users/asari/mspec/lib/mspec/runner/context.rb:179:in `block in protect'
/Users/asari/mspec/lib/mspec/runner/context.rb:179:in `each'
/Users/asari/mspec/lib/mspec/runner/context.rb:179:in `all?'
/Users/asari/mspec/lib/mspec/runner/context.rb:179:in `protect'
/Users/asari/mspec/lib/mspec/runner/context.rb:204:in `block in process'
/Users/asari/mspec/lib/mspec/runner/context.rb:199:in `each'
/Users/asari/mspec/lib/mspec/runner/context.rb:199:in `process'
/Users/asari/mspec/lib/mspec/runner/mspec.rb:37:in `describe'
/Users/asari/mspec/lib/mspec/runner/object.rb:11:in `describe'
/Users/asari/rubyspec/library/syslog/open_spec.rb:82:in `<top (required)>'
/Users/asari/mspec/lib/mspec/runner/mspec.rb:56:in `load'
/Users/asari/mspec/lib/mspec/runner/mspec.rb:56:in `block (2 levels) in files'
/Users/asari/mspec/lib/mspec/runner/mspec.rb:68:in `instance_eval'
/Users/asari/mspec/lib/mspec/runner/mspec.rb:68:in `protect'
/Users/asari/mspec/lib/mspec/runner/mspec.rb:56:in `block in files'
/Users/asari/mspec/lib/mspec/runner/mspec.rb:50:in `each'
/Users/asari/mspec/lib/mspec/runner/mspec.rb:50:in `files'
/Users/asari/mspec/lib/mspec/runner/mspec.rb:42:in `process'
/Users/asari/mspec/lib/mspec/commands/mspec-run.rb:87:in `run'
/Users/asari/mspec/lib/mspec/utils/script.rb:218:in `main'
/Users/asari/mspec/bin/mspec-run:8:in `<main>'
60)
An exception occurred during: before :each
Syslog.open! receives the same parameters as Syslog.open FAILED
Expected true to be false
/Users/asari/mspec/lib/mspec/expectations/expectations.rb:15:in `fail_with'
/Users/asari/mspec/lib/mspec/expectations/should.rb:8:in `should'
/Users/asari/rubyspec/library/syslog/shared/reopen.rb:4:in `block (3 levels) in <top (required)>'
/Users/asari/mspec/lib/mspec/runner/mspec.rb:68:in `instance_eval'
/Users/asari/mspec/lib/mspec/runner/mspec.rb:68:in `protect'
/Users/asari/mspec/lib/mspec/runner/context.rb:179:in `block in protect'
/Users/asari/mspec/lib/mspec/runner/context.rb:179:in `each'
/Users/asari/mspec/lib/mspec/runner/context.rb:179:in `all?'
/Users/asari/mspec/lib/mspec/runner/context.rb:179:in `protect'
/Users/asari/mspec/lib/mspec/runner/context.rb:204:in `block in process'
/Users/asari/mspec/lib/mspec/runner/context.rb:199:in `each'
/Users/asari/mspec/lib/mspec/runner/context.rb:199:in `process'
/Users/asari/mspec/lib/mspec/runner/mspec.rb:37:in `describe'
/Users/asari/mspec/lib/mspec/runner/object.rb:11:in `describe'
/Users/asari/rubyspec/library/syslog/open_spec.rb:82:in `<top (required)>'
/Users/asari/mspec/lib/mspec/runner/mspec.rb:56:in `load'
/Users/asari/mspec/lib/mspec/runner/mspec.rb:56:in `block (2 levels) in files'
/Users/asari/mspec/lib/mspec/runner/mspec.rb:68:in `instance_eval'
/Users/asari/mspec/lib/mspec/runner/mspec.rb:68:in `protect'
/Users/asari/mspec/lib/mspec/runner/mspec.rb:56:in `block in files'
/Users/asari/mspec/lib/mspec/runner/mspec.rb:50:in `each'
/Users/asari/mspec/lib/mspec/runner/mspec.rb:50:in `files'
/Users/asari/mspec/lib/mspec/runner/mspec.rb:42:in `process'
/Users/asari/mspec/lib/mspec/commands/mspec-run.rb:87:in `run'
/Users/asari/mspec/lib/mspec/utils/script.rb:218:in `main'
/Users/asari/mspec/bin/mspec-run:8:in `<main>'
61)
An exception occurred during: before :each
Syslog.open! returns the module FAILED
Expected true to be false
/Users/asari/mspec/lib/mspec/expectations/expectations.rb:15:in `fail_with'
/Users/asari/mspec/lib/mspec/expectations/should.rb:8:in `should'
/Users/asari/rubyspec/library/syslog/shared/reopen.rb:4:in `block (3 levels) in <top (required)>'
/Users/asari/mspec/lib/mspec/runner/mspec.rb:68:in `instance_eval'
/Users/asari/mspec/lib/mspec/runner/mspec.rb:68:in `protect'
/Users/asari/mspec/lib/mspec/runner/context.rb:179:in `block in protect'
/Users/asari/mspec/lib/mspec/runner/context.rb:179:in `each'
/Users/asari/mspec/lib/mspec/runner/context.rb:179:in `all?'
/Users/asari/mspec/lib/mspec/runner/context.rb:179:in `protect'
/Users/asari/mspec/lib/mspec/runner/context.rb:204:in `block in process'
/Users/asari/mspec/lib/mspec/runner/context.rb:199:in `each'
/Users/asari/mspec/lib/mspec/runner/context.rb:199:in `process'
/Users/asari/mspec/lib/mspec/runner/mspec.rb:37:in `describe'
/Users/asari/mspec/lib/mspec/runner/object.rb:11:in `describe'
/Users/asari/rubyspec/library/syslog/open_spec.rb:82:in `<top (required)>'
/Users/asari/mspec/lib/mspec/runner/mspec.rb:56:in `load'
/Users/asari/mspec/lib/mspec/runner/mspec.rb:56:in `block (2 levels) in files'
/Users/asari/mspec/lib/mspec/runner/mspec.rb:68:in `instance_eval'
/Users/asari/mspec/lib/mspec/runner/mspec.rb:68:in `protect'
/Users/asari/mspec/lib/mspec/runner/mspec.rb:56:in `block in files'
/Users/asari/mspec/lib/mspec/runner/mspec.rb:50:in `each'
/Users/asari/mspec/lib/mspec/runner/mspec.rb:50:in `files'
/Users/asari/mspec/lib/mspec/runner/mspec.rb:42:in `process'
/Users/asari/mspec/lib/mspec/commands/mspec-run.rb:87:in `run'
/Users/asari/mspec/lib/mspec/utils/script.rb:218:in `main'
/Users/asari/mspec/bin/mspec-run:8:in `<main>'
62)
An exception occurred during: before :each
Syslog.opened? returns true if the log is opened FAILED
Expected true to be false
/Users/asari/mspec/lib/mspec/expectations/expectations.rb:15:in `fail_with'
/Users/asari/mspec/lib/mspec/expectations/should.rb:8:in `should'
/Users/asari/rubyspec/library/syslog/opened_spec.rb:8:in `block (3 levels) in <top (required)>'
/Users/asari/mspec/lib/mspec/runner/mspec.rb:68:in `instance_eval'
/Users/asari/mspec/lib/mspec/runner/mspec.rb:68:in `protect'
/Users/asari/mspec/lib/mspec/runner/context.rb:179:in `block in protect'
/Users/asari/mspec/lib/mspec/runner/context.rb:179:in `each'
/Users/asari/mspec/lib/mspec/runner/context.rb:179:in `all?'
/Users/asari/mspec/lib/mspec/runner/context.rb:179:in `protect'
/Users/asari/mspec/lib/mspec/runner/context.rb:204:in `block in process'
/Users/asari/mspec/lib/mspec/runner/context.rb:199:in `each'
/Users/asari/mspec/lib/mspec/runner/context.rb:199:in `process'
/Users/asari/mspec/lib/mspec/runner/mspec.rb:37:in `describe'
/Users/asari/mspec/lib/mspec/runner/object.rb:11:in `describe'
/Users/asari/rubyspec/library/syslog/opened_spec.rb:4:in `<top (required)>'
/Users/asari/mspec/lib/mspec/runner/mspec.rb:56:in `load'
/Users/asari/mspec/lib/mspec/runner/mspec.rb:56:in `block (2 levels) in files'
/Users/asari/mspec/lib/mspec/runner/mspec.rb:68:in `instance_eval'
/Users/asari/mspec/lib/mspec/runner/mspec.rb:68:in `protect'
/Users/asari/mspec/lib/mspec/runner/mspec.rb:56:in `block in files'
/Users/asari/mspec/lib/mspec/runner/mspec.rb:50:in `each'
/Users/asari/mspec/lib/mspec/runner/mspec.rb:50:in `files'
/Users/asari/mspec/lib/mspec/runner/mspec.rb:42:in `process'
/Users/asari/mspec/lib/mspec/commands/mspec-run.rb:87:in `run'
/Users/asari/mspec/lib/mspec/utils/script.rb:218:in `main'
/Users/asari/mspec/bin/mspec-run:8:in `<main>'
63)
An exception occurred during: before :each
Syslog.opened? returns false otherwise FAILED
Expected true to be false
/Users/asari/mspec/lib/mspec/expectations/expectations.rb:15:in `fail_with'
/Users/asari/mspec/lib/mspec/expectations/should.rb:8:in `should'
/Users/asari/rubyspec/library/syslog/opened_spec.rb:8:in `block (3 levels) in <top (required)>'
/Users/asari/mspec/lib/mspec/runner/mspec.rb:68:in `instance_eval'
/Users/asari/mspec/lib/mspec/runner/mspec.rb:68:in `protect'
/Users/asari/mspec/lib/mspec/runner/context.rb:179:in `block in protect'
/Users/asari/mspec/lib/mspec/runner/context.rb:179:in `each'
/Users/asari/mspec/lib/mspec/runner/context.rb:179:in `all?'
/Users/asari/mspec/lib/mspec/runner/context.rb:179:in `protect'
/Users/asari/mspec/lib/mspec/runner/context.rb:204:in `block in process'
/Users/asari/mspec/lib/mspec/runner/context.rb:199:in `each'
/Users/asari/mspec/lib/mspec/runner/context.rb:199:in `process'
/Users/asari/mspec/lib/mspec/runner/mspec.rb:37:in `describe'
/Users/asari/mspec/lib/mspec/runner/object.rb:11:in `describe'
/Users/asari/rubyspec/library/syslog/opened_spec.rb:4:in `<top (required)>'
/Users/asari/mspec/lib/mspec/runner/mspec.rb:56:in `load'
/Users/asari/mspec/lib/mspec/runner/mspec.rb:56:in `block (2 levels) in files'
/Users/asari/mspec/lib/mspec/runner/mspec.rb:68:in `instance_eval'
/Users/asari/mspec/lib/mspec/runner/mspec.rb:68:in `protect'
/Users/asari/mspec/lib/mspec/runner/mspec.rb:56:in `block in files'
/Users/asari/mspec/lib/mspec/runner/mspec.rb:50:in `each'
/Users/asari/mspec/lib/mspec/runner/mspec.rb:50:in `files'
/Users/asari/mspec/lib/mspec/runner/mspec.rb:42:in `process'
/Users/asari/mspec/lib/mspec/commands/mspec-run.rb:87:in `run'
/Users/asari/mspec/lib/mspec/utils/script.rb:218:in `main'
/Users/asari/mspec/bin/mspec-run:8:in `<main>'
64)
An exception occurred during: before :each
Syslog.opened? works inside a block FAILED
Expected true to be false
/Users/asari/mspec/lib/mspec/expectations/expectations.rb:15:in `fail_with'
/Users/asari/mspec/lib/mspec/expectations/should.rb:8:in `should'
/Users/asari/rubyspec/library/syslog/opened_spec.rb:8:in `block (3 levels) in <top (required)>'
/Users/asari/mspec/lib/mspec/runner/mspec.rb:68:in `instance_eval'
/Users/asari/mspec/lib/mspec/runner/mspec.rb:68:in `protect'
/Users/asari/mspec/lib/mspec/runner/context.rb:179:in `block in protect'
/Users/asari/mspec/lib/mspec/runner/context.rb:179:in `each'
/Users/asari/mspec/lib/mspec/runner/context.rb:179:in `all?'
/Users/asari/mspec/lib/mspec/runner/context.rb:179:in `protect'
/Users/asari/mspec/lib/mspec/runner/context.rb:204:in `block in process'
/Users/asari/mspec/lib/mspec/runner/context.rb:199:in `each'
/Users/asari/mspec/lib/mspec/runner/context.rb:199:in `process'
/Users/asari/mspec/lib/mspec/runner/mspec.rb:37:in `describe'
/Users/asari/mspec/lib/mspec/runner/object.rb:11:in `describe'
/Users/asari/rubyspec/library/syslog/opened_spec.rb:4:in `<top (required)>'
/Users/asari/mspec/lib/mspec/runner/mspec.rb:56:in `load'
/Users/asari/mspec/lib/mspec/runner/mspec.rb:56:in `block (2 levels) in files'
/Users/asari/mspec/lib/mspec/runner/mspec.rb:68:in `instance_eval'
/Users/asari/mspec/lib/mspec/runner/mspec.rb:68:in `protect'
/Users/asari/mspec/lib/mspec/runner/mspec.rb:56:in `block in files'
/Users/asari/mspec/lib/mspec/runner/mspec.rb:50:in `each'
/Users/asari/mspec/lib/mspec/runner/mspec.rb:50:in `files'
/Users/asari/mspec/lib/mspec/runner/mspec.rb:42:in `process'
/Users/asari/mspec/lib/mspec/commands/mspec-run.rb:87:in `run'
/Users/asari/mspec/lib/mspec/utils/script.rb:218:in `main'
/Users/asari/mspec/bin/mspec-run:8:in `<main>'
65)
An exception occurred during: before :each
Syslog.options returns the logging options FAILED
Expected true to be false
/Users/asari/mspec/lib/mspec/expectations/expectations.rb:15:in `fail_with'
/Users/asari/mspec/lib/mspec/expectations/should.rb:8:in `should'
/Users/asari/rubyspec/library/syslog/options_spec.rb:8:in `block (3 levels) in <top (required)>'
/Users/asari/mspec/lib/mspec/runner/mspec.rb:68:in `instance_eval'
/Users/asari/mspec/lib/mspec/runner/mspec.rb:68:in `protect'
/Users/asari/mspec/lib/mspec/runner/context.rb:179:in `block in protect'
/Users/asari/mspec/lib/mspec/runner/context.rb:179:in `each'
/Users/asari/mspec/lib/mspec/runner/context.rb:179:in `all?'
/Users/asari/mspec/lib/mspec/runner/context.rb:179:in `protect'
/Users/asari/mspec/lib/mspec/runner/context.rb:204:in `block in process'
/Users/asari/mspec/lib/mspec/runner/context.rb:199:in `each'
/Users/asari/mspec/lib/mspec/runner/context.rb:199:in `process'
/Users/asari/mspec/lib/mspec/runner/mspec.rb:37:in `describe'
/Users/asari/mspec/lib/mspec/runner/object.rb:11:in `describe'
/Users/asari/rubyspec/library/syslog/options_spec.rb:4:in `<top (required)>'
/Users/asari/mspec/lib/mspec/runner/mspec.rb:56:in `load'
/Users/asari/mspec/lib/mspec/runner/mspec.rb:56:in `block (2 levels) in files'
/Users/asari/mspec/lib/mspec/runner/mspec.rb:68:in `instance_eval'
/Users/asari/mspec/lib/mspec/runner/mspec.rb:68:in `protect'
/Users/asari/mspec/lib/mspec/runner/mspec.rb:56:in `block in files'
/Users/asari/mspec/lib/mspec/runner/mspec.rb:50:in `each'
/Users/asari/mspec/lib/mspec/runner/mspec.rb:50:in `files'
/Users/asari/mspec/lib/mspec/runner/mspec.rb:42:in `process'
/Users/asari/mspec/lib/mspec/commands/mspec-run.rb:87:in `run'
/Users/asari/mspec/lib/mspec/utils/script.rb:218:in `main'
/Users/asari/mspec/bin/mspec-run:8:in `<main>'
66)
An exception occurred during: before :each
Syslog.options returns nil when the log is closed FAILED
Expected true to be false
/Users/asari/mspec/lib/mspec/expectations/expectations.rb:15:in `fail_with'
/Users/asari/mspec/lib/mspec/expectations/should.rb:8:in `should'
/Users/asari/rubyspec/library/syslog/options_spec.rb:8:in `block (3 levels) in <top (required)>'
/Users/asari/mspec/lib/mspec/runner/mspec.rb:68:in `instance_eval'
/Users/asari/mspec/lib/mspec/runner/mspec.rb:68:in `protect'
/Users/asari/mspec/lib/mspec/runner/context.rb:179:in `block in protect'
/Users/asari/mspec/lib/mspec/runner/context.rb:179:in `each'
/Users/asari/mspec/lib/mspec/runner/context.rb:179:in `all?'
/Users/asari/mspec/lib/mspec/runner/context.rb:179:in `protect'
/Users/asari/mspec/lib/mspec/runner/context.rb:204:in `block in process'
/Users/asari/mspec/lib/mspec/runner/context.rb:199:in `each'
/Users/asari/mspec/lib/mspec/runner/context.rb:199:in `process'
/Users/asari/mspec/lib/mspec/runner/mspec.rb:37:in `describe'
/Users/asari/mspec/lib/mspec/runner/object.rb:11:in `describe'
/Users/asari/rubyspec/library/syslog/options_spec.rb:4:in `<top (required)>'
/Users/asari/mspec/lib/mspec/runner/mspec.rb:56:in `load'
/Users/asari/mspec/lib/mspec/runner/mspec.rb:56:in `block (2 levels) in files'
/Users/asari/mspec/lib/mspec/runner/mspec.rb:68:in `instance_eval'
/Users/asari/mspec/lib/mspec/runner/mspec.rb:68:in `protect'
/Users/asari/mspec/lib/mspec/runner/mspec.rb:56:in `block in files'
/Users/asari/mspec/lib/mspec/runner/mspec.rb:50:in `each'
/Users/asari/mspec/lib/mspec/runner/mspec.rb:50:in `files'
/Users/asari/mspec/lib/mspec/runner/mspec.rb:42:in `process'
/Users/asari/mspec/lib/mspec/commands/mspec-run.rb:87:in `run'
/Users/asari/mspec/lib/mspec/utils/script.rb:218:in `main'
/Users/asari/mspec/bin/mspec-run:8:in `<main>'
67)
An exception occurred during: before :each
Syslog.options defaults to LOG_PID | LOG_CONS FAILED
Expected true to be false
/Users/asari/mspec/lib/mspec/expectations/expectations.rb:15:in `fail_with'
/Users/asari/mspec/lib/mspec/expectations/should.rb:8:in `should'
/Users/asari/rubyspec/library/syslog/options_spec.rb:8:in `block (3 levels) in <top (required)>'
/Users/asari/mspec/lib/mspec/runner/mspec.rb:68:in `instance_eval'
/Users/asari/mspec/lib/mspec/runner/mspec.rb:68:in `protect'
/Users/asari/mspec/lib/mspec/runner/context.rb:179:in `block in protect'
/Users/asari/mspec/lib/mspec/runner/context.rb:179:in `each'
/Users/asari/mspec/lib/mspec/runner/context.rb:179:in `all?'
/Users/asari/mspec/lib/mspec/runner/context.rb:179:in `protect'
/Users/asari/mspec/lib/mspec/runner/context.rb:204:in `block in process'
/Users/asari/mspec/lib/mspec/runner/context.rb:199:in `each'
/Users/asari/mspec/lib/mspec/runner/context.rb:199:in `process'
/Users/asari/mspec/lib/mspec/runner/mspec.rb:37:in `describe'
/Users/asari/mspec/lib/mspec/runner/object.rb:11:in `describe'
/Users/asari/rubyspec/library/syslog/options_spec.rb:4:in `<top (required)>'
/Users/asari/mspec/lib/mspec/runner/mspec.rb:56:in `load'
/Users/asari/mspec/lib/mspec/runner/mspec.rb:56:in `block (2 levels) in files'
/Users/asari/mspec/lib/mspec/runner/mspec.rb:68:in `instance_eval'
/Users/asari/mspec/lib/mspec/runner/mspec.rb:68:in `protect'
/Users/asari/mspec/lib/mspec/runner/mspec.rb:56:in `block in files'
/Users/asari/mspec/lib/mspec/runner/mspec.rb:50:in `each'
/Users/asari/mspec/lib/mspec/runner/mspec.rb:50:in `files'
/Users/asari/mspec/lib/mspec/runner/mspec.rb:42:in `process'
/Users/asari/mspec/lib/mspec/commands/mspec-run.rb:87:in `run'
/Users/asari/mspec/lib/mspec/utils/script.rb:218:in `main'
/Users/asari/mspec/bin/mspec-run:8:in `<main>'
68)
An exception occurred during: before :each
Syslog.options resets after each open call FAILED
Expected true to be false
/Users/asari/mspec/lib/mspec/expectations/expectations.rb:15:in `fail_with'
/Users/asari/mspec/lib/mspec/expectations/should.rb:8:in `should'
/Users/asari/rubyspec/library/syslog/options_spec.rb:8:in `block (3 levels) in <top (required)>'
/Users/asari/mspec/lib/mspec/runner/mspec.rb:68:in `instance_eval'
/Users/asari/mspec/lib/mspec/runner/mspec.rb:68:in `protect'
/Users/asari/mspec/lib/mspec/runner/context.rb:179:in `block in protect'
/Users/asari/mspec/lib/mspec/runner/context.rb:179:in `each'
/Users/asari/mspec/lib/mspec/runner/context.rb:179:in `all?'
/Users/asari/mspec/lib/mspec/runner/context.rb:179:in `protect'
/Users/asari/mspec/lib/mspec/runner/context.rb:204:in `block in process'
/Users/asari/mspec/lib/mspec/runner/context.rb:199:in `each'
/Users/asari/mspec/lib/mspec/runner/context.rb:199:in `process'
/Users/asari/mspec/lib/mspec/runner/mspec.rb:37:in `describe'
/Users/asari/mspec/lib/mspec/runner/object.rb:11:in `describe'
/Users/asari/rubyspec/library/syslog/options_spec.rb:4:in `<top (required)>'
/Users/asari/mspec/lib/mspec/runner/mspec.rb:56:in `load'
/Users/asari/mspec/lib/mspec/runner/mspec.rb:56:in `block (2 levels) in files'
/Users/asari/mspec/lib/mspec/runner/mspec.rb:68:in `instance_eval'
/Users/asari/mspec/lib/mspec/runner/mspec.rb:68:in `protect'
/Users/asari/mspec/lib/mspec/runner/mspec.rb:56:in `block in files'
/Users/asari/mspec/lib/mspec/runner/mspec.rb:50:in `each'
/Users/asari/mspec/lib/mspec/runner/mspec.rb:50:in `files'
/Users/asari/mspec/lib/mspec/runner/mspec.rb:42:in `process'
/Users/asari/mspec/lib/mspec/commands/mspec-run.rb:87:in `run'
/Users/asari/mspec/lib/mspec/utils/script.rb:218:in `main'
/Users/asari/mspec/bin/mspec-run:8:in `<main>'
69)
An exception occurred during: before :each
Syslog.reopen reopens the log FAILED
Expected true to be false
/Users/asari/mspec/lib/mspec/expectations/expectations.rb:15:in `fail_with'
/Users/asari/mspec/lib/mspec/expectations/should.rb:8:in `should'
/Users/asari/rubyspec/library/syslog/shared/reopen.rb:4:in `block (3 levels) in <top (required)>'
/Users/asari/mspec/lib/mspec/runner/mspec.rb:68:in `instance_eval'
/Users/asari/mspec/lib/mspec/runner/mspec.rb:68:in `protect'
/Users/asari/mspec/lib/mspec/runner/context.rb:179:in `block in protect'
/Users/asari/mspec/lib/mspec/runner/context.rb:179:in `each'
/Users/asari/mspec/lib/mspec/runner/context.rb:179:in `all?'
/Users/asari/mspec/lib/mspec/runner/context.rb:179:in `protect'
/Users/asari/mspec/lib/mspec/runner/context.rb:204:in `block in process'
/Users/asari/mspec/lib/mspec/runner/context.rb:199:in `each'
/Users/asari/mspec/lib/mspec/runner/context.rb:199:in `process'
/Users/asari/mspec/lib/mspec/runner/mspec.rb:37:in `describe'
/Users/asari/mspec/lib/mspec/runner/object.rb:11:in `describe'
/Users/asari/rubyspec/library/syslog/reopen_spec.rb:5:in `<top (required)>'
/Users/asari/mspec/lib/mspec/runner/mspec.rb:56:in `load'
/Users/asari/mspec/lib/mspec/runner/mspec.rb:56:in `block (2 levels) in files'
/Users/asari/mspec/lib/mspec/runner/mspec.rb:68:in `instance_eval'
/Users/asari/mspec/lib/mspec/runner/mspec.rb:68:in `protect'
/Users/asari/mspec/lib/mspec/runner/mspec.rb:56:in `block in files'
/Users/asari/mspec/lib/mspec/runner/mspec.rb:50:in `each'
/Users/asari/mspec/lib/mspec/runner/mspec.rb:50:in `files'
/Users/asari/mspec/lib/mspec/runner/mspec.rb:42:in `process'
/Users/asari/mspec/lib/mspec/commands/mspec-run.rb:87:in `run'
/Users/asari/mspec/lib/mspec/utils/script.rb:218:in `main'
/Users/asari/mspec/bin/mspec-run:8:in `<main>'
70)
An exception occurred during: before :each
Syslog.reopen fails with RuntimeError if the log is closed FAILED
Expected true to be false
/Users/asari/mspec/lib/mspec/expectations/expectations.rb:15:in `fail_with'
/Users/asari/mspec/lib/mspec/expectations/should.rb:8:in `should'
/Users/asari/rubyspec/library/syslog/shared/reopen.rb:4:in `block (3 levels) in <top (required)>'
/Users/asari/mspec/lib/mspec/runner/mspec.rb:68:in `instance_eval'
/Users/asari/mspec/lib/mspec/runner/mspec.rb:68:in `protect'
/Users/asari/mspec/lib/mspec/runner/context.rb:179:in `block in protect'
/Users/asari/mspec/lib/mspec/runner/context.rb:179:in `each'
/Users/asari/mspec/lib/mspec/runner/context.rb:179:in `all?'
/Users/asari/mspec/lib/mspec/runner/context.rb:179:in `protect'
/Users/asari/mspec/lib/mspec/runner/context.rb:204:in `block in process'
/Users/asari/mspec/lib/mspec/runner/context.rb:199:in `each'
/Users/asari/mspec/lib/mspec/runner/context.rb:199:in `process'
/Users/asari/mspec/lib/mspec/runner/mspec.rb:37:in `describe'
/Users/asari/mspec/lib/mspec/runner/object.rb:11:in `describe'
/Users/asari/rubyspec/library/syslog/reopen_spec.rb:5:in `<top (required)>'
/Users/asari/mspec/lib/mspec/runner/mspec.rb:56:in `load'
/Users/asari/mspec/lib/mspec/runner/mspec.rb:56:in `block (2 levels) in files'
/Users/asari/mspec/lib/mspec/runner/mspec.rb:68:in `instance_eval'
/Users/asari/mspec/lib/mspec/runner/mspec.rb:68:in `protect'
/Users/asari/mspec/lib/mspec/runner/mspec.rb:56:in `block in files'
/Users/asari/mspec/lib/mspec/runner/mspec.rb:50:in `each'
/Users/asari/mspec/lib/mspec/runner/mspec.rb:50:in `files'
/Users/asari/mspec/lib/mspec/runner/mspec.rb:42:in `process'
/Users/asari/mspec/lib/mspec/commands/mspec-run.rb:87:in `run'
/Users/asari/mspec/lib/mspec/utils/script.rb:218:in `main'
/Users/asari/mspec/bin/mspec-run:8:in `<main>'
71)
An exception occurred during: before :each
Syslog.reopen receives the same parameters as Syslog.open FAILED
Expected true to be false
/Users/asari/mspec/lib/mspec/expectations/expectations.rb:15:in `fail_with'
/Users/asari/mspec/lib/mspec/expectations/should.rb:8:in `should'
/Users/asari/rubyspec/library/syslog/shared/reopen.rb:4:in `block (3 levels) in <top (required)>'
/Users/asari/mspec/lib/mspec/runner/mspec.rb:68:in `instance_eval'
/Users/asari/mspec/lib/mspec/runner/mspec.rb:68:in `protect'
/Users/asari/mspec/lib/mspec/runner/context.rb:179:in `block in protect'
/Users/asari/mspec/lib/mspec/runner/context.rb:179:in `each'
/Users/asari/mspec/lib/mspec/runner/context.rb:179:in `all?'
/Users/asari/mspec/lib/mspec/runner/context.rb:179:in `protect'
/Users/asari/mspec/lib/mspec/runner/context.rb:204:in `block in process'
/Users/asari/mspec/lib/mspec/runner/context.rb:199:in `each'
/Users/asari/mspec/lib/mspec/runner/context.rb:199:in `process'
/Users/asari/mspec/lib/mspec/runner/mspec.rb:37:in `describe'
/Users/asari/mspec/lib/mspec/runner/object.rb:11:in `describe'
/Users/asari/rubyspec/library/syslog/reopen_spec.rb:5:in `<top (required)>'
/Users/asari/mspec/lib/mspec/runner/mspec.rb:56:in `load'
/Users/asari/mspec/lib/mspec/runner/mspec.rb:56:in `block (2 levels) in files'
/Users/asari/mspec/lib/mspec/runner/mspec.rb:68:in `instance_eval'
/Users/asari/mspec/lib/mspec/runner/mspec.rb:68:in `protect'
/Users/asari/mspec/lib/mspec/runner/mspec.rb:56:in `block in files'
/Users/asari/mspec/lib/mspec/runner/mspec.rb:50:in `each'
/Users/asari/mspec/lib/mspec/runner/mspec.rb:50:in `files'
/Users/asari/mspec/lib/mspec/runner/mspec.rb:42:in `process'
/Users/asari/mspec/lib/mspec/commands/mspec-run.rb:87:in `run'
/Users/asari/mspec/lib/mspec/utils/script.rb:218:in `main'
/Users/asari/mspec/bin/mspec-run:8:in `<main>'
72)
An exception occurred during: before :each
Syslog.reopen returns the module FAILED
Expected true to be false
/Users/asari/mspec/lib/mspec/expectations/expectations.rb:15:in `fail_with'
/Users/asari/mspec/lib/mspec/expectations/should.rb:8:in `should'
/Users/asari/rubyspec/library/syslog/shared/reopen.rb:4:in `block (3 levels) in <top (required)>'
/Users/asari/mspec/lib/mspec/runner/mspec.rb:68:in `instance_eval'
/Users/asari/mspec/lib/mspec/runner/mspec.rb:68:in `protect'
/Users/asari/mspec/lib/mspec/runner/context.rb:179:in `block in protect'
/Users/asari/mspec/lib/mspec/runner/context.rb:179:in `each'
/Users/asari/mspec/lib/mspec/runner/context.rb:179:in `all?'
/Users/asari/mspec/lib/mspec/runner/context.rb:179:in `protect'
/Users/asari/mspec/lib/mspec/runner/context.rb:204:in `block in process'
/Users/asari/mspec/lib/mspec/runner/context.rb:199:in `each'
/Users/asari/mspec/lib/mspec/runner/context.rb:199:in `process'
/Users/asari/mspec/lib/mspec/runner/mspec.rb:37:in `describe'
/Users/asari/mspec/lib/mspec/runner/object.rb:11:in `describe'
/Users/asari/rubyspec/library/syslog/reopen_spec.rb:5:in `<top (required)>'
/Users/asari/mspec/lib/mspec/runner/mspec.rb:56:in `load'
/Users/asari/mspec/lib/mspec/runner/mspec.rb:56:in `block (2 levels) in files'
/Users/asari/mspec/lib/mspec/runner/mspec.rb:68:in `instance_eval'
/Users/asari/mspec/lib/mspec/runner/mspec.rb:68:in `protect'
/Users/asari/mspec/lib/mspec/runner/mspec.rb:56:in `block in files'
/Users/asari/mspec/lib/mspec/runner/mspec.rb:50:in `each'
/Users/asari/mspec/lib/mspec/runner/mspec.rb:50:in `files'
/Users/asari/mspec/lib/mspec/runner/mspec.rb:42:in `process'
/Users/asari/mspec/lib/mspec/commands/mspec-run.rb:87:in `run'
/Users/asari/mspec/lib/mspec/utils/script.rb:218:in `main'
/Users/asari/mspec/bin/mspec-run:8:in `<main>'
73)
An exception occurred during: before :each
Syslog.warning logs a message FAILED
Expected true to be false
/Users/asari/mspec/lib/mspec/expectations/expectations.rb:15:in `fail_with'
/Users/asari/mspec/lib/mspec/expectations/should.rb:8:in `should'
/Users/asari/rubyspec/library/syslog/shared/log.rb:4:in `block (3 levels) in <top (required)>'
/Users/asari/mspec/lib/mspec/runner/mspec.rb:68:in `instance_eval'
/Users/asari/mspec/lib/mspec/runner/mspec.rb:68:in `protect'
/Users/asari/mspec/lib/mspec/runner/context.rb:179:in `block in protect'
/Users/asari/mspec/lib/mspec/runner/context.rb:179:in `each'
/Users/asari/mspec/lib/mspec/runner/context.rb:179:in `all?'
/Users/asari/mspec/lib/mspec/runner/context.rb:179:in `protect'
/Users/asari/mspec/lib/mspec/runner/context.rb:204:in `block in process'
/Users/asari/mspec/lib/mspec/runner/context.rb:199:in `each'
/Users/asari/mspec/lib/mspec/runner/context.rb:199:in `process'
/Users/asari/mspec/lib/mspec/runner/mspec.rb:37:in `describe'
/Users/asari/mspec/lib/mspec/runner/object.rb:11:in `describe'
/Users/asari/rubyspec/library/syslog/warning_spec.rb:5:in `<top (required)>'
/Users/asari/mspec/lib/mspec/runner/mspec.rb:56:in `load'
/Users/asari/mspec/lib/mspec/runner/mspec.rb:56:in `block (2 levels) in files'
/Users/asari/mspec/lib/mspec/runner/mspec.rb:68:in `instance_eval'
/Users/asari/mspec/lib/mspec/runner/mspec.rb:68:in `protect'
/Users/asari/mspec/lib/mspec/runner/mspec.rb:56:in `block in files'
/Users/asari/mspec/lib/mspec/runner/mspec.rb:50:in `each'
/Users/asari/mspec/lib/mspec/runner/mspec.rb:50:in `files'
/Users/asari/mspec/lib/mspec/runner/mspec.rb:42:in `process'
/Users/asari/mspec/lib/mspec/commands/mspec-run.rb:87:in `run'
/Users/asari/mspec/lib/mspec/utils/script.rb:218:in `main'
/Users/asari/mspec/bin/mspec-run:8:in `<main>'
74)
An exception occurred during: before :each
Syslog.warning accepts sprintf arguments FAILED
Expected true to be false
/Users/asari/mspec/lib/mspec/expectations/expectations.rb:15:in `fail_with'
/Users/asari/mspec/lib/mspec/expectations/should.rb:8:in `should'
/Users/asari/rubyspec/library/syslog/shared/log.rb:4:in `block (3 levels) in <top (required)>'
/Users/asari/mspec/lib/mspec/runner/mspec.rb:68:in `instance_eval'
/Users/asari/mspec/lib/mspec/runner/mspec.rb:68:in `protect'
/Users/asari/mspec/lib/mspec/runner/context.rb:179:in `block in protect'
/Users/asari/mspec/lib/mspec/runner/context.rb:179:in `each'
/Users/asari/mspec/lib/mspec/runner/context.rb:179:in `all?'
/Users/asari/mspec/lib/mspec/runner/context.rb:179:in `protect'
/Users/asari/mspec/lib/mspec/runner/context.rb:204:in `block in process'
/Users/asari/mspec/lib/mspec/runner/context.rb:199:in `each'
/Users/asari/mspec/lib/mspec/runner/context.rb:199:in `process'
/Users/asari/mspec/lib/mspec/runner/mspec.rb:37:in `describe'
/Users/asari/mspec/lib/mspec/runner/object.rb:11:in `describe'
/Users/asari/rubyspec/library/syslog/warning_spec.rb:5:in `<top (required)>'
/Users/asari/mspec/lib/mspec/runner/mspec.rb:56:in `load'
/Users/asari/mspec/lib/mspec/runner/mspec.rb:56:in `block (2 levels) in files'
/Users/asari/mspec/lib/mspec/runner/mspec.rb:68:in `instance_eval'
/Users/asari/mspec/lib/mspec/runner/mspec.rb:68:in `protect'
/Users/asari/mspec/lib/mspec/runner/mspec.rb:56:in `block in files'
/Users/asari/mspec/lib/mspec/runner/mspec.rb:50:in `each'
/Users/asari/mspec/lib/mspec/runner/mspec.rb:50:in `files'
/Users/asari/mspec/lib/mspec/runner/mspec.rb:42:in `process'
/Users/asari/mspec/lib/mspec/commands/mspec-run.rb:87:in `run'
/Users/asari/mspec/lib/mspec/utils/script.rb:218:in `main'
/Users/asari/mspec/bin/mspec-run:8:in `<main>'
75)
An exception occurred during: before :each
Syslog.warning works as an alias for Syslog.log FAILED
Expected true to be false
/Users/asari/mspec/lib/mspec/expectations/expectations.rb:15:in `fail_with'
/Users/asari/mspec/lib/mspec/expectations/should.rb:8:in `should'
/Users/asari/rubyspec/library/syslog/shared/log.rb:4:in `block (3 levels) in <top (required)>'
/Users/asari/mspec/lib/mspec/runner/mspec.rb:68:in `instance_eval'
/Users/asari/mspec/lib/mspec/runner/mspec.rb:68:in `protect'
/Users/asari/mspec/lib/mspec/runner/context.rb:179:in `block in protect'
/Users/asari/mspec/lib/mspec/runner/context.rb:179:in `each'
/Users/asari/mspec/lib/mspec/runner/context.rb:179:in `all?'
/Users/asari/mspec/lib/mspec/runner/context.rb:179:in `protect'
/Users/asari/mspec/lib/mspec/runner/context.rb:204:in `block in process'
/Users/asari/mspec/lib/mspec/runner/context.rb:199:in `each'
/Users/asari/mspec/lib/mspec/runner/context.rb:199:in `process'
/Users/asari/mspec/lib/mspec/runner/mspec.rb:37:in `describe'
/Users/asari/mspec/lib/mspec/runner/object.rb:11:in `describe'
/Users/asari/rubyspec/library/syslog/warning_spec.rb:5:in `<top (required)>'
/Users/asari/mspec/lib/mspec/runner/mspec.rb:56:in `load'
/Users/asari/mspec/lib/mspec/runner/mspec.rb:56:in `block (2 levels) in files'
/Users/asari/mspec/lib/mspec/runner/mspec.rb:68:in `instance_eval'
/Users/asari/mspec/lib/mspec/runner/mspec.rb:68:in `protect'
/Users/asari/mspec/lib/mspec/runner/mspec.rb:56:in `block in files'
/Users/asari/mspec/lib/mspec/runner/mspec.rb:50:in `each'
/Users/asari/mspec/lib/mspec/runner/mspec.rb:50:in `files'
/Users/asari/mspec/lib/mspec/runner/mspec.rb:42:in `process'
/Users/asari/mspec/lib/mspec/commands/mspec-run.rb:87:in `run'
/Users/asari/mspec/lib/mspec/utils/script.rb:218:in `main'
/Users/asari/mspec/bin/mspec-run:8:in `<main>'
76)
C-API Class function rb_path2class raises an ArgumentError even if a constant in the path exists on toplevel FAILED
Expected ArgumentError
but got NameError (uninitialized constant CApiClassSpecs::Object)
/Users/asari/mspec/lib/mspec/expectations/expectations.rb:15:in `fail_with'
/Users/asari/mspec/lib/mspec/expectations/should.rb:8:in `should'
/Users/asari/rubyspec/optional/capi/class_spec.rb:25:in `block (3 levels) in <top (required)>'
/Users/asari/mspec/lib/mspec/runner/mspec.rb:68:in `instance_eval'
/Users/asari/mspec/lib/mspec/runner/mspec.rb:68:in `protect'
/Users/asari/mspec/lib/mspec/runner/context.rb:179:in `block in protect'
/Users/asari/mspec/lib/mspec/runner/context.rb:179:in `each'
/Users/asari/mspec/lib/mspec/runner/context.rb:179:in `all?'
/Users/asari/mspec/lib/mspec/runner/context.rb:179:in `protect'
/Users/asari/mspec/lib/mspec/runner/context.rb:207:in `block in process'
/Users/asari/mspec/lib/mspec/runner/context.rb:199:in `each'
/Users/asari/mspec/lib/mspec/runner/context.rb:199:in `process'
/Users/asari/mspec/lib/mspec/runner/context.rb:228:in `block in process'
/Users/asari/mspec/lib/mspec/runner/context.rb:228:in `each'
/Users/asari/mspec/lib/mspec/runner/context.rb:228:in `process'
/Users/asari/mspec/lib/mspec/runner/mspec.rb:37:in `describe'
/Users/asari/mspec/lib/mspec/runner/object.rb:11:in `describe'
/Users/asari/rubyspec/optional/capi/class_spec.rb:30:in `<top (required)>'
/Users/asari/mspec/lib/mspec/runner/mspec.rb:56:in `load'
/Users/asari/mspec/lib/mspec/runner/mspec.rb:56:in `block (2 levels) in files'
/Users/asari/mspec/lib/mspec/runner/mspec.rb:68:in `instance_eval'
/Users/asari/mspec/lib/mspec/runner/mspec.rb:68:in `protect'
/Users/asari/mspec/lib/mspec/runner/mspec.rb:56:in `block in files'
/Users/asari/mspec/lib/mspec/runner/mspec.rb:50:in `each'
/Users/asari/mspec/lib/mspec/runner/mspec.rb:50:in `files'
/Users/asari/mspec/lib/mspec/runner/mspec.rb:42:in `process'
/Users/asari/mspec/lib/mspec/commands/mspec-run.rb:87:in `run'
/Users/asari/mspec/lib/mspec/utils/script.rb:218:in `main'
/Users/asari/mspec/bin/mspec-run:8:in `<main>'
77)
C-API Class function rb_path_to_class raises an ArgumentError even if a constant in the path exists on toplevel FAILED
Expected ArgumentError
but got NameError (uninitialized constant CApiClassSpecs::Object)
/Users/asari/mspec/lib/mspec/expectations/expectations.rb:15:in `fail_with'
/Users/asari/mspec/lib/mspec/expectations/should.rb:8:in `should'
/Users/asari/rubyspec/optional/capi/class_spec.rb:25:in `block (3 levels) in <top (required)>'
/Users/asari/mspec/lib/mspec/runner/mspec.rb:68:in `instance_eval'
/Users/asari/mspec/lib/mspec/runner/mspec.rb:68:in `protect'
/Users/asari/mspec/lib/mspec/runner/context.rb:179:in `block in protect'
/Users/asari/mspec/lib/mspec/runner/context.rb:179:in `each'
/Users/asari/mspec/lib/mspec/runner/context.rb:179:in `all?'
/Users/asari/mspec/lib/mspec/runner/context.rb:179:in `protect'
/Users/asari/mspec/lib/mspec/runner/context.rb:207:in `block in process'
/Users/asari/mspec/lib/mspec/runner/context.rb:199:in `each'
/Users/asari/mspec/lib/mspec/runner/context.rb:199:in `process'
/Users/asari/mspec/lib/mspec/runner/context.rb:228:in `block in process'
/Users/asari/mspec/lib/mspec/runner/context.rb:228:in `each'
/Users/asari/mspec/lib/mspec/runner/context.rb:228:in `process'
/Users/asari/mspec/lib/mspec/runner/mspec.rb:37:in `describe'
/Users/asari/mspec/lib/mspec/runner/object.rb:11:in `describe'
/Users/asari/rubyspec/optional/capi/class_spec.rb:30:in `<top (required)>'
/Users/asari/mspec/lib/mspec/runner/mspec.rb:56:in `load'
/Users/asari/mspec/lib/mspec/runner/mspec.rb:56:in `block (2 levels) in files'
/Users/asari/mspec/lib/mspec/runner/mspec.rb:68:in `instance_eval'
/Users/asari/mspec/lib/mspec/runner/mspec.rb:68:in `protect'
/Users/asari/mspec/lib/mspec/runner/mspec.rb:56:in `block in files'
/Users/asari/mspec/lib/mspec/runner/mspec.rb:50:in `each'
/Users/asari/mspec/lib/mspec/runner/mspec.rb:50:in `files'
/Users/asari/mspec/lib/mspec/runner/mspec.rb:42:in `process'
/Users/asari/mspec/lib/mspec/commands/mspec-run.rb:87:in `run'
/Users/asari/mspec/lib/mspec/utils/script.rb:218:in `main'
/Users/asari/mspec/bin/mspec-run:8:in `<main>'
78)
An exception occurred during: loading /Users/asari/rubyspec/optional/ffi/buffer_spec.rb ERROR
RuntimeError: Failed to compile Ruby-FFI fixtures
/Users/asari/rubyspec/optional/ffi/spec_helper.rb:26:in `block in <module:FFISpecs>'
/Users/asari/rubyspec/optional/ffi/spec_helper.rb:24:in `chdir'
/Users/asari/rubyspec/optional/ffi/spec_helper.rb:24:in `<module:FFISpecs>'
/Users/asari/rubyspec/optional/ffi/spec_helper.rb:10:in `<top (required)>'
/usr/local/ruby1.9/lib/ruby/1.9.1/rubygems/custom_require.rb:36:in `require'
/usr/local/ruby1.9/lib/ruby/1.9.1/rubygems/custom_require.rb:36:in `require'
/Users/asari/rubyspec/optional/ffi/buffer_spec.rb:1:in `<top (required)>'
/Users/asari/mspec/lib/mspec/runner/mspec.rb:56:in `load'
/Users/asari/mspec/lib/mspec/runner/mspec.rb:56:in `block (2 levels) in files'
/Users/asari/mspec/lib/mspec/runner/mspec.rb:68:in `instance_eval'
/Users/asari/mspec/lib/mspec/runner/mspec.rb:68:in `protect'
/Users/asari/mspec/lib/mspec/runner/mspec.rb:56:in `block in files'
/Users/asari/mspec/lib/mspec/runner/mspec.rb:50:in `each'
/Users/asari/mspec/lib/mspec/runner/mspec.rb:50:in `files'
/Users/asari/mspec/lib/mspec/runner/mspec.rb:42:in `process'
/Users/asari/mspec/lib/mspec/commands/mspec-run.rb:87:in `run'
/Users/asari/mspec/lib/mspec/utils/script.rb:218:in `main'
/Users/asari/mspec/bin/mspec-run:8:in `<main>'
79)
An exception occurred during: loading /Users/asari/rubyspec/optional/ffi/callback_spec.rb ERROR
RuntimeError: Failed to compile Ruby-FFI fixtures
/Users/asari/rubyspec/optional/ffi/spec_helper.rb:26:in `block in <module:FFISpecs>'
/Users/asari/rubyspec/optional/ffi/spec_helper.rb:24:in `chdir'
/Users/asari/rubyspec/optional/ffi/spec_helper.rb:24:in `<module:FFISpecs>'
/Users/asari/rubyspec/optional/ffi/spec_helper.rb:10:in `<top (required)>'
/usr/local/ruby1.9/lib/ruby/1.9.1/rubygems/custom_require.rb:36:in `require'
/usr/local/ruby1.9/lib/ruby/1.9.1/rubygems/custom_require.rb:36:in `require'
/Users/asari/rubyspec/optional/ffi/callback_spec.rb:1:in `<top (required)>'
/Users/asari/mspec/lib/mspec/runner/mspec.rb:56:in `load'
/Users/asari/mspec/lib/mspec/runner/mspec.rb:56:in `block (2 levels) in files'
/Users/asari/mspec/lib/mspec/runner/mspec.rb:68:in `instance_eval'
/Users/asari/mspec/lib/mspec/runner/mspec.rb:68:in `protect'
/Users/asari/mspec/lib/mspec/runner/mspec.rb:56:in `block in files'
/Users/asari/mspec/lib/mspec/runner/mspec.rb:50:in `each'
/Users/asari/mspec/lib/mspec/runner/mspec.rb:50:in `files'
/Users/asari/mspec/lib/mspec/runner/mspec.rb:42:in `process'
/Users/asari/mspec/lib/mspec/commands/mspec-run.rb:87:in `run'
/Users/asari/mspec/lib/mspec/utils/script.rb:218:in `main'
/Users/asari/mspec/bin/mspec-run:8:in `<main>'
80)
An exception occurred during: loading /Users/asari/rubyspec/optional/ffi/enum_spec.rb ERROR
RuntimeError: Failed to compile Ruby-FFI fixtures
/Users/asari/rubyspec/optional/ffi/spec_helper.rb:26:in `block in <module:FFISpecs>'
/Users/asari/rubyspec/optional/ffi/spec_helper.rb:24:in `chdir'
/Users/asari/rubyspec/optional/ffi/spec_helper.rb:24:in `<module:FFISpecs>'
/Users/asari/rubyspec/optional/ffi/spec_helper.rb:10:in `<top (required)>'
/usr/local/ruby1.9/lib/ruby/1.9.1/rubygems/custom_require.rb:36:in `require'
/usr/local/ruby1.9/lib/ruby/1.9.1/rubygems/custom_require.rb:36:in `require'
/Users/asari/rubyspec/optional/ffi/enum_spec.rb:1:in `<top (required)>'
/Users/asari/mspec/lib/mspec/runner/mspec.rb:56:in `load'
/Users/asari/mspec/lib/mspec/runner/mspec.rb:56:in `block (2 levels) in files'
/Users/asari/mspec/lib/mspec/runner/mspec.rb:68:in `instance_eval'
/Users/asari/mspec/lib/mspec/runner/mspec.rb:68:in `protect'
/Users/asari/mspec/lib/mspec/runner/mspec.rb:56:in `block in files'
/Users/asari/mspec/lib/mspec/runner/mspec.rb:50:in `each'
/Users/asari/mspec/lib/mspec/runner/mspec.rb:50:in `files'
/Users/asari/mspec/lib/mspec/runner/mspec.rb:42:in `process'
/Users/asari/mspec/lib/mspec/commands/mspec-run.rb:87:in `run'
/Users/asari/mspec/lib/mspec/utils/script.rb:218:in `main'
/Users/asari/mspec/bin/mspec-run:8:in `<main>'
81)
An exception occurred during: loading /Users/asari/rubyspec/optional/ffi/errno_spec.rb ERROR
RuntimeError: Failed to compile Ruby-FFI fixtures
/Users/asari/rubyspec/optional/ffi/spec_helper.rb:26:in `block in <module:FFISpecs>'
/Users/asari/rubyspec/optional/ffi/spec_helper.rb:24:in `chdir'
/Users/asari/rubyspec/optional/ffi/spec_helper.rb:24:in `<module:FFISpecs>'
/Users/asari/rubyspec/optional/ffi/spec_helper.rb:10:in `<top (required)>'
/usr/local/ruby1.9/lib/ruby/1.9.1/rubygems/custom_require.rb:36:in `require'
/usr/local/ruby1.9/lib/ruby/1.9.1/rubygems/custom_require.rb:36:in `require'
/Users/asari/rubyspec/optional/ffi/errno_spec.rb:1:in `<top (required)>'
/Users/asari/mspec/lib/mspec/runner/mspec.rb:56:in `load'
/Users/asari/mspec/lib/mspec/runner/mspec.rb:56:in `block (2 levels) in files'
/Users/asari/mspec/lib/mspec/runner/mspec.rb:68:in `instance_eval'
/Users/asari/mspec/lib/mspec/runner/mspec.rb:68:in `protect'
/Users/asari/mspec/lib/mspec/runner/mspec.rb:56:in `block in files'
/Users/asari/mspec/lib/mspec/runner/mspec.rb:50:in `each'
/Users/asari/mspec/lib/mspec/runner/mspec.rb:50:in `files'
/Users/asari/mspec/lib/mspec/runner/mspec.rb:42:in `process'
/Users/asari/mspec/lib/mspec/commands/mspec-run.rb:87:in `run'
/Users/asari/mspec/lib/mspec/utils/script.rb:218:in `main'
/Users/asari/mspec/bin/mspec-run:8:in `<main>'
82)
An exception occurred during: loading /Users/asari/rubyspec/optional/ffi/library_spec.rb ERROR
RuntimeError: Failed to compile Ruby-FFI fixtures
/Users/asari/rubyspec/optional/ffi/spec_helper.rb:26:in `block in <module:FFISpecs>'
/Users/asari/rubyspec/optional/ffi/spec_helper.rb:24:in `chdir'
/Users/asari/rubyspec/optional/ffi/spec_helper.rb:24:in `<module:FFISpecs>'
/Users/asari/rubyspec/optional/ffi/spec_helper.rb:10:in `<top (required)>'
/usr/local/ruby1.9/lib/ruby/1.9.1/rubygems/custom_require.rb:36:in `require'
/usr/local/ruby1.9/lib/ruby/1.9.1/rubygems/custom_require.rb:36:in `require'
/Users/asari/rubyspec/optional/ffi/library_spec.rb:1:in `<top (required)>'
/Users/asari/mspec/lib/mspec/runner/mspec.rb:56:in `load'
/Users/asari/mspec/lib/mspec/runner/mspec.rb:56:in `block (2 levels) in files'
/Users/asari/mspec/lib/mspec/runner/mspec.rb:68:in `instance_eval'
/Users/asari/mspec/lib/mspec/runner/mspec.rb:68:in `protect'
/Users/asari/mspec/lib/mspec/runner/mspec.rb:56:in `block in files'
/Users/asari/mspec/lib/mspec/runner/mspec.rb:50:in `each'
/Users/asari/mspec/lib/mspec/runner/mspec.rb:50:in `files'
/Users/asari/mspec/lib/mspec/runner/mspec.rb:42:in `process'
/Users/asari/mspec/lib/mspec/commands/mspec-run.rb:87:in `run'
/Users/asari/mspec/lib/mspec/utils/script.rb:218:in `main'
/Users/asari/mspec/bin/mspec-run:8:in `<main>'
83)
An exception occurred during: loading /Users/asari/rubyspec/optional/ffi/managed_struct_spec.rb ERROR
RuntimeError: Failed to compile Ruby-FFI fixtures
/Users/asari/rubyspec/optional/ffi/spec_helper.rb:26:in `block in <module:FFISpecs>'
/Users/asari/rubyspec/optional/ffi/spec_helper.rb:24:in `chdir'
/Users/asari/rubyspec/optional/ffi/spec_helper.rb:24:in `<module:FFISpecs>'
/Users/asari/rubyspec/optional/ffi/spec_helper.rb:10:in `<top (required)>'
/usr/local/ruby1.9/lib/ruby/1.9.1/rubygems/custom_require.rb:36:in `require'
/usr/local/ruby1.9/lib/ruby/1.9.1/rubygems/custom_require.rb:36:in `require'
/Users/asari/rubyspec/optional/ffi/managed_struct_spec.rb:1:in `<top (required)>'
/Users/asari/mspec/lib/mspec/runner/mspec.rb:56:in `load'
/Users/asari/mspec/lib/mspec/runner/mspec.rb:56:in `block (2 levels) in files'
/Users/asari/mspec/lib/mspec/runner/mspec.rb:68:in `instance_eval'
/Users/asari/mspec/lib/mspec/runner/mspec.rb:68:in `protect'
/Users/asari/mspec/lib/mspec/runner/mspec.rb:56:in `block in files'
/Users/asari/mspec/lib/mspec/runner/mspec.rb:50:in `each'
/Users/asari/mspec/lib/mspec/runner/mspec.rb:50:in `files'
/Users/asari/mspec/lib/mspec/runner/mspec.rb:42:in `process'
/Users/asari/mspec/lib/mspec/commands/mspec-run.rb:87:in `run'
/Users/asari/mspec/lib/mspec/utils/script.rb:218:in `main'
/Users/asari/mspec/bin/mspec-run:8:in `<main>'
84)
An exception occurred during: loading /Users/asari/rubyspec/optional/ffi/number_spec.rb ERROR
RuntimeError: Failed to compile Ruby-FFI fixtures
/Users/asari/rubyspec/optional/ffi/spec_helper.rb:26:in `block in <module:FFISpecs>'
/Users/asari/rubyspec/optional/ffi/spec_helper.rb:24:in `chdir'
/Users/asari/rubyspec/optional/ffi/spec_helper.rb:24:in `<module:FFISpecs>'
/Users/asari/rubyspec/optional/ffi/spec_helper.rb:10:in `<top (required)>'
/usr/local/ruby1.9/lib/ruby/1.9.1/rubygems/custom_require.rb:36:in `require'
/usr/local/ruby1.9/lib/ruby/1.9.1/rubygems/custom_require.rb:36:in `require'
/Users/asari/rubyspec/optional/ffi/number_spec.rb:1:in `<top (required)>'
/Users/asari/mspec/lib/mspec/runner/mspec.rb:56:in `load'
/Users/asari/mspec/lib/mspec/runner/mspec.rb:56:in `block (2 levels) in files'
/Users/asari/mspec/lib/mspec/runner/mspec.rb:68:in `instance_eval'
/Users/asari/mspec/lib/mspec/runner/mspec.rb:68:in `protect'
/Users/asari/mspec/lib/mspec/runner/mspec.rb:56:in `block in files'
/Users/asari/mspec/lib/mspec/runner/mspec.rb:50:in `each'
/Users/asari/mspec/lib/mspec/runner/mspec.rb:50:in `files'
/Users/asari/mspec/lib/mspec/runner/mspec.rb:42:in `process'
/Users/asari/mspec/lib/mspec/commands/mspec-run.rb:87:in `run'
/Users/asari/mspec/lib/mspec/utils/script.rb:218:in `main'
/Users/asari/mspec/bin/mspec-run:8:in `<main>'
85)
An exception occurred during: loading /Users/asari/rubyspec/optional/ffi/pointer_spec.rb ERROR
RuntimeError: Failed to compile Ruby-FFI fixtures
/Users/asari/rubyspec/optional/ffi/spec_helper.rb:26:in `block in <module:FFISpecs>'
/Users/asari/rubyspec/optional/ffi/spec_helper.rb:24:in `chdir'
/Users/asari/rubyspec/optional/ffi/spec_helper.rb:24:in `<module:FFISpecs>'
/Users/asari/rubyspec/optional/ffi/spec_helper.rb:10:in `<top (required)>'
/usr/local/ruby1.9/lib/ruby/1.9.1/rubygems/custom_require.rb:36:in `require'
/usr/local/ruby1.9/lib/ruby/1.9.1/rubygems/custom_require.rb:36:in `require'
/Users/asari/rubyspec/optional/ffi/pointer_spec.rb:1:in `<top (required)>'
/Users/asari/mspec/lib/mspec/runner/mspec.rb:56:in `load'
/Users/asari/mspec/lib/mspec/runner/mspec.rb:56:in `block (2 levels) in files'
/Users/asari/mspec/lib/mspec/runner/mspec.rb:68:in `instance_eval'
/Users/asari/mspec/lib/mspec/runner/mspec.rb:68:in `protect'
/Users/asari/mspec/lib/mspec/runner/mspec.rb:56:in `block in files'
/Users/asari/mspec/lib/mspec/runner/mspec.rb:50:in `each'
/Users/asari/mspec/lib/mspec/runner/mspec.rb:50:in `files'
/Users/asari/mspec/lib/mspec/runner/mspec.rb:42:in `process'
/Users/asari/mspec/lib/mspec/commands/mspec-run.rb:87:in `run'
/Users/asari/mspec/lib/mspec/utils/script.rb:218:in `main'
/Users/asari/mspec/bin/mspec-run:8:in `<main>'
86)
An exception occurred during: loading /Users/asari/rubyspec/optional/ffi/rbx/attach_function_spec.rb ERROR
RuntimeError: Failed to compile Ruby-FFI fixtures
/Users/asari/rubyspec/optional/ffi/spec_helper.rb:26:in `block in <module:FFISpecs>'
/Users/asari/rubyspec/optional/ffi/spec_helper.rb:24:in `chdir'
/Users/asari/rubyspec/optional/ffi/spec_helper.rb:24:in `<module:FFISpecs>'
/Users/asari/rubyspec/optional/ffi/spec_helper.rb:10:in `<top (required)>'
/usr/local/ruby1.9/lib/ruby/1.9.1/rubygems/custom_require.rb:36:in `require'
/usr/local/ruby1.9/lib/ruby/1.9.1/rubygems/custom_require.rb:36:in `require'
/Users/asari/rubyspec/optional/ffi/rbx/attach_function_spec.rb:1:in `<top (required)>'
/Users/asari/mspec/lib/mspec/runner/mspec.rb:56:in `load'
/Users/asari/mspec/lib/mspec/runner/mspec.rb:56:in `block (2 levels) in files'
/Users/asari/mspec/lib/mspec/runner/mspec.rb:68:in `instance_eval'
/Users/asari/mspec/lib/mspec/runner/mspec.rb:68:in `protect'
/Users/asari/mspec/lib/mspec/runner/mspec.rb:56:in `block in files'
/Users/asari/mspec/lib/mspec/runner/mspec.rb:50:in `each'
/Users/asari/mspec/lib/mspec/runner/mspec.rb:50:in `files'
/Users/asari/mspec/lib/mspec/runner/mspec.rb:42:in `process'
/Users/asari/mspec/lib/mspec/commands/mspec-run.rb:87:in `run'
/Users/asari/mspec/lib/mspec/utils/script.rb:218:in `main'
/Users/asari/mspec/bin/mspec-run:8:in `<main>'
87)
An exception occurred during: loading /Users/asari/rubyspec/optional/ffi/rbx/memory_pointer_spec.rb ERROR
RuntimeError: Failed to compile Ruby-FFI fixtures
/Users/asari/rubyspec/optional/ffi/spec_helper.rb:26:in `block in <module:FFISpecs>'
/Users/asari/rubyspec/optional/ffi/spec_helper.rb:24:in `chdir'
/Users/asari/rubyspec/optional/ffi/spec_helper.rb:24:in `<module:FFISpecs>'
/Users/asari/rubyspec/optional/ffi/spec_helper.rb:10:in `<top (required)>'
/usr/local/ruby1.9/lib/ruby/1.9.1/rubygems/custom_require.rb:36:in `require'
/usr/local/ruby1.9/lib/ruby/1.9.1/rubygems/custom_require.rb:36:in `require'
/Users/asari/rubyspec/optional/ffi/rbx/memory_pointer_spec.rb:1:in `<top (required)>'
/Users/asari/mspec/lib/mspec/runner/mspec.rb:56:in `load'
/Users/asari/mspec/lib/mspec/runner/mspec.rb:56:in `block (2 levels) in files'
/Users/asari/mspec/lib/mspec/runner/mspec.rb:68:in `instance_eval'
/Users/asari/mspec/lib/mspec/runner/mspec.rb:68:in `protect'
/Users/asari/mspec/lib/mspec/runner/mspec.rb:56:in `block in files'
/Users/asari/mspec/lib/mspec/runner/mspec.rb:50:in `each'
/Users/asari/mspec/lib/mspec/runner/mspec.rb:50:in `files'
/Users/asari/mspec/lib/mspec/runner/mspec.rb:42:in `process'
/Users/asari/mspec/lib/mspec/commands/mspec-run.rb:87:in `run'
/Users/asari/mspec/lib/mspec/utils/script.rb:218:in `main'
/Users/asari/mspec/bin/mspec-run:8:in `<main>'
88)
An exception occurred during: loading /Users/asari/rubyspec/optional/ffi/rbx/struct_spec.rb ERROR
RuntimeError: Failed to compile Ruby-FFI fixtures
/Users/asari/rubyspec/optional/ffi/spec_helper.rb:26:in `block in <module:FFISpecs>'
/Users/asari/rubyspec/optional/ffi/spec_helper.rb:24:in `chdir'
/Users/asari/rubyspec/optional/ffi/spec_helper.rb:24:in `<module:FFISpecs>'
/Users/asari/rubyspec/optional/ffi/spec_helper.rb:10:in `<top (required)>'
/usr/local/ruby1.9/lib/ruby/1.9.1/rubygems/custom_require.rb:36:in `require'
/usr/local/ruby1.9/lib/ruby/1.9.1/rubygems/custom_require.rb:36:in `require'
/Users/asari/rubyspec/optional/ffi/rbx/struct_spec.rb:1:in `<top (required)>'
/Users/asari/mspec/lib/mspec/runner/mspec.rb:56:in `load'
/Users/asari/mspec/lib/mspec/runner/mspec.rb:56:in `block (2 levels) in files'
/Users/asari/mspec/lib/mspec/runner/mspec.rb:68:in `instance_eval'
/Users/asari/mspec/lib/mspec/runner/mspec.rb:68:in `protect'
/Users/asari/mspec/lib/mspec/runner/mspec.rb:56:in `block in files'
/Users/asari/mspec/lib/mspec/runner/mspec.rb:50:in `each'
/Users/asari/mspec/lib/mspec/runner/mspec.rb:50:in `files'
/Users/asari/mspec/lib/mspec/runner/mspec.rb:42:in `process'
/Users/asari/mspec/lib/mspec/commands/mspec-run.rb:87:in `run'
/Users/asari/mspec/lib/mspec/utils/script.rb:218:in `main'
/Users/asari/mspec/bin/mspec-run:8:in `<main>'
89)
An exception occurred during: loading /Users/asari/rubyspec/optional/ffi/string_spec.rb ERROR
RuntimeError: Failed to compile Ruby-FFI fixtures
/Users/asari/rubyspec/optional/ffi/spec_helper.rb:26:in `block in <module:FFISpecs>'
/Users/asari/rubyspec/optional/ffi/spec_helper.rb:24:in `chdir'
/Users/asari/rubyspec/optional/ffi/spec_helper.rb:24:in `<module:FFISpecs>'
/Users/asari/rubyspec/optional/ffi/spec_helper.rb:10:in `<top (required)>'
/usr/local/ruby1.9/lib/ruby/1.9.1/rubygems/custom_require.rb:36:in `require'
/usr/local/ruby1.9/lib/ruby/1.9.1/rubygems/custom_require.rb:36:in `require'
/Users/asari/rubyspec/optional/ffi/string_spec.rb:1:in `<top (required)>'
/Users/asari/mspec/lib/mspec/runner/mspec.rb:56:in `load'
/Users/asari/mspec/lib/mspec/runner/mspec.rb:56:in `block (2 levels) in files'
/Users/asari/mspec/lib/mspec/runner/mspec.rb:68:in `instance_eval'
/Users/asari/mspec/lib/mspec/runner/mspec.rb:68:in `protect'
/Users/asari/mspec/lib/mspec/runner/mspec.rb:56:in `block in files'
/Users/asari/mspec/lib/mspec/runner/mspec.rb:50:in `each'
/Users/asari/mspec/lib/mspec/runner/mspec.rb:50:in `files'
/Users/asari/mspec/lib/mspec/runner/mspec.rb:42:in `process'
/Users/asari/mspec/lib/mspec/commands/mspec-run.rb:87:in `run'
/Users/asari/mspec/lib/mspec/utils/script.rb:218:in `main'
/Users/asari/mspec/bin/mspec-run:8:in `<main>'
90)
An exception occurred during: loading /Users/asari/rubyspec/optional/ffi/struct_callback_spec.rb ERROR
RuntimeError: Failed to compile Ruby-FFI fixtures
/Users/asari/rubyspec/optional/ffi/spec_helper.rb:26:in `block in <module:FFISpecs>'
/Users/asari/rubyspec/optional/ffi/spec_helper.rb:24:in `chdir'
/Users/asari/rubyspec/optional/ffi/spec_helper.rb:24:in `<module:FFISpecs>'
/Users/asari/rubyspec/optional/ffi/spec_helper.rb:10:in `<top (required)>'
/usr/local/ruby1.9/lib/ruby/1.9.1/rubygems/custom_require.rb:36:in `require'
/usr/local/ruby1.9/lib/ruby/1.9.1/rubygems/custom_require.rb:36:in `require'
/Users/asari/rubyspec/optional/ffi/struct_callback_spec.rb:1:in `<top (required)>'
/Users/asari/mspec/lib/mspec/runner/mspec.rb:56:in `load'
/Users/asari/mspec/lib/mspec/runner/mspec.rb:56:in `block (2 levels) in files'
/Users/asari/mspec/lib/mspec/runner/mspec.rb:68:in `instance_eval'
/Users/asari/mspec/lib/mspec/runner/mspec.rb:68:in `protect'
/Users/asari/mspec/lib/mspec/runner/mspec.rb:56:in `block in files'
/Users/asari/mspec/lib/mspec/runner/mspec.rb:50:in `each'
/Users/asari/mspec/lib/mspec/runner/mspec.rb:50:in `files'
/Users/asari/mspec/lib/mspec/runner/mspec.rb:42:in `process'
/Users/asari/mspec/lib/mspec/commands/mspec-run.rb:87:in `run'
/Users/asari/mspec/lib/mspec/utils/script.rb:218:in `main'
/Users/asari/mspec/bin/mspec-run:8:in `<main>'
91)
An exception occurred during: loading /Users/asari/rubyspec/optional/ffi/struct_initialize_spec.rb ERROR
RuntimeError: Failed to compile Ruby-FFI fixtures
/Users/asari/rubyspec/optional/ffi/spec_helper.rb:26:in `block in <module:FFISpecs>'
/Users/asari/rubyspec/optional/ffi/spec_helper.rb:24:in `chdir'
/Users/asari/rubyspec/optional/ffi/spec_helper.rb:24:in `<module:FFISpecs>'
/Users/asari/rubyspec/optional/ffi/spec_helper.rb:10:in `<top (required)>'
/usr/local/ruby1.9/lib/ruby/1.9.1/rubygems/custom_require.rb:36:in `require'
/usr/local/ruby1.9/lib/ruby/1.9.1/rubygems/custom_require.rb:36:in `require'
/Users/asari/rubyspec/optional/ffi/struct_initialize_spec.rb:1:in `<top (required)>'
/Users/asari/mspec/lib/mspec/runner/mspec.rb:56:in `load'
/Users/asari/mspec/lib/mspec/runner/mspec.rb:56:in `block (2 levels) in files'
/Users/asari/mspec/lib/mspec/runner/mspec.rb:68:in `instance_eval'
/Users/asari/mspec/lib/mspec/runner/mspec.rb:68:in `protect'
/Users/asari/mspec/lib/mspec/runner/mspec.rb:56:in `block in files'
/Users/asari/mspec/lib/mspec/runner/mspec.rb:50:in `each'
/Users/asari/mspec/lib/mspec/runner/mspec.rb:50:in `files'
/Users/asari/mspec/lib/mspec/runner/mspec.rb:42:in `process'
/Users/asari/mspec/lib/mspec/commands/mspec-run.rb:87:in `run'
/Users/asari/mspec/lib/mspec/utils/script.rb:218:in `main'
/Users/asari/mspec/bin/mspec-run:8:in `<main>'
92)
An exception occurred during: loading /Users/asari/rubyspec/optional/ffi/struct_spec.rb ERROR
RuntimeError: Failed to compile Ruby-FFI fixtures
/Users/asari/rubyspec/optional/ffi/spec_helper.rb:26:in `block in <module:FFISpecs>'
/Users/asari/rubyspec/optional/ffi/spec_helper.rb:24:in `chdir'
/Users/asari/rubyspec/optional/ffi/spec_helper.rb:24:in `<module:FFISpecs>'
/Users/asari/rubyspec/optional/ffi/spec_helper.rb:10:in `<top (required)>'
/usr/local/ruby1.9/lib/ruby/1.9.1/rubygems/custom_require.rb:36:in `require'
/usr/local/ruby1.9/lib/ruby/1.9.1/rubygems/custom_require.rb:36:in `require'
/Users/asari/rubyspec/optional/ffi/struct_spec.rb:1:in `<top (required)>'
/Users/asari/mspec/lib/mspec/runner/mspec.rb:56:in `load'
/Users/asari/mspec/lib/mspec/runner/mspec.rb:56:in `block (2 levels) in files'
/Users/asari/mspec/lib/mspec/runner/mspec.rb:68:in `instance_eval'
/Users/asari/mspec/lib/mspec/runner/mspec.rb:68:in `protect'
/Users/asari/mspec/lib/mspec/runner/mspec.rb:56:in `block in files'
/Users/asari/mspec/lib/mspec/runner/mspec.rb:50:in `each'
/Users/asari/mspec/lib/mspec/runner/mspec.rb:50:in `files'
/Users/asari/mspec/lib/mspec/runner/mspec.rb:42:in `process'
/Users/asari/mspec/lib/mspec/commands/mspec-run.rb:87:in `run'
/Users/asari/mspec/lib/mspec/utils/script.rb:218:in `main'
/Users/asari/mspec/bin/mspec-run:8:in `<main>'
93)
An exception occurred during: loading /Users/asari/rubyspec/optional/ffi/typedef_spec.rb ERROR
RuntimeError: Failed to compile Ruby-FFI fixtures
/Users/asari/rubyspec/optional/ffi/spec_helper.rb:26:in `block in <module:FFISpecs>'
/Users/asari/rubyspec/optional/ffi/spec_helper.rb:24:in `chdir'
/Users/asari/rubyspec/optional/ffi/spec_helper.rb:24:in `<module:FFISpecs>'
/Users/asari/rubyspec/optional/ffi/spec_helper.rb:10:in `<top (required)>'
/usr/local/ruby1.9/lib/ruby/1.9.1/rubygems/custom_require.rb:36:in `require'
/usr/local/ruby1.9/lib/ruby/1.9.1/rubygems/custom_require.rb:36:in `require'
/Users/asari/rubyspec/optional/ffi/typedef_spec.rb:1:in `<top (required)>'
/Users/asari/mspec/lib/mspec/runner/mspec.rb:56:in `load'
/Users/asari/mspec/lib/mspec/runner/mspec.rb:56:in `block (2 levels) in files'
/Users/asari/mspec/lib/mspec/runner/mspec.rb:68:in `instance_eval'
/Users/asari/mspec/lib/mspec/runner/mspec.rb:68:in `protect'
/Users/asari/mspec/lib/mspec/runner/mspec.rb:56:in `block in files'
/Users/asari/mspec/lib/mspec/runner/mspec.rb:50:in `each'
/Users/asari/mspec/lib/mspec/runner/mspec.rb:50:in `files'
/Users/asari/mspec/lib/mspec/runner/mspec.rb:42:in `process'
/Users/asari/mspec/lib/mspec/commands/mspec-run.rb:87:in `run'
/Users/asari/mspec/lib/mspec/utils/script.rb:218:in `main'
/Users/asari/mspec/bin/mspec-run:8:in `<main>'
94)
An exception occurred during: loading /Users/asari/rubyspec/optional/ffi/union_spec.rb ERROR
RuntimeError: Failed to compile Ruby-FFI fixtures
/Users/asari/rubyspec/optional/ffi/spec_helper.rb:26:in `block in <module:FFISpecs>'
/Users/asari/rubyspec/optional/ffi/spec_helper.rb:24:in `chdir'
/Users/asari/rubyspec/optional/ffi/spec_helper.rb:24:in `<module:FFISpecs>'
/Users/asari/rubyspec/optional/ffi/spec_helper.rb:10:in `<top (required)>'
/usr/local/ruby1.9/lib/ruby/1.9.1/rubygems/custom_require.rb:36:in `require'
/usr/local/ruby1.9/lib/ruby/1.9.1/rubygems/custom_require.rb:36:in `require'
/Users/asari/rubyspec/optional/ffi/union_spec.rb:1:in `<top (required)>'
/Users/asari/mspec/lib/mspec/runner/mspec.rb:56:in `load'
/Users/asari/mspec/lib/mspec/runner/mspec.rb:56:in `block (2 levels) in files'
/Users/asari/mspec/lib/mspec/runner/mspec.rb:68:in `instance_eval'
/Users/asari/mspec/lib/mspec/runner/mspec.rb:68:in `protect'
/Users/asari/mspec/lib/mspec/runner/mspec.rb:56:in `block in files'
/Users/asari/mspec/lib/mspec/runner/mspec.rb:50:in `each'
/Users/asari/mspec/lib/mspec/runner/mspec.rb:50:in `files'
/Users/asari/mspec/lib/mspec/runner/mspec.rb:42:in `process'
/Users/asari/mspec/lib/mspec/commands/mspec-run.rb:87:in `run'
/Users/asari/mspec/lib/mspec/utils/script.rb:218:in `main'
/Users/asari/mspec/bin/mspec-run:8:in `<main>'
95)
An exception occurred during: loading /Users/asari/rubyspec/optional/ffi/variadic_spec.rb ERROR
RuntimeError: Failed to compile Ruby-FFI fixtures
/Users/asari/rubyspec/optional/ffi/spec_helper.rb:26:in `block in <module:FFISpecs>'
/Users/asari/rubyspec/optional/ffi/spec_helper.rb:24:in `chdir'
/Users/asari/rubyspec/optional/ffi/spec_helper.rb:24:in `<module:FFISpecs>'
/Users/asari/rubyspec/optional/ffi/spec_helper.rb:10:in `<top (required)>'
/usr/local/ruby1.9/lib/ruby/1.9.1/rubygems/custom_require.rb:36:in `require'
/usr/local/ruby1.9/lib/ruby/1.9.1/rubygems/custom_require.rb:36:in `require'
/Users/asari/rubyspec/optional/ffi/variadic_spec.rb:1:in `<top (required)>'
/Users/asari/mspec/lib/mspec/runner/mspec.rb:56:in `load'
/Users/asari/mspec/lib/mspec/runner/mspec.rb:56:in `block (2 levels) in files'
/Users/asari/mspec/lib/mspec/runner/mspec.rb:68:in `instance_eval'
/Users/asari/mspec/lib/mspec/runner/mspec.rb:68:in `protect'
/Users/asari/mspec/lib/mspec/runner/mspec.rb:56:in `block in files'
/Users/asari/mspec/lib/mspec/runner/mspec.rb:50:in `each'
/Users/asari/mspec/lib/mspec/runner/mspec.rb:50:in `files'
/Users/asari/mspec/lib/mspec/runner/mspec.rb:42:in `process'
/Users/asari/mspec/lib/mspec/commands/mspec-run.rb:87:in `run'
/Users/asari/mspec/lib/mspec/utils/script.rb:218:in `main'
/Users/asari/mspec/bin/mspec-run:8:in `<main>'
Finished in 59.767294 seconds
3561 files, 17207 examples, 129272 expectations, 70 failures, 25 errors
Sign up for free to join this conversation on GitHub. Already have an account? Sign in to comment