Skip to content

Instantly share code, notes, and snippets.

Embed
What would you like to do?
- The C compiler identification is GNU 6.4.0
-- The CXX compiler identification is GNU 6.4.0
-- Check for working C compiler: /builds/gcc/6.4.0/6359df24a4/bin/cc
-- Check for working C compiler: /builds/gcc/6.4.0/6359df24a4/bin/cc -- works
-- Detecting C compiler ABI info
-- Detecting C compiler ABI info - done
-- Detecting C compile features
-- Detecting C compile features - done
-- Check for working CXX compiler: /builds/gcc/6.4.0/6359df24a4/bin/c++
-- Check for working CXX compiler: /builds/gcc/6.4.0/6359df24a4/bin/c++ -- works
-- Detecting CXX compiler ABI info
-- Detecting CXX compiler ABI info - done
-- Detecting CXX compile features
-- Detecting CXX compile features - done
-- Found PythonInterp: /builds/python/3.4.0/0e6ce9304e/bin/python3.4 (found suitable version "3.4", minimum required is "3.4")
-- Found PythonLibs: /builds/python/3.4.0/0e6ce9304e/lib/libpython3.4m.so (found suitable version "3.4.0", minimum required is "3.4")
PYTHON_ARCH: 64
LLMV_CONFIG: /builds/llvm/3.9.0/50b875b380/bin/llvm-config
-- CLANG: /builds/llvm/3.9.0/50b875b380, /builds/clang/3.9.0/cfed7b0e49/lib/libclang.so detected by /builds/llvm/3.9.0/50b875b380/bin/llvm-config
-- Found the following CLANG builtins includes directories:
-- CLANG builtins includes directory chosen:
PYTHONLIBS_FOUND: TRUE
PYTHON_LIBRARIES: /builds/python/3.4.0/0e6ce9304e/lib/libpython3.4m.so
PYTHON_INCLUDE_DIRS: /builds/python/3.4.0/0e6ce9304e/include/python3.4m
PYTHON_DEBUG_LIBRARIES:
PYTHONINTERP_FOUND: TRUE
PYTHON_EXECUTABLE: /builds/python/3.4.0/0e6ce9304e/bin/python3.4
PYTHON_VERSION: 3.4.0
PYTHON_EXTENSION_SUFFIX: .cpython-34m
-- PYTHON_EXTENSION_SUFFIX: .cpython-34m
-- PYTHON_CONFIG_SUFFIX: .cpython-34m
-- PYTHON_SHARED_LIBRARY_SUFFIX: .cpython-34m
-- Found LibXml2: /usr/lib64/libxml2.so (found suitable version "2.7.6", minimum required is "2.6.32")
-- Found LibXslt: /usr/lib64/libxslt.so (found suitable version "1.1.26", minimum required is "1.1.19")
PYTHON_NUMPY_LOCATION:
-- sphinx-build - not found! doc target disabled
-- Tests will be generated using the protected hack!
-- Found PythonInterp: /builds/python/3.4.0/0e6ce9304e/bin/python3.4 (found version "3.4")
-- Configuring done
-- Generating done
-- Build files have been written to: /user_data/.tmp/scratch-3NtfLe/build/sources/shiboken2/___build
Scanning dependencies of target apiextractor_autogen
[ 0%] Automatic MOC for target apiextractor
Scanning dependencies of target libsmart
Scanning dependencies of target libminimal
[ 1%] Building CXX object tests/libsmart/CMakeFiles/libsmart.dir/smart.cpp.o
[ 1%] Building CXX object tests/libminimal/CMakeFiles/libminimal.dir/listuser.cpp.o
[ 1%] Building CXX object tests/libminimal/CMakeFiles/libminimal.dir/typedef.cpp.o
[ 1%] Building CXX object tests/libminimal/CMakeFiles/libminimal.dir/obj.cpp.o
Scanning dependencies of target libsample
[ 1%] Building CXX object tests/libsample/CMakeFiles/libsample.dir/blackbox.cpp.o
[ 1%] Building CXX object tests/libsample/CMakeFiles/libsample.dir/abstract.cpp.o
[ 1%] Building CXX object tests/libsample/CMakeFiles/libsample.dir/injectcode.cpp.o
[ 2%] Building CXX object tests/libsample/CMakeFiles/libsample.dir/onlycopy.cpp.o
[ 2%] Building CXX object tests/libsample/CMakeFiles/libsample.dir/listuser.cpp.o
[ 3%] Building CXX object tests/libsample/CMakeFiles/libsample.dir/bucket.cpp.o
[ 3%] Building CXX object tests/libsample/CMakeFiles/libsample.dir/functions.cpp.o
[ 4%] Building CXX object tests/libsample/CMakeFiles/libsample.dir/complex.cpp.o
[ 4%] Building CXX object tests/libsample/CMakeFiles/libsample.dir/collector.cpp.o
[ 4%] Building CXX object tests/libsample/CMakeFiles/libsample.dir/echo.cpp.o
[ 4%] Building CXX object tests/libsample/CMakeFiles/libsample.dir/modified_constructor.cpp.o
[ 4%] Building CXX object tests/libsample/CMakeFiles/libsample.dir/mapuser.cpp.o
[ 4%] Building CXX object tests/libsample/CMakeFiles/libsample.dir/handle.cpp.o
[ 5%] Building CXX object tests/libsample/CMakeFiles/libsample.dir/bytearray.cpp.o
[ 5%] Building CXX object tests/libsample/CMakeFiles/libsample.dir/derived.cpp.o
[ 5%] Building CXX object tests/libsample/CMakeFiles/libsample.dir/implicitconv.cpp.o
[ 6%] Building CXX object tests/libsample/CMakeFiles/libsample.dir/multiple_derived.cpp.o
[ 6%] Building CXX object tests/libsample/CMakeFiles/libsample.dir/modifications.cpp.o
[ 6%] Building CXX object tests/libsample/CMakeFiles/libsample.dir/objectmodel.cpp.o
[ 6%] Building CXX object tests/libsample/CMakeFiles/libsample.dir/objecttypeholder.cpp.o
[ 6%] Building CXX object tests/libsample/CMakeFiles/libsample.dir/objecttype.cpp.o
[ 7%] Building CXX object tests/libsample/CMakeFiles/libsample.dir/objecttypelayout.cpp.o
Scanning dependencies of target libshiboken
[ 8%] Building CXX object libshiboken/CMakeFiles/libshiboken.dir/basewrapper.cpp.o
[ 8%] Building CXX object tests/libsample/CMakeFiles/libsample.dir/objecttypeoperators.cpp.o
Generating MOC predefs moc_predefs.h
Generating MOC source EWIEGA46WW/moc_abstractmetalang.cpp
Generating MOC source EWIEGA46WW/moc_typesystem.cpp
Generating MOC compilation mocs_compilation.cpp
[ 8%] Building CXX object tests/libsample/CMakeFiles/libsample.dir/objectview.cpp.o
[ 8%] Built target apiextractor_autogen
[ 8%] Building CXX object tests/libsample/CMakeFiles/libsample.dir/overload.cpp.o
[ 9%] Building CXX object tests/libsample/CMakeFiles/libsample.dir/overloadsort.cpp.o
[ 10%] Linking CXX shared library libminimal.so
[ 10%] Built target libminimal
[ 10%] Building CXX object tests/libsample/CMakeFiles/libsample.dir/pairuser.cpp.o
[ 10%] Building CXX object tests/libsample/CMakeFiles/libsample.dir/pen.cpp.o
[ 10%] Building CXX object tests/libsample/CMakeFiles/libsample.dir/photon.cpp.o
[ 10%] Building CXX object libshiboken/CMakeFiles/libshiboken.dir/debugfreehook.cpp.o
[ 10%] Building CXX object libshiboken/CMakeFiles/libshiboken.dir/gilstate.cpp.o
[ 11%] Building CXX object tests/libsample/CMakeFiles/libsample.dir/point.cpp.o
[ 11%] Building CXX object libshiboken/CMakeFiles/libshiboken.dir/helper.cpp.o
[ 12%] Building CXX object libshiboken/CMakeFiles/libshiboken.dir/sbkarrayconverter.cpp.o
[ 12%] Building CXX object libshiboken/CMakeFiles/libshiboken.dir/sbkconverter.cpp.o
[ 12%] Building CXX object libshiboken/CMakeFiles/libshiboken.dir/sbkenum.cpp.o
[ 12%] Building CXX object libshiboken/CMakeFiles/libshiboken.dir/sbkmodule.cpp.o
[ 13%] Building CXX object libshiboken/CMakeFiles/libshiboken.dir/sbkstring.cpp.o
[ 13%] Building CXX object tests/libsample/CMakeFiles/libsample.dir/pointf.cpp.o
[ 13%] Building CXX object libshiboken/CMakeFiles/libshiboken.dir/bindingmanager.cpp.o
[ 13%] Building CXX object tests/libsample/CMakeFiles/libsample.dir/polygon.cpp.o
/user_data/.tmp/scratch-3NtfLe/build/sources/shiboken2/tests/libsample/objecttype.cpp: In member function 'void ObjectType::callVirtualCreateChild()':
/user_data/.tmp/scratch-3NtfLe/build/sources/shiboken2/tests/libsample/objecttype.cpp:283:17: warning: unused variable 'fake_child' [-Wunused-variable]
ObjectType* fake_child = createChild(fake_parent);
^~~~~~~~~~
[ 13%] Building CXX object libshiboken/CMakeFiles/libshiboken.dir/threadstatesaver.cpp.o
[ 13%] Building CXX object tests/libsample/CMakeFiles/libsample.dir/protected.cpp.o
[ 13%] Building CXX object libshiboken/CMakeFiles/libshiboken.dir/shibokenbuffer.cpp.o
[ 14%] Building CXX object tests/libsample/CMakeFiles/libsample.dir/reference.cpp.o
[ 15%] Building CXX object libshiboken/CMakeFiles/libshiboken.dir/signature.cpp.o
[ 15%] Building CXX object tests/libsample/CMakeFiles/libsample.dir/sample.cpp.o
[ 15%] Building CXX object tests/libsample/CMakeFiles/libsample.dir/samplenamespace.cpp.o
[ 15%] Building CXX object tests/libsample/CMakeFiles/libsample.dir/sbkdate.cpp.o
[ 16%] Building CXX object tests/libsample/CMakeFiles/libsample.dir/simplefile.cpp.o
Scanning dependencies of target apiextractor
[ 16%] Linking CXX shared library libsmart.so
[ 16%] Building CXX object tests/libsample/CMakeFiles/libsample.dir/sometime.cpp.o
[ 16%] Building CXX object ApiExtractor/CMakeFiles/apiextractor.dir/apiextractor.cpp.o
[ 16%] Building CXX object ApiExtractor/CMakeFiles/apiextractor.dir/abstractmetabuilder.cpp.o
[ 16%] Building CXX object tests/libsample/CMakeFiles/libsample.dir/size.cpp.o
[ 16%] Building CXX object tests/libsample/CMakeFiles/libsample.dir/str.cpp.o
[ 17%] Building CXX object tests/libsample/CMakeFiles/libsample.dir/strlist.cpp.o
[ 17%] Building CXX object libshiboken/CMakeFiles/libshiboken.dir/qapp_macro.cpp.o
[ 17%] Built target libsmart
[ 17%] Building CXX object libshiboken/CMakeFiles/libshiboken.dir/voidptr.cpp.o
[ 17%] Building CXX object ApiExtractor/CMakeFiles/apiextractor.dir/abstractmetalang.cpp.o
[ 18%] Building CXX object ApiExtractor/CMakeFiles/apiextractor.dir/fileout.cpp.o
[ 18%] Building CXX object ApiExtractor/CMakeFiles/apiextractor.dir/graph.cpp.o
[ 18%] Building CXX object tests/libsample/CMakeFiles/libsample.dir/templateptr.cpp.o
[ 18%] Building CXX object tests/libsample/CMakeFiles/libsample.dir/transform.cpp.o
[ 19%] Building CXX object tests/libsample/CMakeFiles/libsample.dir/virtualmethods.cpp.o
[ 19%] Building CXX object ApiExtractor/CMakeFiles/apiextractor.dir/reporthandler.cpp.o
[ 19%] Building CXX object ApiExtractor/CMakeFiles/apiextractor.dir/typeparser.cpp.o
[ 20%] Building CXX object ApiExtractor/CMakeFiles/apiextractor.dir/typesystem.cpp.o
[ 20%] Building CXX object ApiExtractor/CMakeFiles/apiextractor.dir/include.cpp.o
[ 20%] Building CXX object ApiExtractor/CMakeFiles/apiextractor.dir/typedatabase.cpp.o
[ 20%] Building CXX object tests/libsample/CMakeFiles/libsample.dir/expression.cpp.o
[ 20%] Building CXX object ApiExtractor/CMakeFiles/apiextractor.dir/clangparser/compilersupport.cpp.o
[ 20%] Building CXX object tests/libsample/CMakeFiles/libsample.dir/filter.cpp.o
[ 21%] Building CXX object ApiExtractor/CMakeFiles/apiextractor.dir/clangparser/clangparser.cpp.o
[ 21%] Building CXX object ApiExtractor/CMakeFiles/apiextractor.dir/clangparser/clangbuilder.cpp.o
[ 21%] Building CXX object ApiExtractor/CMakeFiles/apiextractor.dir/clangparser/clangdebugutils.cpp.o
[ 21%] Building CXX object ApiExtractor/CMakeFiles/apiextractor.dir/clangparser/clangutils.cpp.o
[ 22%] Building CXX object ApiExtractor/CMakeFiles/apiextractor.dir/parser/codemodel.cpp.o
[ 22%] Building CXX object ApiExtractor/CMakeFiles/apiextractor.dir/docparser.cpp.o
[ 22%] Building CXX object ApiExtractor/CMakeFiles/apiextractor.dir/doxygenparser.cpp.o
[ 22%] Building CXX object ApiExtractor/CMakeFiles/apiextractor.dir/qtdocparser.cpp.o
[ 23%] Building CXX object ApiExtractor/CMakeFiles/apiextractor.dir/apiextractor_autogen/mocs_compilation.cpp.o
[ 23%] Linking CXX shared library libsample.so
[ 23%] Linking CXX shared library libshiboken2.cpython-34m.so
[ 23%] Built target libsample
Scanning dependencies of target libother
[ 24%] Building CXX object tests/libother/CMakeFiles/libother.dir/othermultiplederived.cpp.o
[ 24%] Building CXX object tests/libother/CMakeFiles/libother.dir/number.cpp.o
[ 24%] Building CXX object tests/libother/CMakeFiles/libother.dir/otherderived.cpp.o
[ 24%] Building CXX object tests/libother/CMakeFiles/libother.dir/otherobjecttype.cpp.o
[ 24%] Built target libshiboken
[ 24%] Linking CXX shared library libother.so
[ 24%] Built target libother
[ 24%] Linking CXX static library ../tests/libapiextractor.a
[ 24%] Built target apiextractor
Scanning dependencies of target testtyperevision_autogen
Scanning dependencies of target testrefcounttag_autogen
Scanning dependencies of target testconversionruletag_autogen
Scanning dependencies of target testctorinformation_autogen
Scanning dependencies of target testresolvetype_autogen
Scanning dependencies of target testimplicitconversions_autogen
Scanning dependencies of target testremoveoperatormethod_autogen
Scanning dependencies of target testabstractmetaclass_autogen
Scanning dependencies of target testaddfunction_autogen
Scanning dependencies of target testvoidarg_autogen
Scanning dependencies of target testtemplates_autogen
Scanning dependencies of target testreferencetopointer_autogen
Scanning dependencies of target testvaluetypedefaultctortag_autogen
Scanning dependencies of target testdroptypeentries_autogen
Scanning dependencies of target testremoveimplconv_autogen
Scanning dependencies of target testabstractmetatype_autogen
Scanning dependencies of target testenum_autogen
Scanning dependencies of target testreverseoperators_autogen
Scanning dependencies of target testtoposort_autogen
Scanning dependencies of target testarrayargument_autogen
Scanning dependencies of target testconversionoperator_autogen
Scanning dependencies of target testdtorinformation_autogen
Scanning dependencies of target testcontainer_autogen
Scanning dependencies of target testmodifydocumentation_autogen
[ 24%] Automatic MOC for target testtyperevision
[ 24%] Automatic MOC for target testctorinformation
[ 24%] Automatic MOC for target testrefcounttag
[ 24%] Automatic MOC for target testconversionruletag
[ 24%] Automatic MOC for target testremoveimplconv
[ 24%] Automatic MOC for target testresolvetype
[ 24%] Automatic MOC for target testenum
[ 24%] Automatic MOC for target testtemplates
[ 25%] Automatic MOC for target testabstractmetaclass
[ 25%] Automatic MOC for target testreferencetopointer
[ 25%] Automatic MOC for target testimplicitconversions
[ 26%] Automatic MOC for target testaddfunction
[ 27%] Automatic MOC for target testabstractmetatype
[ 27%] Automatic MOC for target testdroptypeentries
[ 27%] Automatic MOC for target testvaluetypedefaultctortag
[ 27%] Automatic MOC for target testconversionoperator
[ 28%] Automatic MOC for target testvoidarg
[ 28%] Automatic MOC for target testcontainer
[ 28%] Automatic MOC for target testremoveoperatormethod
[ 29%] Automatic MOC for target testarrayargument
[ 29%] Automatic MOC for target testmodifydocumentation
[ 29%] Automatic MOC for target testdtorinformation
[ 29%] Automatic MOC for target testtoposort
[ 29%] Automatic MOC for target testreverseoperators
Generating MOC predefs moc_predefs.h
Generating MOC source EWIEGA46WW/moc_testresolvetype.cpp
Generating MOC compilation mocs_compilation.cpp
Generating MOC predefs moc_predefs.h
Generating MOC source EWIEGA46WW/moc_testreferencetopointer.cpp
Generating MOC compilation mocs_compilation.cpp
Generating MOC predefs moc_predefs.h
Generating MOC source EWIEGA46WW/moc_testarrayargument.cpp
Generating MOC compilation mocs_compilation.cpp
Generating MOC predefs moc_predefs.h
Generating MOC source EWIEGA46WW/moc_testaddfunction.cpp
Generating MOC compilation mocs_compilation.cpp
Generating MOC predefs moc_predefs.h
Generating MOC source EWIEGA46WW/moc_testremoveimplconv.cpp
Generating MOC compilation mocs_compilation.cpp
Generating MOC predefs moc_predefs.h
Generating MOC source EWIEGA46WW/moc_testremoveoperatormethod.cpp
Generating MOC compilation mocs_compilation.cpp
Generating MOC predefs moc_predefs.h
Generating MOC source EWIEGA46WW/moc_testabstractmetaclass.cpp
Generating MOC compilation mocs_compilation.cpp
Generating MOC predefs moc_predefs.h
Generating MOC source EWIEGA46WW/moc_testmodifydocumentation.cpp
Generating MOC compilation mocs_compilation.cpp
Generating MOC predefs moc_predefs.h
Generating MOC source EWIEGA46WW/moc_testdtorinformation.cpp
Generating MOC compilation mocs_compilation.cpp
Generating MOC predefs moc_predefs.h
Generating MOC source EWIEGA46WW/moc_testconversionoperator.cpp
Generating MOC compilation mocs_compilation.cpp
Generating MOC predefs moc_predefs.h
Generating MOC source EWIEGA46WW/moc_testcontainer.cpp
Generating MOC compilation mocs_compilation.cpp
Generating MOC predefs moc_predefs.h
Generating MOC source EWIEGA46WW/moc_testrefcounttag.cpp
Generating MOC compilation mocs_compilation.cpp
Generating MOC predefs moc_predefs.h
Generating MOC source EWIEGA46WW/moc_testtoposort.cpp
Generating MOC compilation mocs_compilation.cpp
Generating MOC predefs moc_predefs.h
Generating MOC source EWIEGA46WW/moc_testdroptypeentries.cpp
Generating MOC compilation mocs_compilation.cpp
Generating MOC predefs moc_predefs.h
Generating MOC source EWIEGA46WW/moc_testtemplates.cpp
Generating MOC compilation mocs_compilation.cpp
Generating MOC predefs moc_predefs.h
Generating MOC source EWIEGA46WW/moc_testabstractmetatype.cpp
Generating MOC compilation mocs_compilation.cpp
Generating MOC predefs moc_predefs.h
Generating MOC source EWIEGA46WW/moc_testvaluetypedefaultctortag.cpp
Generating MOC compilation mocs_compilation.cpp
[ 29%] Built target testresolvetype_autogen
Generating MOC predefs moc_predefs.h
Generating MOC source EWIEGA46WW/moc_testenum.cpp
Generating MOC compilation mocs_compilation.cpp
Generating MOC predefs moc_predefs.h
Generating MOC source EWIEGA46WW/moc_testctorinformation.cpp
Generating MOC compilation mocs_compilation.cpp
[ 29%] Built target testreferencetopointer_autogen
[ 29%] Built target testremoveimplconv_autogen
Generating MOC predefs moc_predefs.h
Generating MOC source EWIEGA46WW/moc_testconversionruletag.cpp
Generating MOC compilation mocs_compilation.cpp
[ 29%] Built target testremoveoperatormethod_autogen
Generating MOC predefs moc_predefs.h
Generating MOC source EWIEGA46WW/moc_testtyperevision.cpp
Generating MOC compilation mocs_compilation.cpp
[ 29%] Built target testconversionoperator_autogen
[ 29%] Built target testmodifydocumentation_autogen
Generating MOC predefs moc_predefs.h
Generating MOC source EWIEGA46WW/moc_testimplicitconversions.cpp
Generating MOC compilation mocs_compilation.cpp
[ 29%] Built target testtemplates_autogen
[ 29%] Built target testcontainer_autogen
Generating MOC predefs moc_predefs.h
Generating MOC source EWIEGA46WW/moc_testvoidarg.cpp
Generating MOC compilation mocs_compilation.cpp
[ 29%] Built target testdroptypeentries_autogen
[ 29%] Built target testrefcounttag_autogen
[ 29%] Built target testtoposort_autogen
[ 29%] Built target testdtorinformation_autogen
[ 29%] Built target testvaluetypedefaultctortag_autogen
[ 29%] Built target testctorinformation_autogen
[ 29%] Built target testenum_autogen
[ 29%] Built target testconversionruletag_autogen
Generating MOC predefs moc_predefs.h
Generating MOC source EWIEGA46WW/moc_testreverseoperators.cpp
Generating MOC compilation mocs_compilation.cpp
[ 29%] Built target testtyperevision_autogen
Scanning dependencies of target testnamespace_autogen
[ 29%] Built target testarrayargument_autogen
Scanning dependencies of target testmultipleinheritance_autogen
[ 29%] Built target testimplicitconversions_autogen
Scanning dependencies of target testextrainclude_autogen
Scanning dependencies of target testmodifyfunction_autogen
Scanning dependencies of target testremovefield_autogen
Scanning dependencies of target testcodeinjection_autogen
Scanning dependencies of target testfunctiontag_autogen
[ 29%] Built target testvoidarg_autogen
Scanning dependencies of target testinserttemplate_autogen
[ 29%] Built target testreverseoperators_autogen
Scanning dependencies of target testprimitivetypetag_autogen
Scanning dependencies of target testnumericaltypedef_autogen
Scanning dependencies of target testnestedtypes_autogen
[ 29%] Built target testabstractmetaclass_autogen
[ 29%] Built target testabstractmetatype_autogen
[ 29%] Automatic MOC for target testmodifyfunction
[ 30%] Automatic MOC for target testcodeinjection
[ 30%] Automatic MOC for target testremovefield
[ 30%] Automatic MOC for target testnamespace
[ 30%] Automatic MOC for target testfunctiontag
[ 30%] Automatic MOC for target testmultipleinheritance
[ 30%] Automatic MOC for target testextrainclude
[ 30%] Automatic MOC for target testinserttemplate
[ 30%] Built target testaddfunction_autogen
[ 30%] Automatic MOC for target testprimitivetypetag
Scanning dependencies of target dumpcodemodel
[ 30%] Automatic MOC for target testnestedtypes
[ 30%] Automatic MOC for target testnumericaltypedef
[ 30%] Building CXX object tests/dumpcodemodel/CMakeFiles/dumpcodemodel.dir/main.cpp.o
Scanning dependencies of target shiboken2
[ 30%] Building CXX object generator/CMakeFiles/shiboken2.dir/generator.cpp.o
Generating MOC predefs moc_predefs.h
Generating MOC source EWIEGA46WW/moc_testnamespace.cpp
Generating MOC compilation mocs_compilation.cpp
Generating MOC predefs moc_predefs.h
Generating MOC source EWIEGA46WW/moc_testmodifyfunction.cpp
Generating MOC compilation mocs_compilation.cpp
Generating MOC predefs moc_predefs.h
Generating MOC source EWIEGA46WW/moc_testextrainclude.cpp
Generating MOC compilation mocs_compilation.cpp
Generating MOC predefs moc_predefs.h
Generating MOC source EWIEGA46WW/moc_testmultipleinheritance.cpp
Generating MOC compilation mocs_compilation.cpp
Generating MOC predefs moc_predefs.h
Generating MOC source EWIEGA46WW/moc_testremovefield.cpp
Generating MOC compilation mocs_compilation.cpp
Generating MOC predefs moc_predefs.h
Generating MOC source EWIEGA46WW/moc_testcodeinjection.cpp
Generating MOC compilation mocs_compilation.cpp
Generating MOC predefs moc_predefs.h
Generating MOC source EWIEGA46WW/moc_testfunctiontag.cpp
Generating MOC compilation mocs_compilation.cpp
Generating MOC predefs moc_predefs.h
Generating MOC source EWIEGA46WW/moc_testprimitivetypetag.cpp
Generating MOC compilation mocs_compilation.cpp
Generating MOC predefs moc_predefs.h
Generating MOC source EWIEGA46WW/moc_testnestedtypes.cpp
Generating MOC compilation mocs_compilation.cpp
Generating MOC predefs moc_predefs.h
Generating MOC source EWIEGA46WW/moc_testnumericaltypedef.cpp
Generating MOC compilation mocs_compilation.cpp
Generating MOC predefs moc_predefs.h
Generating MOC source EWIEGA46WW/moc_testinserttemplate.cpp
Generating MOC compilation mocs_compilation.cpp
[ 30%] Built target testmodifyfunction_autogen
[ 30%] Built target testnamespace_autogen
[ 30%] Built target testmultipleinheritance_autogen
[ 30%] Built target testextrainclude_autogen
[ 30%] Built target testcodeinjection_autogen
[ 30%] Built target testremovefield_autogen
[ 30%] Built target testfunctiontag_autogen
[ 30%] Built target testprimitivetypetag_autogen
[ 30%] Built target testnumericaltypedef_autogen
[ 30%] Built target testnestedtypes_autogen
[ 30%] Built target testinserttemplate_autogen
[ 30%] Building CXX object generator/CMakeFiles/shiboken2.dir/shiboken2/cppgenerator.cpp.o
[ 31%] Building CXX object generator/CMakeFiles/shiboken2.dir/shiboken2/headergenerator.cpp.o
[ 31%] Building CXX object generator/CMakeFiles/shiboken2.dir/shiboken2/overloaddata.cpp.o
[ 31%] Building CXX object generator/CMakeFiles/shiboken2.dir/shiboken2/shibokengenerator.cpp.o
[ 31%] Building CXX object generator/CMakeFiles/shiboken2.dir/main.cpp.o
Scanning dependencies of target testctorinformation
Scanning dependencies of target testrefcounttag
Scanning dependencies of target testconversionruletag
Scanning dependencies of target testmodifydocumentation
Scanning dependencies of target testtoposort
Scanning dependencies of target testresolvetype
Scanning dependencies of target testdroptypeentries
Scanning dependencies of target testreferencetopointer
Scanning dependencies of target testimplicitconversions
Scanning dependencies of target testreverseoperators
Scanning dependencies of target testabstractmetaclass
Scanning dependencies of target testremoveimplconv
Scanning dependencies of target testabstractmetatype
Scanning dependencies of target testconversionoperator
Scanning dependencies of target testremoveoperatormethod
Scanning dependencies of target testvaluetypedefaultctortag
Scanning dependencies of target testtemplates
[ 32%] Building CXX object ApiExtractor/tests/CMakeFiles/testresolvetype.dir/testresolvetype.cpp.o
[ 32%] Building CXX object ApiExtractor/tests/CMakeFiles/testrefcounttag.dir/testrefcounttag.cpp.o
[ 32%] Building CXX object ApiExtractor/tests/CMakeFiles/testabstractmetatype.dir/testabstractmetatype.cpp.o
[ 32%] Building CXX object ApiExtractor/tests/CMakeFiles/testreferencetopointer.dir/testreferencetopointer.cpp.o
[ 32%] Building CXX object ApiExtractor/tests/CMakeFiles/testconversionruletag.dir/testconversionruletag.cpp.o
[ 32%] Building CXX object ApiExtractor/tests/CMakeFiles/testdroptypeentries.dir/testdroptypeentries.cpp.o
[ 33%] Building CXX object ApiExtractor/tests/CMakeFiles/testreverseoperators.dir/testreverseoperators.cpp.o
[ 33%] Building CXX object ApiExtractor/tests/CMakeFiles/testctorinformation.dir/testctorinformation.cpp.o
[ 33%] Building CXX object ApiExtractor/tests/CMakeFiles/testabstractmetaclass.dir/testabstractmetaclass.cpp.o
[ 34%] Building CXX object ApiExtractor/tests/CMakeFiles/testremoveoperatormethod.dir/testremoveoperatormethod.cpp.o
[ 34%] Building CXX object ApiExtractor/tests/CMakeFiles/testmodifydocumentation.dir/testmodifydocumentation.cpp.o
[ 35%] Building CXX object ApiExtractor/tests/CMakeFiles/testtemplates.dir/testtemplates.cpp.o
[ 36%] Building CXX object ApiExtractor/tests/CMakeFiles/testremoveimplconv.dir/testremoveimplconv.cpp.o
[ 36%] Building CXX object ApiExtractor/tests/CMakeFiles/testimplicitconversions.dir/testimplicitconversions.cpp.o
[ 37%] Building CXX object ApiExtractor/tests/CMakeFiles/testvaluetypedefaultctortag.dir/testvaluetypedefaultctortag.cpp.o
[ 38%] Building CXX object ApiExtractor/tests/CMakeFiles/testtoposort.dir/testtoposort.cpp.o
[ 38%] Building CXX object ApiExtractor/tests/CMakeFiles/testconversionoperator.dir/testconversionoperator.cpp.o
[ 39%] Linking CXX executable dumpcodemodel
[ 39%] Building CXX object ApiExtractor/tests/CMakeFiles/testremoveimplconv.dir/testremoveimplconv_autogen/mocs_compilation.cpp.o
[ 40%] Building CXX object ApiExtractor/tests/CMakeFiles/testreferencetopointer.dir/testreferencetopointer_autogen/mocs_compilation.cpp.o
[ 40%] Building CXX object ApiExtractor/tests/CMakeFiles/testvaluetypedefaultctortag.dir/testvaluetypedefaultctortag_autogen/mocs_compilation.cpp.o
[ 40%] Building CXX object ApiExtractor/tests/CMakeFiles/testctorinformation.dir/testctorinformation_autogen/mocs_compilation.cpp.o
[ 40%] Building CXX object ApiExtractor/tests/CMakeFiles/testresolvetype.dir/testresolvetype_autogen/mocs_compilation.cpp.o
[ 40%] Building CXX object ApiExtractor/tests/CMakeFiles/testtoposort.dir/testtoposort_autogen/mocs_compilation.cpp.o
[ 40%] Building CXX object ApiExtractor/tests/CMakeFiles/testabstractmetaclass.dir/testabstractmetaclass_autogen/mocs_compilation.cpp.o
[ 40%] Building CXX object ApiExtractor/tests/CMakeFiles/testtemplates.dir/testtemplates_autogen/mocs_compilation.cpp.o
[ 40%] Building CXX object ApiExtractor/tests/CMakeFiles/testconversionruletag.dir/testconversionruletag_autogen/mocs_compilation.cpp.o
[ 40%] Linking CXX executable testresolvetype
[ 40%] Linking CXX executable testreferencetopointer
[ 40%] Linking CXX executable testtoposort
[ 41%] Building CXX object ApiExtractor/tests/CMakeFiles/testrefcounttag.dir/testrefcounttag_autogen/mocs_compilation.cpp.o
[ 41%] Building CXX object ApiExtractor/tests/CMakeFiles/testabstractmetatype.dir/testabstractmetatype_autogen/mocs_compilation.cpp.o
[ 41%] Linking CXX executable testabstractmetaclass
[ 41%] Building CXX object ApiExtractor/tests/CMakeFiles/testconversionoperator.dir/testconversionoperator_autogen/mocs_compilation.cpp.o
[ 41%] Linking CXX executable testvaluetypedefaultctortag
[ 41%] Built target dumpcodemodel
[ 42%] Building CXX object ApiExtractor/tests/CMakeFiles/testmodifydocumentation.dir/testmodifydocumentation_autogen/mocs_compilation.cpp.o
[ 43%] Building CXX object generator/CMakeFiles/shiboken2.dir/qtdoc/qtdocgenerator.cpp.o
[ 43%] Linking CXX executable testremoveimplconv
[ 43%] Building CXX object ApiExtractor/tests/CMakeFiles/testreverseoperators.dir/testreverseoperators_autogen/mocs_compilation.cpp.o
[ 43%] Built target testresolvetype
[ 43%] Building CXX object ApiExtractor/tests/CMakeFiles/testdroptypeentries.dir/testdroptypeentries_autogen/mocs_compilation.cpp.o
[ 44%] Linking CXX executable testctorinformation
[ 44%] Built target testtoposort
[ 45%] Linking CXX executable testconversionruletag
[ 45%] Building CXX object ApiExtractor/tests/CMakeFiles/testimplicitconversions.dir/testimplicitconversions_autogen/mocs_compilation.cpp.o
[ 45%] Built target testreferencetopointer
Scanning dependencies of target testaddfunction
[ 45%] Building CXX object ApiExtractor/tests/CMakeFiles/testremoveoperatormethod.dir/testremoveoperatormethod_autogen/mocs_compilation.cpp.o
[ 45%] Building CXX object ApiExtractor/tests/CMakeFiles/testaddfunction.dir/testaddfunction.cpp.o
[ 45%] Linking CXX executable testtemplates
[ 45%] Building CXX object ApiExtractor/tests/CMakeFiles/testaddfunction.dir/testaddfunction_autogen/mocs_compilation.cpp.o
[ 45%] Built target testremoveimplconv
[ 45%] Built target testvaluetypedefaultctortag
Scanning dependencies of target testcontainer
[ 45%] Building CXX object ApiExtractor/tests/CMakeFiles/testcontainer.dir/testcontainer.cpp.o
[ 45%] Built target testabstractmetaclass
Scanning dependencies of target testdtorinformation
Scanning dependencies of target testarrayargument
[ 45%] Building CXX object ApiExtractor/tests/CMakeFiles/testcontainer.dir/testcontainer_autogen/mocs_compilation.cpp.o
[ 45%] Building CXX object ApiExtractor/tests/CMakeFiles/testdtorinformation.dir/testdtorinformation.cpp.o
[ 45%] Building CXX object ApiExtractor/tests/CMakeFiles/testarrayargument.dir/testarrayargument.cpp.o
[ 45%] Building CXX object ApiExtractor/tests/CMakeFiles/testarrayargument.dir/testarrayargument_autogen/mocs_compilation.cpp.o
[ 45%] Building CXX object ApiExtractor/tests/CMakeFiles/testdtorinformation.dir/testdtorinformation_autogen/mocs_compilation.cpp.o
[ 45%] Built target testtemplates
[ 45%] Built target testctorinformation
Scanning dependencies of target testenum
[ 45%] Building CXX object ApiExtractor/tests/CMakeFiles/testenum.dir/testenum.cpp.o
Scanning dependencies of target testmultipleinheritance
[ 45%] Linking CXX executable testreverseoperators
[ 45%] Building CXX object ApiExtractor/tests/CMakeFiles/testmultipleinheritance.dir/testmultipleinheritance.cpp.o
[ 45%] Built target testconversionruletag
[ 46%] Building CXX object ApiExtractor/tests/CMakeFiles/testmultipleinheritance.dir/testmultipleinheritance_autogen/mocs_compilation.cpp.o
[ 46%] Linking CXX executable testabstractmetatype
[ 47%] Linking CXX executable testdroptypeentries
[ 47%] Linking CXX executable testrefcounttag
[ 47%] Linking CXX executable testmodifydocumentation
Scanning dependencies of target testextrainclude
Scanning dependencies of target testnamespace
[ 47%] Building CXX object ApiExtractor/tests/CMakeFiles/testextrainclude.dir/testextrainclude.cpp.o
[ 47%] Building CXX object ApiExtractor/tests/CMakeFiles/testnamespace.dir/testnamespace.cpp.o
[ 47%] Built target testreverseoperators
[ 48%] Building CXX object ApiExtractor/tests/CMakeFiles/testnamespace.dir/testnamespace_autogen/mocs_compilation.cpp.o
Scanning dependencies of target testcodeinjection
[ 49%] Linking CXX executable testconversionoperator
[ 49%] Built target testabstractmetatype
[ 49%] Building CXX object ApiExtractor/tests/CMakeFiles/testcodeinjection.dir/testcodeinjection.cpp.o
[ 49%] Building CXX object ApiExtractor/tests/CMakeFiles/testenum.dir/testenum_autogen/mocs_compilation.cpp.o
[ 49%] Building CXX object ApiExtractor/tests/CMakeFiles/testextrainclude.dir/testextrainclude_autogen/mocs_compilation.cpp.o
[ 50%] Linking CXX executable testimplicitconversions
Scanning dependencies of target testmodifyfunction
[ 50%] Building CXX object ApiExtractor/tests/CMakeFiles/testmodifyfunction.dir/testmodifyfunction.cpp.o
[ 50%] Built target testrefcounttag
[ 51%] Building CXX object ApiExtractor/tests/CMakeFiles/testmodifyfunction.dir/testmodifyfunction_autogen/mocs_compilation.cpp.o
[ 51%] Built target testdroptypeentries
[ 51%] Linking CXX executable testremoveoperatormethod
[ 51%] Built target testmodifydocumentation
[ 51%] Built target testconversionoperator
[ 51%] Building CXX object ApiExtractor/tests/CMakeFiles/testcodeinjection.dir/testcodeinjection_autogen/mocs_compilation.cpp.o
Scanning dependencies of target testremovefield
Scanning dependencies of target testinserttemplate
[ 52%] Building CXX object ApiExtractor/tests/CMakeFiles/testremovefield.dir/testremovefield.cpp.o
Scanning dependencies of target testfunctiontag
[ 52%] Building CXX object ApiExtractor/tests/CMakeFiles/testremovefield.dir/testremovefield_autogen/mocs_compilation.cpp.o
[ 52%] Building CXX object ApiExtractor/tests/CMakeFiles/testinserttemplate.dir/testinserttemplate.cpp.o
[ 52%] Built target testimplicitconversions
[ 52%] Building CXX object ApiExtractor/tests/CMakeFiles/testfunctiontag.dir/testfunctiontag.cpp.o
[ 53%] Building CXX object ApiExtractor/tests/CMakeFiles/testinserttemplate.dir/testinserttemplate_autogen/mocs_compilation.cpp.o
[ 54%] Linking CXX executable testcontainer
Scanning dependencies of target testnestedtypes
Scanning dependencies of target testnumericaltypedef
[ 54%] Building CXX object ApiExtractor/tests/CMakeFiles/testnestedtypes.dir/testnestedtypes.cpp.o
[ 54%] Building CXX object ApiExtractor/tests/CMakeFiles/testfunctiontag.dir/testfunctiontag_autogen/mocs_compilation.cpp.o
[ 54%] Built target testremoveoperatormethod
[ 54%] Building CXX object ApiExtractor/tests/CMakeFiles/testnumericaltypedef.dir/testnumericaltypedef.cpp.o
[ 55%] Building CXX object ApiExtractor/tests/CMakeFiles/testnestedtypes.dir/testnestedtypes_autogen/mocs_compilation.cpp.o
[ 55%] Built target testcontainer
[ 56%] Building CXX object ApiExtractor/tests/CMakeFiles/testnumericaltypedef.dir/testnumericaltypedef_autogen/mocs_compilation.cpp.o
[ 57%] Linking CXX executable testenum
Scanning dependencies of target testprimitivetypetag
[ 57%] Building CXX object ApiExtractor/tests/CMakeFiles/testprimitivetypetag.dir/testprimitivetypetag.cpp.o
[ 58%] Building CXX object ApiExtractor/tests/CMakeFiles/testprimitivetypetag.dir/testprimitivetypetag_autogen/mocs_compilation.cpp.o
[ 58%] Linking CXX executable testnamespace
[ 58%] Built target testenum
Scanning dependencies of target testtyperevision
Scanning dependencies of target testvoidarg
[ 59%] Building CXX object ApiExtractor/tests/CMakeFiles/testvoidarg.dir/testvoidarg.cpp.o
[ 60%] Building CXX object ApiExtractor/tests/CMakeFiles/testtyperevision.dir/testtyperevision.cpp.o
[ 60%] Building CXX object ApiExtractor/tests/CMakeFiles/testtyperevision.dir/testtyperevision_autogen/mocs_compilation.cpp.o
[ 60%] Building CXX object ApiExtractor/tests/CMakeFiles/testvoidarg.dir/testvoidarg_autogen/mocs_compilation.cpp.o
[ 60%] Linking CXX executable testaddfunction
[ 60%] Built target testnamespace
[ 60%] Linking CXX executable testmultipleinheritance
[ 60%] Linking CXX executable testinserttemplate
[ 60%] Built target testaddfunction
[ 60%] Linking CXX executable testnestedtypes
[ 60%] Linking CXX executable testarrayargument
[ 60%] Built target testmultipleinheritance
[ 61%] Linking CXX executable testdtorinformation
[ 61%] Built target testnestedtypes
[ 61%] Built target testinserttemplate
[ 61%] Linking CXX executable testremovefield
[ 61%] Linking CXX executable testprimitivetypetag
[ 62%] Linking CXX executable testextrainclude
[ 62%] Built target testarrayargument
[ 62%] Linking CXX executable testnumericaltypedef
[ 62%] Linking CXX executable testvoidarg
[ 62%] Built target testremovefield
[ 62%] Built target testnumericaltypedef
[ 62%] Built target testprimitivetypetag
[ 62%] Built target testextrainclude
[ 62%] Built target testvoidarg
[ 62%] Built target testdtorinformation
[ 62%] Linking CXX executable testcodeinjection
[ 63%] Linking CXX executable testfunctiontag
[ 63%] Linking CXX executable testtyperevision
[ 63%] Built target testcodeinjection
[ 63%] Built target testfunctiontag
[ 63%] Linking CXX executable testmodifyfunction
[ 63%] Built target testtyperevision
[ 63%] Built target testmodifyfunction
[ 63%] Linking CXX executable shiboken2
[ 63%] Built target shiboken2
[ 63%] Running generator for 'shiboken2'...
[ 63%] Running generator for 'smart' test binding...
[ 63%] Running generator for 'minimal' test binding...
[ 63%] Running generator for 'sample' test binding...
(sample) clang_parseTranslationUnit2(0x0, cmd[6]=-std=c++14 -fPIC -fno-exceptions -Wno-constant-logical-operand -I/user_data/.tmp/scratch-3NtfLe/build/sources/shiboken2/tests/libsample /user_data/.tmp/scratch-3NtfLe/tmp/global_J25535.hpp)
(minimal) clang_parseTranslationUnit2(0x0, cmd[6]=-std=c++14 -fPIC -fno-exceptions -Wno-constant-logical-operand -I/user_data/.tmp/scratch-3NtfLe/build/sources/shiboken2/tests/libminimal /user_data/.tmp/scratch-3NtfLe/tmp/global_J25533.hpp)
(smart) clang_parseTranslationUnit2(0x0, cmd[6]=-std=c++14 -fPIC -fno-exceptions -Wno-constant-logical-operand -I/user_data/.tmp/scratch-3NtfLe/build/sources/shiboken2/tests/libsmart /user_data/.tmp/scratch-3NtfLe/tmp/global_J25532.hpp)
(shiboken) clang_parseTranslationUnit2(0x0, cmd[5]=-std=c++14 -fPIC -fno-exceptions -Wno-constant-logical-operand /user_data/.tmp/scratch-3NtfLe/tmp/nothing_J25531.hpp)
Detecting inconsistencies in typesystem... [OK]
qt.shiboken: (shiboken) No C++ classes found!
Done, 181ms, 1 warnings
Scanning dependencies of target shibokenmodule
[ 63%] Building CXX object shibokenmodule/CMakeFiles/shibokenmodule.dir/shiboken2/shiboken2_module_wrapper.cpp.o
Generating class model... [OK]
Resolving typedefs... [OK]
Fixing class inheritance... [OK]
Detecting inconsistencies in class model... [OK]
[OK]
Done, 365ms
Scanning dependencies of target minimal
[ 63%] Building CXX object tests/minimalbinding/CMakeFiles/minimal.dir/minimal/minimal_module_wrapper.cpp.o
[ 63%] Building CXX object tests/minimalbinding/CMakeFiles/minimal.dir/minimal/val_wrapper.cpp.o
[ 64%] Building CXX object tests/minimalbinding/CMakeFiles/minimal.dir/minimal/obj_wrapper.cpp.o
[ 64%] Building CXX object tests/minimalbinding/CMakeFiles/minimal.dir/minimal/minbooluser_wrapper.cpp.o
[ 64%] Building CXX object tests/minimalbinding/CMakeFiles/minimal.dir/minimal/listuser_wrapper.cpp.o
/usr/include/stdlib.h:33:10: fatal error: 'stddef.h' file not found
(smart) Errors in /user_data/.tmp/scratch-3NtfLe/tmp/global_J25532.hpp:
/usr/include/stdlib.h:33:10: fatal: 'stddef.h' file not found
/user_data/.tmp/scratch-3NtfLe/tmp/global_J25532.hpp:1:10: note: in file included from /user_data/.tmp/scratch-3NtfLe/tmp/global_J25532.hpp:1:
/user_data/.tmp/scratch-3NtfLe/build/sources/shiboken2/tests/smartbinding/global.h:29:10: note: in file included from /user_data/.tmp/scratch-3NtfLe/build/sources/shiboken2/tests/smartbinding/global.h:29:
/user_data/.tmp/scratch-3NtfLe/build/sources/shiboken2/tests/libsmart/smart.h:32:10: note: in file included from /user_data/.tmp/scratch-3NtfLe/build/sources/shiboken2/tests/libsmart/smart.h:32:
/builds/gcc/6.4.0/6359df24a4/lib/gcc/x86_64-pc-linux-gnu/6.4.0/../../../../include/c++/6.4.0/algorithm:62:10: note: in file included from /builds/gcc/6.4.0/6359df24a4/lib/gcc/x86_64-pc-linux-gnu/6.4.0/../../../../include/c++/6.4.0/algorithm:62:
/builds/gcc/6.4.0/6359df24a4/lib/gcc/x86_64-pc-linux-gnu/6.4.0/../../../../include/c++/6.4.0/bits/stl_algo.h:59:10: note: in file included from /builds/gcc/6.4.0/6359df24a4/lib/gcc/x86_64-pc-linux-gnu/6.4.0/../../../../include/c++/6.4.0/bits/stl_algo.h:59:
/builds/gcc/6.4.0/6359df24a4/lib/gcc/x86_64-pc-linux-gnu/6.4.0/../../../../include/c++/6.4.0/cstdlib:75:15: note: in file included from /builds/gcc/6.4.0/6359df24a4/lib/gcc/x86_64-pc-linux-gnu/6.4.0/../../../../include/c++/6.4.0/cstdlib:75:
(smart) Clang: 1 diagnostic messages:
/usr/include/stdlib.h:33:10: fatal: 'stddef.h' file not found
/user_data/.tmp/scratch-3NtfLe/tmp/global_J25532.hpp:1:10: note: in file included from /user_data/.tmp/scratch-3NtfLe/tmp/global_J25532.hpp:1:
/user_data/.tmp/scratch-3NtfLe/build/sources/shiboken2/tests/smartbinding/global.h:29:10: note: in file included from /user_data/.tmp/scratch-3NtfLe/build/sources/shiboken2/tests/smartbinding/global.h:29:
/user_data/.tmp/scratch-3NtfLe/build/sources/shiboken2/tests/libsmart/smart.h:32:10: note: in file included from /user_data/.tmp/scratch-3NtfLe/build/sources/shiboken2/tests/libsmart/smart.h:32:
/builds/gcc/6.4.0/6359df24a4/lib/gcc/x86_64-pc-linux-gnu/6.4.0/../../../../include/c++/6.4.0/algorithm:62:10: note: in file included from /builds/gcc/6.4.0/6359df24a4/lib/gcc/x86_64-pc-linux-gnu/6.4.0/../../../../include/c++/6.4.0/algorithm:62:
/builds/gcc/6.4.0/6359df24a4/lib/gcc/x86_64-pc-linux-gnu/6.4.0/../../../../include/c++/6.4.0/bits/stl_algo.h:59:10: note: in file included from /builds/gcc/6.4.0/6359df24a4/lib/gcc/x86_64-pc-linux-gnu/6.4.0/../../../../include/c++/6.4.0/bits/stl_algo.h:59:
/builds/gcc/6.4.0/6359df24a4/lib/gcc/x86_64-pc-linux-gnu/6.4.0/../../../../include/c++/6.4.0/cstdlib:75:15: note: in file included from /builds/gcc/6.4.0/6359df24a4/lib/gcc/x86_64-pc-linux-gnu/6.4.0/../../../../include/c++/6.4.0/cstdlib:75:
Keeping temporary file: /user_data/.tmp/scratch-3NtfLe/tmp/global_J25532.hpp
shiboken: Error running ApiExtractor.
Command line: --project-file=/user_data/.tmp/scratch-3NtfLe/build/sources/shiboken2/___build/tests/smartbinding/smart-binding.txt
make[2]: *** [tests/smartbinding/smart/smart_module_wrapper.cpp] Error 1
make[1]: *** [tests/smartbinding/CMakeFiles/smart.dir/all] Error 2
make[1]: *** Waiting for unfinished jobs....
/usr/include/wchar.h:40:11: fatal error: 'stdarg.h' file not found
(sample) Errors in /user_data/.tmp/scratch-3NtfLe/tmp/global_J25535.hpp:
/usr/include/wchar.h:40:11: fatal: 'stdarg.h' file not found
/user_data/.tmp/scratch-3NtfLe/tmp/global_J25535.hpp:1:10: note: in file included from /user_data/.tmp/scratch-3NtfLe/tmp/global_J25535.hpp:1:
/user_data/.tmp/scratch-3NtfLe/build/sources/shiboken2/tests/samplebinding/global.h:30:10: note: in file included from /user_data/.tmp/scratch-3NtfLe/build/sources/shiboken2/tests/samplebinding/global.h:30:
/user_data/.tmp/scratch-3NtfLe/build/sources/shiboken2/tests/libsample/blackbox.h:33:10: note: in file included from /user_data/.tmp/scratch-3NtfLe/build/sources/shiboken2/tests/libsample/blackbox.h:33:
/builds/gcc/6.4.0/6359df24a4/lib/gcc/x86_64-pc-linux-gnu/6.4.0/../../../../include/c++/6.4.0/map:61:10: note: in file included from /builds/gcc/6.4.0/6359df24a4/lib/gcc/x86_64-pc-linux-gnu/6.4.0/../../../../include/c++/6.4.0/map:61:
/builds/gcc/6.4.0/6359df24a4/lib/gcc/x86_64-pc-linux-gnu/6.4.0/../../../../include/c++/6.4.0/bits/stl_map.h:63:10: note: in file included from /builds/gcc/6.4.0/6359df24a4/lib/gcc/x86_64-pc-linux-gnu/6.4.0/../../../../include/c++/6.4.0/bits/stl_map.h:63:
/builds/gcc/6.4.0/6359df24a4/lib/gcc/x86_64-pc-linux-gnu/6.4.0/../../../../include/c++/6.4.0/tuple:39:10: note: in file included from /builds/gcc/6.4.0/6359df24a4/lib/gcc/x86_64-pc-linux-gnu/6.4.0/../../../../include/c++/6.4.0/tuple:39:
/builds/gcc/6.4.0/6359df24a4/lib/gcc/x86_64-pc-linux-gnu/6.4.0/../../../../include/c++/6.4.0/array:39:10: note: in file included from /builds/gcc/6.4.0/6359df24a4/lib/gcc/x86_64-pc-linux-gnu/6.4.0/../../../../include/c++/6.4.0/array:39:
/builds/gcc/6.4.0/6359df24a4/lib/gcc/x86_64-pc-linux-gnu/6.4.0/../../../../include/c++/6.4.0/stdexcept:39:10: note: in file included from /builds/gcc/6.4.0/6359df24a4/lib/gcc/x86_64-pc-linux-gnu/6.4.0/../../../../include/c++/6.4.0/stdexcept:39:
/builds/gcc/6.4.0/6359df24a4/lib/gcc/x86_64-pc-linux-gnu/6.4.0/../../../../include/c++/6.4.0/string:40:10: note: in file included from /builds/gcc/6.4.0/6359df24a4/lib/gcc/x86_64-pc-linux-gnu/6.4.0/../../../../include/c++/6.4.0/string:40:
/builds/gcc/6.4.0/6359df24a4/lib/gcc/x86_64-pc-linux-gnu/6.4.0/../../../../include/c++/6.4.0/bits/char_traits.h:40:10: note: in file included from /builds/gcc/6.4.0/6359df24a4/lib/gcc/x86_64-pc-linux-gnu/6.4.0/../../../../include/c++/6.4.0/bits/char_traits.h:40:
/builds/gcc/6.4.0/6359df24a4/lib/gcc/x86_64-pc-linux-gnu/6.4.0/../../../../include/c++/6.4.0/bits/postypes.h:40:10: note: in file included from /builds/gcc/6.4.0/6359df24a4/lib/gcc/x86_64-pc-linux-gnu/6.4.0/../../../../include/c++/6.4.0/bits/postypes.h:40:
/builds/gcc/6.4.0/6359df24a4/lib/gcc/x86_64-pc-linux-gnu/6.4.0/../../../../include/c++/6.4.0/cwchar:44:10: note: in file included from /builds/gcc/6.4.0/6359df24a4/lib/gcc/x86_64-pc-linux-gnu/6.4.0/../../../../include/c++/6.4.0/cwchar:44:
(sample) Clang: 1 diagnostic messages:
/usr/include/wchar.h:40:11: fatal: 'stdarg.h' file not found
/user_data/.tmp/scratch-3NtfLe/tmp/global_J25535.hpp:1:10: note: in file included from /user_data/.tmp/scratch-3NtfLe/tmp/global_J25535.hpp:1:
/user_data/.tmp/scratch-3NtfLe/build/sources/shiboken2/tests/samplebinding/global.h:30:10: note: in file included from /user_data/.tmp/scratch-3NtfLe/build/sources/shiboken2/tests/samplebinding/global.h:30:
/user_data/.tmp/scratch-3NtfLe/build/sources/shiboken2/tests/libsample/blackbox.h:33:10: note: in file included from /user_data/.tmp/scratch-3NtfLe/build/sources/shiboken2/tests/libsample/blackbox.h:33:
/builds/gcc/6.4.0/6359df24a4/lib/gcc/x86_64-pc-linux-gnu/6.4.0/../../../../include/c++/6.4.0/map:61:10: note: in file included from /builds/gcc/6.4.0/6359df24a4/lib/gcc/x86_64-pc-linux-gnu/6.4.0/../../../../include/c++/6.4.0/map:61:
/builds/gcc/6.4.0/6359df24a4/lib/gcc/x86_64-pc-linux-gnu/6.4.0/../../../../include/c++/6.4.0/bits/stl_map.h:63:10: note: in file included from /builds/gcc/6.4.0/6359df24a4/lib/gcc/x86_64-pc-linux-gnu/6.4.0/../../../../include/c++/6.4.0/bits/stl_map.h:63:
/builds/gcc/6.4.0/6359df24a4/lib/gcc/x86_64-pc-linux-gnu/6.4.0/../../../../include/c++/6.4.0/tuple:39:10: note: in file included from /builds/gcc/6.4.0/6359df24a4/lib/gcc/x86_64-pc-linux-gnu/6.4.0/../../../../include/c++/6.4.0/tuple:39:
/builds/gcc/6.4.0/6359df24a4/lib/gcc/x86_64-pc-linux-gnu/6.4.0/../../../../include/c++/6.4.0/array:39:10: note: in file included from /builds/gcc/6.4.0/6359df24a4/lib/gcc/x86_64-pc-linux-gnu/6.4.0/../../../../include/c++/6.4.0/array:39:
/builds/gcc/6.4.0/6359df24a4/lib/gcc/x86_64-pc-linux-gnu/6.4.0/../../../../include/c++/6.4.0/stdexcept:39:10: note: in file included from /builds/gcc/6.4.0/6359df24a4/lib/gcc/x86_64-pc-linux-gnu/6.4.0/../../../../include/c++/6.4.0/stdexcept:39:
/builds/gcc/6.4.0/6359df24a4/lib/gcc/x86_64-pc-linux-gnu/6.4.0/../../../../include/c++/6.4.0/string:40:10: note: in file included from /builds/gcc/6.4.0/6359df24a4/lib/gcc/x86_64-pc-linux-gnu/6.4.0/../../../../include/c++/6.4.0/string:40:
/builds/gcc/6.4.0/6359df24a4/lib/gcc/x86_64-pc-linux-gnu/6.4.0/../../../../include/c++/6.4.0/bits/char_traits.h:40:10: note: in file included from /builds/gcc/6.4.0/6359df24a4/lib/gcc/x86_64-pc-linux-gnu/6.4.0/../../../../include/c++/6.4.0/bits/char_traits.h:40:
/builds/gcc/6.4.0/6359df24a4/lib/gcc/x86_64-pc-linux-gnu/6.4.0/../../../../include/c++/6.4.0/bits/postypes.h:40:10: note: in file included from /builds/gcc/6.4.0/6359df24a4/lib/gcc/x86_64-pc-linux-gnu/6.4.0/../../../../include/c++/6.4.0/bits/postypes.h:40:
/builds/gcc/6.4.0/6359df24a4/lib/gcc/x86_64-pc-linux-gnu/6.4.0/../../../../include/c++/6.4.0/cwchar:44:10: note: in file included from /builds/gcc/6.4.0/6359df24a4/lib/gcc/x86_64-pc-linux-gnu/6.4.0/../../../../include/c++/6.4.0/cwchar:44:
Keeping temporary file: /user_data/.tmp/scratch-3NtfLe/tmp/global_J25535.hpp
shiboken: Error running ApiExtractor.
Command line: --project-file=/user_data/.tmp/scratch-3NtfLe/build/sources/shiboken2/___build/tests/samplebinding/sample-binding.txt
make[2]: *** [tests/samplebinding/sample/abstractmodifications_wrapper.cpp] Error 1
make[1]: *** [tests/samplebinding/CMakeFiles/sample.dir/all] Error 2
[ 65%] Linking CXX shared module shiboken2.cpython-34m.so
[ 65%] Built target shibokenmodule
[ 66%] Linking CXX shared module minimal.cpython-34m.so
[ 66%] Built target minimal
make: *** [all] Error 2
Sign up for free to join this conversation on GitHub. Already have an account? Sign in to comment
You can’t perform that action at this time.