Skip to content

Instantly share code, notes, and snippets.

Embed
What would you like to do?
Build Log
Building Solution: TestiOSApp (Release|iPhone)
Build started 2/6/2018 3:43:59 PM.
__________________________________________________
Project "/Users/xamarinqa/Projects/TestiOSApp/TestiOSApp.TestWatchExtension/TestiOSApp.TestWatchExtension.csproj" (Build target(s)):
Target _DetectSigningIdentity:
Multiple provisioning profiles match the bundle identifier; using the first match.
1. Provisioning Profile: "Wildcard WatchAppExt Development Profile" (f69dcfd5-cde5-45ef-88fd-f9480e09ffb6)
Signing Identity: "iPhone Developer: Xamarin QA (JP4JS5NR3R)"
2. Provisioning Profile: "Wildcard WatchApp Development Profile" (741aea83-38e2-4065-8543-0683b1ceccd5)
Signing Identity: "iPhone Developer: Xamarin QA (JP4JS5NR3R)"
Detected signing identity:
Code Signing Key: "iPhone Developer: Xamarin QA (JP4JS5NR3R)" (A0E8D34A0E50FEB8D3415DE9D1134E992CBAB059)
Provisioning Profile: "Wildcard WatchAppExt Development Profile" (f69dcfd5-cde5-45ef-88fd-f9480e09ffb6)
Bundle Id: com.companyname.TestiOSApp.watchkitapp.watchkitextension
App Id: ZYWNCWEKU5.com.companyname.TestiOSApp.watchkitapp.watchkitextension
Target _BeforeCoreCompileInterfaceDefinitions:
Skipping target "_BeforeCoreCompileInterfaceDefinitions" because it has no inputs.
Target _BeforeCoreCompileInterfaceDefinitions:
Skipping target "_BeforeCoreCompileInterfaceDefinitions" because it has no inputs.
Target _BeforeCoreCompileInterfaceDefinitions:
Skipping target "_BeforeCoreCompileInterfaceDefinitions" because it has no inputs.
Target _CoreCompileInterfaceDefinitions:
Skipping target "_CoreCompileInterfaceDefinitions" because it has no inputs.
Target _BeforeCoreCompileImageAssets:
Directory "obj/iPhone/Release/actool" doesn't exist. Skipping.
Target _CoreCompileImageAssets:
Tool /Applications/Xcode.app/Contents/Developer/usr/bin/actool execution started with arguments: --errors --warnings --notices --output-format xml1 --compress-pngs --target-device iphone --target-device ipad --target-device watch --minimum-deployment-target 4.2 --platform watchos --compile /Users/xamarinqa/Projects/TestiOSApp/TestiOSApp.TestWatchExtension/obj/iPhone/Release/actool/bundle /Users/xamarinqa/Projects/TestiOSApp/TestiOSApp.TestWatchExtension/obj/iPhone/Release/actool/cloned-assets/Assets.xcassets
Target _CoreCompileColladaAssets:
Skipping target "_CoreCompileColladaAssets" because it has no inputs.
Target _BeforeCoreCompileSceneKitAssets:
Skipping target "_BeforeCoreCompileSceneKitAssets" because it has no inputs.
Target _BeforeCoreCompileSceneKitAssets:
Skipping target "_BeforeCoreCompileSceneKitAssets" because it has no inputs.
Target _BeforeCoreCompileSceneKitAssets:
Skipping target "_BeforeCoreCompileSceneKitAssets" because it has no inputs.
Target _CoreCompileSceneKitAssets:
Skipping target "_CoreCompileSceneKitAssets" because it has no inputs.
Target _BeforeCompileTextureAtlases:
Skipping target "_BeforeCompileTextureAtlases" because it has no inputs.
Target _BeforeCompileTextureAtlases:
Skipping target "_BeforeCompileTextureAtlases" because it has no inputs.
Target _BeforeCompileTextureAtlases:
Skipping target "_BeforeCompileTextureAtlases" because it has no inputs.
Target _CoreCompileTextureAtlases:
Skipping target "_CoreCompileTextureAtlases" because it has no inputs.
Target _BeforeCompileCoreMLModels:
Directory "obj/iPhone/Release/coremlc" doesn't exist. Skipping.
Target _CoreOptimizePngImages:
Skipping target "_CoreOptimizePngImages" because it has no outputs.
Target _CoreOptimizePropertyLists:
Skipping target "_CoreOptimizePropertyLists" because it has no inputs.
Target _CoreOptimizeLocalizationFiles:
Skipping target "_CoreOptimizeLocalizationFiles" because it has no inputs.
Target GenerateTargetFrameworkMonikerAttribute:
Skipping target "GenerateTargetFrameworkMonikerAttribute" because all output files are up-to-date with respect to the input files.
Target CoreCompile:
/Library/Frameworks/Mono.framework/Versions/5.8.0/lib/mono/4.5/csc.exe /noconfig /nowarn:2008 /nostdlib+ /errorreport:prompt /warn:4 /define:__WATCHOS__;__MOBILE__;__UNIFIED__ /errorendlocation /preferreduilang:en-US /reference:/Library/Frameworks/Xamarin.iOS.framework/Versions/Current/lib/mono/Xamarin.WatchOS/mscorlib.dll /reference:/Library/Frameworks/Xamarin.iOS.framework/Versions/Current/lib/mono/Xamarin.WatchOS/System.Core.dll /reference:/Library/Frameworks/Xamarin.iOS.framework/Versions/Current/lib/mono/Xamarin.WatchOS/System.dll /reference:/Library/Frameworks/Xamarin.iOS.framework/Versions/Current/lib/mono/Xamarin.WatchOS/System.Xml.dll /reference:/Library/Frameworks/Xamarin.iOS.framework/Versions/Current/lib/mono/Xamarin.WatchOS/Xamarin.WatchOS.dll /debug:pdbonly /optimize+ /out:obj/iPhone/Release/TestiOSAppTestWatchExtension.dll /target:library /utf8output ExtensionDelegate.cs InterfaceController.cs InterfaceController.designer.cs NotificationController.cs NotificationController.designer.cs "/var/folders/sr/gtt3x2ns3c94_1v0v4q6xzqr0000gn/T/Xamarin.WatchOS,Version=v1.0.AssemblyAttributes.cs"
Target CopyFilesToOutputDirectory:
Copying file from "obj/iPhone/Release/TestiOSAppTestWatchExtension.dll" to "bin/iPhone/Release/TestiOSAppTestWatchExtension.dll".
TestiOSApp.TestWatchExtension -> /Users/xamarinqa/Projects/TestiOSApp/TestiOSApp.TestWatchExtension/bin/iPhone/Release/TestiOSAppTestWatchExtension.dll
Copying file from "obj/iPhone/Release/TestiOSAppTestWatchExtension.pdb" to "bin/iPhone/Release/TestiOSAppTestWatchExtension.pdb".
Target _CopyResourcesToBundle:
Creating directory '/Users/xamarinqa/Projects/TestiOSApp/TestiOSApp.TestWatchExtension/bin/iPhone/Release/TestiOSAppTestWatchExtension.appex'
Copying file from '/Users/xamarinqa/Projects/TestiOSApp/TestiOSApp.TestWatchExtension/PushNotificationPayload.json' to '/Users/xamarinqa/Projects/TestiOSApp/TestiOSApp.TestWatchExtension/bin/iPhone/Release/TestiOSAppTestWatchExtension.appex/PushNotificationPayload.json'
Target _DetectDebugNetworkConfiguration:
DebugIPAddresses:
Target _CompileAppManifest:
Directory "bin/iPhone/Release/TestiOSAppTestWatchExtension.appex.dSYM" doesn't exist. Skipping.
Target _ParseExtraMtouchArgs:
NoSymbolStrip Output: False
NoDSymUtil Output: false
Target _CompileToNative:
/Library/Frameworks/Xamarin.iOS.framework/Versions/Current/bin/mtouch --cache=/Users/xamarinqa/Projects/TestiOSApp/TestiOSApp.TestWatchExtension/obj/iPhone/Release/mtouch-cache --dev=/Users/xamarinqa/Projects/TestiOSApp/TestiOSApp.TestWatchExtension/bin/iPhone/Release/TestiOSAppTestWatchExtension.appex --executable=TestiOSAppTestWatchExtension --extension --linksdkonly --sdkroot=/Applications/Xcode.app/Contents/Developer --sdk=4.2 --targetver=4.2 --aot-options=-O=float32 --bitcode=full --http-message-handler=NSUrlSessionHandler --abi=armv7k+llvm --symbollist=/Users/xamarinqa/Projects/TestiOSApp/TestiOSApp.TestWatchExtension/obj/iPhone/Release/mtouch-symbols.list --dsym=no -r=/Library/Frameworks/Xamarin.iOS.framework/Versions/Current/lib/mono/Xamarin.WatchOS/mscorlib.dll -r=/Library/Frameworks/Xamarin.iOS.framework/Versions/Current/lib/mono/Xamarin.WatchOS/System.Core.dll -r=/Library/Frameworks/Xamarin.iOS.framework/Versions/Current/lib/mono/Xamarin.WatchOS/System.dll -r=/Library/Frameworks/Xamarin.iOS.framework/Versions/Current/lib/mono/Xamarin.WatchOS/System.Xml.dll -r=/Library/Frameworks/Xamarin.iOS.framework/Versions/Current/lib/mono/Xamarin.WatchOS/Xamarin.WatchOS.dll --target-framework=Xamarin.WatchOS,v1.0 --root-assembly=/Users/xamarinqa/Projects/TestiOSApp/TestiOSApp.TestWatchExtension/bin/iPhone/Release/TestiOSAppTestWatchExtension.dll
Process exited with code 1, command:
/Applications/Xcode.app/Contents/Developer/Toolchains/XcodeDefault.xctoolchain/usr/bin/clang -framework WatchKit -framework Foundation -framework UIKit -framework HealthKit /Users/xamarinqa/Projects/TestiOSApp/TestiOSApp.TestWatchExtension/obj/iPhone/Release/mtouch-cache/armv7k/libpinvokes.a /Users/xamarinqa/Projects/TestiOSApp/TestiOSApp.TestWatchExtension/obj/iPhone/Release/mtouch-cache/armv7k/registrar.o /Users/xamarinqa/Projects/TestiOSApp/TestiOSApp.TestWatchExtension/obj/iPhone/Release/mtouch-cache/armv7k/main.o /Users/xamarinqa/Projects/TestiOSApp/TestiOSApp.TestWatchExtension/obj/iPhone/Release/mtouch-cache/armv7k/TestiOSAppTestWatchExtension.dll.bc /Users/xamarinqa/Projects/TestiOSApp/TestiOSApp.TestWatchExtension/obj/iPhone/Release/mtouch-cache/armv7k/mscorlib.dll.bc /Users/xamarinqa/Projects/TestiOSApp/TestiOSApp.TestWatchExtension/obj/iPhone/Release/mtouch-cache/armv7k/Xamarin.WatchOS.dll.bc /Library/Frameworks/Xamarin.iOS.framework/Versions/11.9.0.23/SDKs/Xamarin.WatchOS.sdk/usr/lib/libmonosgen-2.0.a /Library/Frameworks/Xamarin.iOS.framework/Versions/11.9.0.23/SDKs/Xamarin.WatchOS.sdk/usr/lib/libxamarin.a -force_load /Library/Frameworks/Xamarin.iOS.framework/Versions/11.9.0.23/SDKs/Xamarin.WatchOS.sdk/usr/lib/libwatchextension.a -fembed-bitcode -arch armv7k -mwatchos-version-min=4.2 -isysroot /Applications/Xcode.app/Contents/Developer/Platforms/WatchOS.platform/Developer/SDKs/WatchOS4.2.sdk -lz -liconv -o /Users/xamarinqa/Projects/TestiOSApp/TestiOSApp.TestWatchExtension/bin/iPhone/Release/TestiOSAppTestWatchExtension.appex/TestiOSAppTestWatchExtension -lc++ -e _xamarin_watchextension_main -fapplication-extension
MTOUCH : warning : overriding the module target triple with thumbv7k-apple-watchos4.2.0 [-Woverride-module]
1 warning generated.
MTOUCH : warning : overriding the module target triple with thumbv7k-apple-watchos4.2.0 [-Woverride-module]
1 warning generated.
MTOUCH : warning : overriding the module target triple with thumbv7k-apple-watchos4.2.0 [-Woverride-module]
1 warning generated.
Undefined symbols for architecture armv7k:
"_mono_aot_TestiOSAppTestWatchExtensionweak_field_indexes", referenced from:
_mono_aot_file_info in TestiOSAppTestWatchExtension-a95d64.o
"_mono_aot_Xamarin_WatchOSweak_field_indexes", referenced from:
_mono_aot_file_info in Xamarin-6c4960.o
"_mono_aot_mscorlibweak_field_indexes", referenced from:
_mono_aot_file_info in mscorlib-6e4f17.o
ld: symbol(s) not found for architecture armv7k
clang : error : linker command failed with exit code 1 (use -v to see invocation)
error MT5209 : Native linking error : warning: overriding the module target triple with thumbv7k-apple-watchos4.2.0 [-Woverride-module]
error MT5209 : Native linking error : 1 warning generated.
error MT5209 : Native linking error : warning: overriding the module target triple with thumbv7k-apple-watchos4.2.0 [-Woverride-module]
error MT5209 : Native linking error : 1 warning generated.
error MT5209 : Native linking error : warning: overriding the module target triple with thumbv7k-apple-watchos4.2.0 [-Woverride-module]
error MT5209 : Native linking error : 1 warning generated.
MTOUCH : error MT5210: Native linking failed, undefined symbol: _mono_aot_TestiOSAppTestWatchExtensionweak_field_indexes. Please verify that all the necessary frameworks have been referenced and native libraries are properly linked in.
MTOUCH : error MT5210: Native linking failed, undefined symbol: _mono_aot_Xamarin_WatchOSweak_field_indexes. Please verify that all the necessary frameworks have been referenced and native libraries are properly linked in.
MTOUCH : error MT5210: Native linking failed, undefined symbol: _mono_aot_mscorlibweak_field_indexes. Please verify that all the necessary frameworks have been referenced and native libraries are properly linked in.
MTOUCH : error MT5202: Native linking failed. Please review the build log.
Done building target "_CompileToNative" in project "TestiOSApp.TestWatchExtension.csproj" -- FAILED.
Done building project "TestiOSApp.TestWatchExtension.csproj" -- FAILED.
Build FAILED.
MTOUCH : warning : overriding the module target triple with thumbv7k-apple-watchos4.2.0 [-Woverride-module]
MTOUCH : warning : overriding the module target triple with thumbv7k-apple-watchos4.2.0 [-Woverride-module]
MTOUCH : warning : overriding the module target triple with thumbv7k-apple-watchos4.2.0 [-Woverride-module]
clang : error : linker command failed with exit code 1 (use -v to see invocation)
error MT5209 : Native linking error : warning: overriding the module target triple with thumbv7k-apple-watchos4.2.0 [-Woverride-module]
error MT5209 : Native linking error : 1 warning generated.
error MT5209 : Native linking error : warning: overriding the module target triple with thumbv7k-apple-watchos4.2.0 [-Woverride-module]
error MT5209 : Native linking error : 1 warning generated.
error MT5209 : Native linking error : warning: overriding the module target triple with thumbv7k-apple-watchos4.2.0 [-Woverride-module]
error MT5209 : Native linking error : 1 warning generated.
MTOUCH : error MT5210: Native linking failed, undefined symbol: _mono_aot_TestiOSAppTestWatchExtensionweak_field_indexes. Please verify that all the necessary frameworks have been referenced and native libraries are properly linked in.
MTOUCH : error MT5210: Native linking failed, undefined symbol: _mono_aot_Xamarin_WatchOSweak_field_indexes. Please verify that all the necessary frameworks have been referenced and native libraries are properly linked in.
MTOUCH : error MT5210: Native linking failed, undefined symbol: _mono_aot_mscorlibweak_field_indexes. Please verify that all the necessary frameworks have been referenced and native libraries are properly linked in.
MTOUCH : error MT5202: Native linking failed. Please review the build log.
3 Warning(s)
11 Error(s)
Time Elapsed 00:00:17.01
---------------------- Done ----------------------
Build: 11 errors, 3 warnings
Sign up for free to join this conversation on GitHub. Already have an account? Sign in to comment