Create a gist now

Instantly share code, notes, and snippets.

==> Starting build()...
patching file install/conf/ca_renewal
patching file install/conf/ipa.conf
patching file install/tools/ipa-upgradeconfig
Hunk #1 succeeded at 119 (offset 2 lines).
Hunk #2 succeeded at 142 (offset 2 lines).
Hunk #3 FAILED at 626.
1 out of 3 hunks FAILED -- saving rejects to file install/tools/ipa-upgradeconfig.rej
patching file install/tools/man/ipa-upgradeconfig.8
patching file ipa-client/ipa-install/ipa-client-install
Hunk #1 succeeded at 581 (offset 69 lines).
patching file ipapython/certmonger.py
patching file ipapython/platform/systemd.py
Hunk #1 FAILED at 90.
Hunk #2 succeeded at 110 (offset 8 lines).
Hunk #3 succeeded at 127 (offset 8 lines).
Hunk #4 succeeded at 142 (offset 8 lines).
Hunk #5 succeeded at 187 (offset 8 lines).
Hunk #6 succeeded at 205 (offset 8 lines).
Hunk #7 succeeded at 213 (offset 8 lines).
1 out of 7 hunks FAILED -- saving rejects to file ipapython/platform/systemd.py.rej
patching file ipaserver/install/cainstance.py
Hunk #1 FAILED at 59.
1 out of 1 hunk FAILED -- saving rejects to file ipaserver/install/cainstance.py.rej
patching file ipaserver/install/httpinstance.py
==> ERROR: A failure occurred in build().
Aborting...
Sign up for free to join this conversation on GitHub. Already have an account? Sign in to comment