public
Created

  • Download Gist
pcmanfm-qt-git
1 2 3 4 5 6 7 8 9 10 11 12 13 14 15 16 17 18 19 20 21 22 23 24 25 26 27 28 29 30 31 32 33 34 35 36 37 38 39 40 41 42 43 44 45 46
Updating '/tmp/packerbuild-1000/pcmanfm-qt-git/pcmanfm-qt-git/src/pcmanfm-qt-build/pcmanfm/pcmanfm-qt_pt.qm'...
Generated 0 translation(s) (0 finished and 0 unfinished)
Ignored 180 untranslated source text(s)
[ 45%] [ 46%] [ 47%] [ 48%] Building CXX object libfm-qt/CMakeFiles/fm-qt.dir/bookmarkaction.cpp.o
Building CXX object libfm-qt/CMakeFiles/fm-qt.dir/sidepane.cpp.o
Building CXX object libfm-qt/CMakeFiles/fm-qt.dir/icontheme.cpp.o
Building CXX object libfm-qt/CMakeFiles/fm-qt.dir/libfmqt.cpp.o
/tmp/packerbuild-1000/pcmanfm-qt-git/pcmanfm-qt-git/src/pcmanfm-qt-build/libfm-qt/libfmqt.cpp:20:22: schwerwiegender Fehler: libfm/fm.h: Datei oder Verzeichnis nicht gefunden
#include <libfm/fm.h>
^
Kompilierung beendet.
make[2]: *** [libfm-qt/CMakeFiles/fm-qt.dir/libfmqt.cpp.o] Fehler 1
make[2]: *** Warte auf noch nicht beendete Prozesse...
Bringe 'translations/pcmanfm-qt_lt_LT.ts' auf aktuellen Stand...
Found 180 source text(s) (0 new and 180 already existing)
[ 49%] Generating pcmanfm-qt_lt_LT.qm
Updating '/tmp/packerbuild-1000/pcmanfm-qt-git/pcmanfm-qt-git/src/pcmanfm-qt-build/pcmanfm/pcmanfm-qt_lt_LT.qm'...
Generated 0 translation(s) (0 finished and 0 unfinished)
Ignored 180 untranslated source text(s)
[ 49%] Built target pcmanfm_translations
Scanning dependencies of target update_translations
[ 49%] Built target update_translations
In file included from /tmp/packerbuild-1000/pcmanfm-qt-git/pcmanfm-qt-git/src/pcmanfm-qt-build/libfm-qt/icontheme.cpp:21:0:
/tmp/packerbuild-1000/pcmanfm-qt-git/pcmanfm-qt-git/src/pcmanfm-qt-build/libfm-qt/icontheme.h:25:22: schwerwiegender Fehler: libfm/fm.h: Datei oder Verzeichnis nicht gefunden
#include "libfm/fm.h"
^
Kompilierung beendet.
make[2]: *** [libfm-qt/CMakeFiles/fm-qt.dir/icontheme.cpp.o] Fehler 1
In file included from /tmp/packerbuild-1000/pcmanfm-qt-git/pcmanfm-qt-git/src/pcmanfm-qt-build/libfm-qt/bookmarkaction.cpp:21:0:
/tmp/packerbuild-1000/pcmanfm-qt-git/pcmanfm-qt-git/src/pcmanfm-qt-build/libfm-qt/bookmarkaction.h:25:22: schwerwiegender Fehler: libfm/fm.h: Datei oder Verzeichnis nicht gefunden
#include <libfm/fm.h>
^
Kompilierung beendet.
make[2]: *** [libfm-qt/CMakeFiles/fm-qt.dir/bookmarkaction.cpp.o] Fehler 1
In file included from /tmp/packerbuild-1000/pcmanfm-qt-git/pcmanfm-qt-git/src/pcmanfm-qt-build/libfm-qt/sidepane.h:27:0,
from /tmp/packerbuild-1000/pcmanfm-qt-git/pcmanfm-qt-git/src/pcmanfm-qt-build/libfm-qt/sidepane.cpp:21:
/tmp/packerbuild-1000/pcmanfm-qt-git/pcmanfm-qt-git/src/pcmanfm-qt-build/libfm-qt/placesview.h:25:22: schwerwiegender Fehler: libfm/fm.h: Datei oder Verzeichnis nicht gefunden
#include <libfm/fm.h>
^
Kompilierung beendet.
make[2]: *** [libfm-qt/CMakeFiles/fm-qt.dir/sidepane.cpp.o] Fehler 1
make[1]: *** [libfm-qt/CMakeFiles/fm-qt.dir/all] Fehler 2
make: *** [all] Fehler 2
==> FEHLER: Ein Fehler geschah in build().
Breche ab ...
The build failed.

Please sign in to comment on this gist.

Something went wrong with that request. Please try again.