Skip to content

Instantly share code, notes, and snippets.

Embed
What would you like to do?
info: Creating snapshot 0.1.5-7
error: Error running command deploy
error: Nodejitsu Error (500): Internal Server Error
error: npm WARN package.json paceable-staging@0.1.5-7 No README.md file found!
npm http GET http://nj-npm.irisnpm.com/async/0.1.22
npm http GET http://nj-npm.irisnpm.com/config
npm http GET http://nj-npm.irisnpm.com/connect-flash
npm http GET http://nj-npm.irisnpm.com/express/3.0.0
npm http GET http://nj-npm.irisnpm.com/hiredis/0.1.14
npm http GET http://nj-npm.irisnpm.com/jade
npm http GET http://nj-npm.irisnpm.com/less-middleware
npm http GET http://nj-npm.irisnpm.com/mailer/0.6.7
npm http GET http://nj-npm.irisnpm.com/mongoose
npm http GET http://nj-npm.irisnpm.com/mongoose-schema-extend/0.1.1
npm http GET http://nj-npm.irisnpm.com/passport
npm http GET http://nj-npm.irisnpm.com/passport-google-oauth
npm http GET http://nj-npm.irisnpm.com/redis/0.8.1
npm http GET http://nj-npm.irisnpm.com/sendgrid
npm http GET http://nj-npm.irisnpm.com/socket.io
npm http GET http://nj-npm.irisnpm.com/sugar
npm http GET http://nj-npm.irisnpm.com/underscore/1.4.2
npm http GET http://nj-npm.irisnpm.com/xoauth2
npm http 200 http://nj-npm.irisnpm.com/config
npm http 200 http://nj-npm.irisnpm.com/async/0.1.22
npm http 200 http://nj-npm.irisnpm.com/hiredis/0.1.14
npm http GET http://nj-npm.irisnpm.com/async/-/async-0.1.22.tgz
npm http GET http://nj-npm.irisnpm.com/config/-/config-0.4.17.tgz
npm http GET http://nj-npm.irisnpm.com/hiredis/-/hiredis-0.1.14.tgz
npm http 200 http://nj-npm.irisnpm.com/connect-flash
npm http GET http://nj-npm.irisnpm.com/connect-flash/-/connect-flash-0.1.0.tgz
npm http 200 http://nj-npm.irisnpm.com/express/3.0.0
npm http GET http://nj-npm.irisnpm.com/express/-/express-3.0.0.tgz
npm http 200 http://nj-npm.irisnpm.com/less-middleware
npm http GET http://nj-npm.irisnpm.com/less-middleware/-/less-middleware-0.1.8.tgz
npm http 200 http://nj-npm.irisnpm.com/mailer/0.6.7
npm http GET http://nj-npm.irisnpm.com/mailer/-/mailer-0.6.7.tgz
npm http 200 http://nj-npm.irisnpm.com/jade
npm http GET http://nj-npm.irisnpm.com/jade/-/jade-0.27.6.tgz
npm http 200 http://nj-npm.irisnpm.com/mongoose-schema-extend/0.1.1
npm http GET http://nj-npm.irisnpm.com/mongoose-schema-extend/-/mongoose-schema-extend-0.1.1.tgz
npm http 200 http://nj-npm.irisnpm.com/passport
npm http GET http://nj-npm.irisnpm.com/passport/-/passport-0.1.12.tgz
npm http 200 http://nj-npm.irisnpm.com/passport-google-oauth
npm http GET http://nj-npm.irisnpm.com/passport-google-oauth/-/passport-google-oauth-0.1.4.tgz
npm http 200 http://nj-npm.irisnpm.com/redis/0.8.1
npm http 200 http://nj-npm.irisnpm.com/sendgrid
npm http GET http://nj-npm.irisnpm.com/redis/-/redis-0.8.1.tgz
npm http GET http://nj-npm.irisnpm.com/sendgrid/-/sendgrid-0.2.5.tgz
npm http 200 http://nj-npm.irisnpm.com/mongoose
npm http 200 http://nj-npm.irisnpm.com/async/-/async-0.1.22.tgz
npm http 200 http://nj-npm.irisnpm.com/underscore/1.4.2
npm http GET http://nj-npm.irisnpm.com/mongoose/-/mongoose-3.1.2.tgz
npm http 200 http://nj-npm.irisnpm.com/sugar
npm http 200 http://nj-npm.irisnpm.com/config/-/config-0.4.17.tgz
npm http GET http://nj-npm.irisnpm.com/underscore/-/underscore-1.4.2.tgz
npm http GET http://nj-npm.irisnpm.com/sugar/-/sugar-1.3.5.tgz
npm http 200 http://nj-npm.irisnpm.com/hiredis/-/hiredis-0.1.14.tgz
npm http 200 http://nj-npm.irisnpm.com/socket.io
npm http 200 http://nj-npm.irisnpm.com/xoauth2
npm http GET http://nj-npm.irisnpm.com/socket.io/-/socket.io-0.9.10.tgz
npm http GET http://nj-npm.irisnpm.com/xoauth2/-/xoauth2-0.1.3.tgz
npm http 200 http://nj-npm.irisnpm.com/connect-flash/-/connect-flash-0.1.0.tgz
npm http 200 http://nj-npm.irisnpm.com/less-middleware/-/less-middleware-0.1.8.tgz
npm http 200 http://nj-npm.irisnpm.com/express/-/express-3.0.0.tgz
npm http 200 http://nj-npm.irisnpm.com/mailer/-/mailer-0.6.7.tgz
npm WARN package.json connect-flash@0.1.0 No README.md file found!
npm http 200 http://nj-npm.irisnpm.com/jade/-/jade-0.27.6.tgz
npm http 200 http://nj-npm.irisnpm.com/mongoose-schema-extend/-/mongoose-schema-extend-0.1.1.tgz
npm http 200 http://nj-npm.irisnpm.com/passport/-/passport-0.1.12.tgz
npm http 200 http://nj-npm.irisnpm.com/passport-google-oauth/-/passport-google-oauth-0.1.4.tgz
npm WARN package.json hiredis@0.1.14 No README.md file found!
npm http 200 http://nj-npm.irisnpm.com/sendgrid/-/sendgrid-0.2.5.tgz
npm http 200 http://nj-npm.irisnpm.com/redis/-/redis-0.8.1.tgz
npm http 200 http://nj-npm.irisnpm.com/mongoose/-/mongoose-3.1.2.tgz
npm WARN package.json passport@0.1.12 No README.md file found!
npm http 200 http://nj-npm.irisnpm.com/underscore/-/underscore-1.4.2.tgz
npm http 200 http://nj-npm.irisnpm.com/sugar/-/sugar-1.3.5.tgz
npm WARN package.json passport-google-oauth@0.1.4 No README.md file found!
npm http 200 http://nj-npm.irisnpm.com/socket.io/-/socket.io-0.9.10.tgz
npm http 200 http://nj-npm.irisnpm.com/xoauth2/-/xoauth2-0.1.3.tgz
> hiredis@0.1.14 preinstall /root/tmp/tmp-179573rdoogg/build/package/node_modules/hiredis
> make || gmake
cd deps/hiredis && make static
make[1]: Entering directory `/root/tmp/tmp-179573rdoogg/build/package/node_modules/hiredis/deps/hiredis'
cc -std=c99 -pedantic -c -O3 -fPIC -m64 -Wall -W -Wstrict-prototypes -Wwrite-strings -g -ggdb net.c
cc -std=c99 -pedantic -c -O3 -fPIC -m64 -Wall -W -Wstrict-prototypes -Wwrite-strings -g -ggdb hiredis.c
npm http GET http://nj-npm.irisnpm.com/request
npm http GET http://nj-npm.irisnpm.com/less
npm http GET http://nj-npm.irisnpm.com/mkdirp
npm http GET http://nj-npm.irisnpm.com/clone
npm http GET http://nj-npm.irisnpm.com/mocha
npm http GET http://nj-npm.irisnpm.com/pkginfo
npm http GET http://nj-npm.irisnpm.com/passport-oauth
npm http GET http://nj-npm.irisnpm.com/nodemailer/0.1.20
npm http GET http://nj-npm.irisnpm.com/colors
npm http GET http://nj-npm.irisnpm.com/connect/2.6.0
npm http GET http://nj-npm.irisnpm.com/commander/0.6.1
npm http GET http://nj-npm.irisnpm.com/socket.io-client/0.9.10
npm http GET http://nj-npm.irisnpm.com/policyfile/0.0.4
npm http GET http://nj-npm.irisnpm.com/mkdirp
npm http GET http://nj-npm.irisnpm.com/mime/1.2.7
npm http GET http://nj-npm.irisnpm.com/range-parser/0.0.4
npm http GET http://nj-npm.irisnpm.com/redis/0.7.2
npm http GET http://nj-npm.irisnpm.com/step/0.0.5
npm http GET http://nj-npm.irisnpm.com/mkdirp/0.3.3
npm http GET http://nj-npm.irisnpm.com/chai/1.1.1
npm http GET http://nj-npm.irisnpm.com/cookie/0.0.4
npm http GET http://nj-npm.irisnpm.com/mocha/1.3.0
npm http GET http://nj-npm.irisnpm.com/crc/0.2.0
npm http GET http://nj-npm.irisnpm.com/fresh/0.1.0
npm http GET http://nj-npm.irisnpm.com/nodemailer/0.3.28
npm http GET http://nj-npm.irisnpm.com/methods/0.0.1
npm http GET http://nj-npm.irisnpm.com/send/0.1.0
npm http GET http://nj-npm.irisnpm.com/debug
npm http GET http://nj-npm.irisnpm.com/underscore/1.4.2
npm http GET http://nj-npm.irisnpm.com/js-yaml
npm http GET http://nj-npm.irisnpm.com/coffee-script
npm http 200 http://nj-npm.irisnpm.com/mkdirp
npm http GET http://nj-npm.irisnpm.com/mkdirp/-/mkdirp-0.3.4.tgz
npm http 200 http://nj-npm.irisnpm.com/clone
npm http GET http://nj-npm.irisnpm.com/clone/-/clone-0.1.1.tgz
npm http 200 http://nj-npm.irisnpm.com/request
npm http GET http://nj-npm.irisnpm.com/request/-/request-2.11.4.tgz
npm http 200 http://nj-npm.irisnpm.com/pkginfo
npm http GET http://nj-npm.irisnpm.com/pkginfo/-/pkginfo-0.2.3.tgz
npm http 200 http://nj-npm.irisnpm.com/less
npm http GET http://nj-npm.irisnpm.com/less/-/less-1.3.1.tgz
npm http 200 http://nj-npm.irisnpm.com/mocha
npm http GET http://nj-npm.irisnpm.com/mocha/-/mocha-1.3.2.tgz
npm http 200 http://nj-npm.irisnpm.com/passport-oauth
npm http GET http://nj-npm.irisnpm.com/passport-oauth/-/passport-oauth-0.1.12.tgz
cc -std=c99 -pedantic -c -O3 -fPIC -m64 -Wall -W -Wstrict-prototypes -Wwrite-strings -g -ggdb sds.c
npm http 200 http://nj-npm.irisnpm.com/colors
npm http GET http://nj-npm.irisnpm.com/colors/-/colors-0.6.0-1.tgz
npm http 200 http://nj-npm.irisnpm.com/connect/2.6.0
npm http GET http://nj-npm.irisnpm.com/connect/-/connect-2.6.0.tgz
npm http 200 http://nj-npm.irisnpm.com/commander/0.6.1
npm http GET http://nj-npm.irisnpm.com/commander/-/commander-0.6.1.tgz
npm http 200 http://nj-npm.irisnpm.com/nodemailer/0.1.20
npm http GET http://nj-npm.irisnpm.com/nodemailer/-/nodemailer-0.1.20.tgz
npm http 200 http://nj-npm.irisnpm.com/mkdirp
npm http 200 http://nj-npm.irisnpm.com/socket.io-client/0.9.10
npm http GET http://nj-npm.irisnpm.com/socket.io-client/-/socket.io-client-0.9.10.tgz
npm http 200 http://nj-npm.irisnpm.com/policyfile/0.0.4
npm http GET http://nj-npm.irisnpm.com/policyfile/-/policyfile-0.0.4.tgz
npm http 200 http://nj-npm.irisnpm.com/mime/1.2.7
npm http 200 http://nj-npm.irisnpm.com/range-parser/0.0.4
npm http GET http://nj-npm.irisnpm.com/mime/-/mime-1.2.7.tgz
npm http GET http://nj-npm.irisnpm.com/range-parser/-/range-parser-0.0.4.tgz
npm http 200 http://nj-npm.irisnpm.com/redis/0.7.2
npm http GET http://nj-npm.irisnpm.com/redis/-/redis-0.7.2.tgz
npm http 200 http://nj-npm.irisnpm.com/step/0.0.5
npm http GET http://nj-npm.irisnpm.com/step/-/step-0.0.5.tgz
npm http 200 http://nj-npm.irisnpm.com/mkdirp/0.3.3
npm http GET http://nj-npm.irisnpm.com/mkdirp/-/mkdirp-0.3.3.tgz
npm http 200 http://nj-npm.irisnpm.com/cookie/0.0.4
npm http GET http://nj-npm.irisnpm.com/cookie/-/cookie-0.0.4.tgz
npm http 200 http://nj-npm.irisnpm.com/mocha/1.3.0
npm http GET http://nj-npm.irisnpm.com/mocha/-/mocha-1.3.0.tgz
npm http 200 http://nj-npm.irisnpm.com/chai/1.1.1
npm http 200 http://nj-npm.irisnpm.com/crc/0.2.0
npm http GET http://nj-npm.irisnpm.com/chai/-/chai-1.1.1.tgz
npm http GET http://nj-npm.irisnpm.com/crc/-/crc-0.2.0.tgz
npm http 200 http://nj-npm.irisnpm.com/fresh/0.1.0
cc -std=c99 -pedantic -c -O3 -fPIC -m64 -Wall -W -Wstrict-prototypes -Wwrite-strings -g -ggdb async.c
npm http GET http://nj-npm.irisnpm.com/fresh/-/fresh-0.1.0.tgz
npm http 304 http://nj-npm.irisnpm.com/underscore/1.4.2
npm http 200 http://nj-npm.irisnpm.com/debug
npm http 200 http://nj-npm.irisnpm.com/send/0.1.0
npm http GET http://nj-npm.irisnpm.com/debug/-/debug-0.7.0.tgz
npm http GET http://nj-npm.irisnpm.com/send/-/send-0.1.0.tgz
npm http 200 http://nj-npm.irisnpm.com/nodemailer/0.3.28
npm http GET http://nj-npm.irisnpm.com/nodemailer/-/nodemailer-0.3.28.tgz
npm http 200 http://nj-npm.irisnpm.com/methods/0.0.1
npm http GET http://nj-npm.irisnpm.com/methods/-/methods-0.0.1.tgz
npm http 200 http://nj-npm.irisnpm.com/mkdirp/-/mkdirp-0.3.4.tgz
npm http 200 http://nj-npm.irisnpm.com/clone/-/clone-0.1.1.tgz
npm http 200 http://nj-npm.irisnpm.com/request/-/request-2.11.4.tgz
npm http 200 http://nj-npm.irisnpm.com/coffee-script
npm http 200 http://nj-npm.irisnpm.com/pkginfo/-/pkginfo-0.2.3.tgz
npm http GET http://nj-npm.irisnpm.com/coffee-script/-/coffee-script-1.4.0.tgz
npm http 200 http://nj-npm.irisnpm.com/mocha/-/mocha-1.3.2.tgz
npm http 200 http://nj-npm.irisnpm.com/less/-/less-1.3.1.tgz
npm http 200 http://nj-npm.irisnpm.com/js-yaml
async.c: In function '__redisAsyncCommand':
async.c:538:10: warning: 'cstr' may be used uninitialized in this function [-Wuninitialized]
npm http 200 http://nj-npm.irisnpm.com/passport-oauth/-/passport-oauth-0.1.12.tgz
npm http GET http://nj-npm.irisnpm.com/js-yaml/-/js-yaml-0.3.7.tgz
npm WARN package.json passport-oauth@0.1.12 No README.md file found!
npm http 200 http://nj-npm.irisnpm.com/connect/-/connect-2.6.0.tgz
npm http 200 http://nj-npm.irisnpm.com/colors/-/colors-0.6.0-1.tgz
npm http 200 http://nj-npm.irisnpm.com/commander/-/commander-0.6.1.tgz
ar rcs libhiredis.a net.o hiredis.o sds.o async.o
make[1]: Leaving directory `/root/tmp/tmp-179573rdoogg/build/package/node_modules/hiredis/deps/hiredis'
node-waf configure build
Setting srcdir to : /root/tmp/tmp-179573rdoogg/build/package/node_modules/hiredis
Setting blddir to : /root/tmp/tmp-179573rdoogg/build/package/node_modules/hiredis/build
Checking for program g++ or c++ : /opt/local/bin/g++
Checking for program cpp : /opt/local/bin/cpp
Checking for program ar : /opt/local/bin/ar
Checking for program ranlib : /opt/local/bin/ranlib
Checking for g++ : ok
Checking for node path : not found
Checking for node prefix : ok /opt/local
'configure' finished successfully (0.059s)
Waf: Entering directory `/root/tmp/tmp-179573rdoogg/build/package/node_modules/hiredis/build'
[1/3] cxx: hiredis.cc -> build/Release/hiredis_1.o
[2/3] cxx: reader.cc -> build/Release/reader_1.o
npm http 200 http://nj-npm.irisnpm.com/nodemailer/-/nodemailer-0.1.20.tgz
npm http 200 http://nj-npm.irisnpm.com/socket.io-client/-/socket.io-client-0.9.10.tgz
npm http 200 http://nj-npm.irisnpm.com/policyfile/-/policyfile-0.0.4.tgz
npm http 200 http://nj-npm.irisnpm.com/mime/-/mime-1.2.7.tgz
npm http 200 http://nj-npm.irisnpm.com/range-parser/-/range-parser-0.0.4.tgz
[3/3] cxx_link: build/Release/hiredis_1.o build/Release/reader_1.o -> build/Release/hiredis.node
ld: fatal: file Release/hiredis_1.o: wrong ELF class: ELFCLASS64
ld: fatal: file processing errors. No output written to /root/tmp/tmp-179573rdoogg/build/package/node_modules/hiredis/build/Release/hiredis.node
collect2: ld returned 1 exit status
Waf: Leaving directory `/root/tmp/tmp-179573rdoogg/build/package/node_modules/hiredis/build'
Build failed: -> task failed (err #1):
{task: cxx_link hiredis_1.o,reader_1.o -> hiredis.node}
make: *** [all] Error 1
cd deps/hiredis && gmake static
gmake[1]: Entering directory `/root/tmp/tmp-179573rdoogg/build/package/node_modules/hiredis/deps/hiredis'
gmake[1]: Nothing to be done for `static'.
gmake[1]: Leaving directory `/root/tmp/tmp-179573rdoogg/build/package/node_modules/hiredis/deps/hiredis'
node-waf configure build
Setting srcdir to : /root/tmp/tmp-179573rdoogg/build/package/node_modules/hiredis
Setting blddir to : /root/tmp/tmp-179573rdoogg/build/package/node_modules/hiredis/build
Checking for program g++ or c++ : /opt/local/bin/g++
Checking for program cpp : /opt/local/bin/cpp
Checking for program ar : /opt/local/bin/ar
Checking for program ranlib : /opt/local/bin/ranlib
Checking for g++ : ok
Checking for node path : not found
Checking for node prefix : ok /opt/local
'configure' finished successfully (0.064s)
Waf: Entering directory `/root/tmp/tmp-179573rdoogg/build/package/node_modules/hiredis/build'
[3/3] cxx_link: build/Release/hiredis_1.o build/Release/reader_1.o -> build/Release/hiredis.node
ld: fatal: file Release/hiredis_1.o: wrong ELF class: ELFCLASS64
ld: fatal: file processing errors. No output written to /root/tmp/tmp-179573rdoogg/build/package/node_modules/hiredis/build/Release/hiredis.node
collect2: ld returned 1 exit status
Waf: Leaving directory `/root/tmp/tmp-179573rdoogg/build/package/node_modules/hiredis/build'
Build failed: -> task failed (err #1):
{task: cxx_link hiredis_1.o,reader_1.o -> hiredis.node}
gmake: *** [all] Error 1
npm http 200 http://nj-npm.irisnpm.com/cookie/-/cookie-0.0.4.tgz
npm http 200 http://nj-npm.irisnpm.com/step/-/step-0.0.5.tgz
npm http 200 http://nj-npm.irisnpm.com/mkdirp/-/mkdirp-0.3.3.tgz
npm http 200 http://nj-npm.irisnpm.com/redis/-/redis-0.7.2.tgz
npm http GET http://nj-npm.irisnpm.com/oauth
npm ERR! hiredis@0.1.14 preinstall: `make || gmake`
npm ERR! `sh "-c" "make || gmake"` failed with 2
npm ERR!
npm ERR! Failed at the hiredis@0.1.14 preinstall script.
npm ERR! This is most likely a problem with the hiredis package,
npm ERR! not with npm itself.
npm ERR! Tell the author that this fails on your system:
npm ERR! make || gmake
npm ERR! You can get their info via:
npm ERR! npm owner ls hiredis
npm ERR! There is likely additional logging output above.
npm ERR! System SunOS 5.11
npm ERR! command "/opt/local/bin/node" "/opt/local/bin/npm" "install"
npm ERR! cwd /root/tmp/tmp-179573rdoogg/build/package
npm ERR! node -v v0.8.8
npm ERR! npm -v 1.1.59
npm ERR! code ELIFECYCLE
npm http 200 http://nj-npm.irisnpm.com/chai/-/chai-1.1.1.tgz
npm http 200 http://nj-npm.irisnpm.com/crc/-/crc-0.2.0.tgz
npm http 200 http://nj-npm.irisnpm.com/mocha/-/mocha-1.3.0.tgz
npm http 200 http://nj-npm.irisnpm.com/fresh/-/fresh-0.1.0.tgz
npm http GET http://nj-npm.irisnpm.com/growl
npm http GET http://nj-npm.irisnpm.com/jade/0.26.3
npm http GET http://nj-npm.irisnpm.com/diff/1.0.2
npm http GET http://nj-npm.irisnpm.com/commander/0.6.1
npm http 200 http://nj-npm.irisnpm.com/debug/-/debug-0.7.0.tgz
npm http 200 http://nj-npm.irisnpm.com/send/-/send-0.1.0.tgz
npm http 200 http://nj-npm.irisnpm.com/nodemailer/-/nodemailer-0.3.28.tgz
npm http GET http://nj-npm.irisnpm.com/mimelib-noiconv
npm http 200 http://nj-npm.irisnpm.com/methods/-/methods-0.0.1.tgz
npm http 200 http://nj-npm.irisnpm.com/oauth
npm http 200 http://nj-npm.irisnpm.com/coffee-script/-/coffee-script-1.4.0.tgz
npm http 200 http://nj-npm.irisnpm.com/js-yaml/-/js-yaml-0.3.7.tgz
npm http GET http://nj-npm.irisnpm.com/oauth/-/oauth-0.9.8.tgz
npm WARN package.json methods@0.0.1 No README.md file found!
npm http 200 http://nj-npm.irisnpm.com/growl
npm http GET http://nj-npm.irisnpm.com/growl/-/growl-1.5.1.tgz
npm http 200 http://nj-npm.irisnpm.com/jade/0.26.3
npm http GET http://nj-npm.irisnpm.com/jade/-/jade-0.26.3.tgz
npm http 200 http://nj-npm.irisnpm.com/diff/1.0.2
npm http GET http://nj-npm.irisnpm.com/hooks/0.2.1
npm http GET http://nj-npm.irisnpm.com/mongodb/1.1.7
npm http GET http://nj-npm.irisnpm.com/ms/0.1.0
npm http GET http://nj-npm.irisnpm.com/diff/-/diff-1.0.2.tgz
npm http 200 http://nj-npm.irisnpm.com/growl/-/growl-1.5.1.tgz
npm http 200 http://nj-npm.irisnpm.com/mimelib-noiconv
npm http 304 http://nj-npm.irisnpm.com/commander/0.6.1
npm http 200 http://nj-npm.irisnpm.com/oauth/-/oauth-0.9.8.tgz
npm http 200 http://nj-npm.irisnpm.com/jade/-/jade-0.26.3.tgz
npm http GET http://nj-npm.irisnpm.com/mimelib-noiconv/-/mimelib-noiconv-0.1.9.tgz
npm http 200 http://nj-npm.irisnpm.com/mongodb/1.1.7
npm http 200 http://nj-npm.irisnpm.com/hooks/0.2.1
npm http 200 http://nj-npm.irisnpm.com/ms/0.1.0
npm http GET http://nj-npm.irisnpm.com/mongodb/-/mongodb-1.1.7.tgz
npm http GET http://nj-npm.irisnpm.com/hooks/-/hooks-0.2.1.tgz
npm http GET http://nj-npm.irisnpm.com/ms/-/ms-0.1.0.tgz
npm WARN package.json jade@0.26.3 No README.md file found!
npm http 200 http://nj-npm.irisnpm.com/diff/-/diff-1.0.2.tgz
npm http 200 http://nj-npm.irisnpm.com/mimelib-noiconv/-/mimelib-noiconv-0.1.9.tgz
npm http GET http://nj-npm.irisnpm.com/mime/1.2.6
npm http GET http://nj-npm.irisnpm.com/qs/0.5.1
npm http GET http://nj-npm.irisnpm.com/formidable/1.0.11
npm http GET http://nj-npm.irisnpm.com/bytes/0.1.0
npm http GET http://nj-npm.irisnpm.com/send/0.0.4
npm http GET http://nj-npm.irisnpm.com/pause/0.0.1
npm http GET http://nj-npm.irisnpm.com/mailcomposer/0.1.21
npm http GET http://nj-npm.irisnpm.com/simplesmtp/0.1.25
npm http GET http://nj-npm.irisnpm.com/optimist/0.3.5
npm http 200 http://nj-npm.irisnpm.com/ms/-/ms-0.1.0.tgz
npm http 200 http://nj-npm.irisnpm.com/hooks/-/hooks-0.2.1.tgz
npm http 200 http://nj-npm.irisnpm.com/mongodb/-/mongodb-1.1.7.tgz
npm http GET http://nj-npm.irisnpm.com/growl/1.5.1
npm http GET http://nj-npm.irisnpm.com/debug/0.7.0
npm http GET http://nj-npm.irisnpm.com/commander/0.6.1
npm http 200 http://nj-npm.irisnpm.com/qs/0.5.1
npm http 200 http://nj-npm.irisnpm.com/mime/1.2.6
npm http GET http://nj-npm.irisnpm.com/mime/-/mime-1.2.6.tgz
npm http GET http://nj-npm.irisnpm.com/qs/-/qs-0.5.1.tgz
npm http 200 http://nj-npm.irisnpm.com/pause/0.0.1
npm http 200 http://nj-npm.irisnpm.com/bytes/0.1.0
npm http 200 http://nj-npm.irisnpm.com/formidable/1.0.11
npm http GET http://nj-npm.irisnpm.com/pause/-/pause-0.0.1.tgz
npm http GET http://nj-npm.irisnpm.com/formidable/-/formidable-1.0.11.tgz
npm http GET http://nj-npm.irisnpm.com/bytes/-/bytes-0.1.0.tgz
npm http 200 http://nj-npm.irisnpm.com/mailcomposer/0.1.21
npm http 200 http://nj-npm.irisnpm.com/send/0.0.4
npm http GET http://nj-npm.irisnpm.com/send/-/send-0.0.4.tgz
npm http GET http://nj-npm.irisnpm.com/mailcomposer/-/mailcomposer-0.1.21.tgz
npm http 200 http://nj-npm.irisnpm.com/simplesmtp/0.1.25
npm http 200 http://nj-npm.irisnpm.com/optimist/0.3.5
npm http 200 http://nj-npm.irisnpm.com/growl/1.5.1
npm http GET http://nj-npm.irisnpm.com/growl/-/growl-1.5.1.tgz
npm http GET http://nj-npm.irisnpm.com/simplesmtp/-/simplesmtp-0.1.25.tgz
npm http GET http://nj-npm.irisnpm.com/optimist/-/optimist-0.3.5.tgz
npm http 200 http://nj-npm.irisnpm.com/debug/0.7.0
npm http 304 http://nj-npm.irisnpm.com/commander/0.6.1
npm http GET http://nj-npm.irisnpm.com/debug/-/debug-0.7.0.tgz
npm http 200 http://nj-npm.irisnpm.com/qs/-/qs-0.5.1.tgz
npm http 200 http://nj-npm.irisnpm.com/pause/-/pause-0.0.1.tgz
npm http 200 http://nj-npm.irisnpm.com/mime/-/mime-1.2.6.tgz
npm http 200 http://nj-npm.irisnpm.com/formidable/-/formidable-1.0.11.tgz
npm http 200 http://nj-npm.irisnpm.com/bytes/-/bytes-0.1.0.tgz
npm http GET http://nj-npm.irisnpm.com/mkdirp/0.3.0
npm http 200 http://nj-npm.irisnpm.com/mailcomposer/-/mailcomposer-0.1.21.tgz
npm http 200 http://nj-npm.irisnpm.com/send/-/send-0.0.4.tgz
npm http 200 http://nj-npm.irisnpm.com/optimist/-/optimist-0.3.5.tgz
npm http 200 http://nj-npm.irisnpm.com/simplesmtp/-/simplesmtp-0.1.25.tgz
npm http 200 http://nj-npm.irisnpm.com/growl/-/growl-1.5.1.tgz
npm http 200 http://nj-npm.irisnpm.com/mkdirp/0.3.0
npm http 200 http://nj-npm.irisnpm.com/debug/-/debug-0.7.0.tgz
npm http GET http://nj-npm.irisnpm.com/bson/0.1.3
npm http GET http://nj-npm.irisnpm.com/mkdirp/-/mkdirp-0.3.0.tgz
npm http 200 http://nj-npm.irisnpm.com/mkdirp/-/mkdirp-0.3.0.tgz
npm http 200 http://nj-npm.irisnpm.com/bson/0.1.3
npm http GET http://nj-npm.irisnpm.com/bson/-/bson-0.1.3.tgz
npm http 200 http://nj-npm.irisnpm.com/bson/-/bson-0.1.3.tgz
npm http GET http://nj-npm.irisnpm.com/mime/1.2.6
npm http GET http://nj-npm.irisnpm.com/wordwrap/0.0.2
npm http GET http://nj-npm.irisnpm.com/mkdirp/0.3.0
npm http GET http://nj-npm.irisnpm.com/rai/0.1.6
npm http GET http://nj-npm.irisnpm.com/xoauth2/0.1.3
npm http GET http://nj-npm.irisnpm.com/mimelib/0.2.7
npm http GET http://nj-npm.irisnpm.com/uglify-js/1.2.5
npm http GET http://nj-npm.irisnpm.com/ws
npm http GET http://nj-npm.irisnpm.com/xmlhttprequest/1.4.2
npm http GET http://nj-npm.irisnpm.com/active-x-obfuscator/0.0.1
npm WARN package.json bson@0.1.3 No README.md file found!
npm http 304 http://nj-npm.irisnpm.com/mime/1.2.6
npm http 304 http://nj-npm.irisnpm.com/mkdirp/0.3.0
npm http 200 http://nj-npm.irisnpm.com/xoauth2/0.1.3
npm http GET http://nj-npm.irisnpm.com/xoauth2/-/xoauth2-0.1.3.tgz
npm http 200 http://nj-npm.irisnpm.com/wordwrap/0.0.2
npm http 200 http://nj-npm.irisnpm.com/rai/0.1.6
npm http GET http://nj-npm.irisnpm.com/wordwrap/-/wordwrap-0.0.2.tgz
npm http GET http://nj-npm.irisnpm.com/rai/-/rai-0.1.6.tgz
npm http 200 http://nj-npm.irisnpm.com/uglify-js/1.2.5
npm http GET http://nj-npm.irisnpm.com/uglify-js/-/uglify-js-1.2.5.tgz
npm http 200 http://nj-npm.irisnpm.com/xoauth2/-/xoauth2-0.1.3.tgz
npm http 200 http://nj-npm.irisnpm.com/mimelib/0.2.7
npm http GET http://nj-npm.irisnpm.com/mimelib/-/mimelib-0.2.7.tgz
npm http 200 http://nj-npm.irisnpm.com/wordwrap/-/wordwrap-0.0.2.tgz
npm http 200 http://nj-npm.irisnpm.com/active-x-obfuscator/0.0.1
npm http GET http://nj-npm.irisnpm.com/active-x-obfuscator/-/active-x-obfuscator-0.0.1.tgz
npm http 200 http://nj-npm.irisnpm.com/uglify-js/-/uglify-js-1.2.5.tgz
npm http 200 http://nj-npm.irisnpm.com/ws
npm http 200 http://nj-npm.irisnpm.com/rai/-/rai-0.1.6.tgz
npm http GET http://nj-npm.irisnpm.com/ws/-/ws-0.4.22.tgz
npm http 200 http://nj-npm.irisnpm.com/xmlhttprequest/1.4.2
npm http GET http://nj-npm.irisnpm.com/xmlhttprequest/-/xmlhttprequest-1.4.2.tgz
npm http 200 http://nj-npm.irisnpm.com/mimelib/-/mimelib-0.2.7.tgz
npm http 200 http://nj-npm.irisnpm.com/active-x-obfuscator/-/active-x-obfuscator-0.0.1.tgz
npm http 200 http://nj-npm.irisnpm.com/ws/-/ws-0.4.22.tgz
npm http 200 http://nj-npm.irisnpm.com/xmlhttprequest/-/xmlhttprequest-1.4.2.tgz
> bson@0.1.3 install /root/tmp/tmp-179573rdoogg/build/package/node_modules/mongoose/node_modules/mongodb/node_modules/bson
> node install.js
================================================================================
= =
= To install with C++ bson parser do <npm install mongodb --mongodb:native> =
= =
================================================================================
npm http GET http://nj-npm.irisnpm.com/encoding/0.1.4
npm http GET http://nj-npm.irisnpm.com/addressparser/0.1.3
npm http 200 http://nj-npm.irisnpm.com/encoding/0.1.4
npm http GET http://nj-npm.irisnpm.com/encoding/-/encoding-0.1.4.tgz
npm http 200 http://nj-npm.irisnpm.com/addressparser/0.1.3
npm http GET http://nj-npm.irisnpm.com/addressparser/-/addressparser-0.1.3.tgz
npm http 200 http://nj-npm.irisnpm.com/encoding/-/encoding-0.1.4.tgz
npm http 200 http://nj-npm.irisnpm.com/addressparser/-/addressparser-0.1.3.tgz
npm http GET http://nj-npm.irisnpm.com/iconv-lite/0.2.5
npm http GET http://nj-npm.irisnpm.com/iconv/1.2.3
npm http 200 http://nj-npm.irisnpm.com/iconv-lite/0.2.5
npm http 200 http://nj-npm.irisnpm.com/iconv/1.2.3
npm http GET http://nj-npm.irisnpm.com/iconv-lite/-/iconv-lite-0.2.5.tgz
npm http GET http://nj-npm.irisnpm.com/iconv/-/iconv-1.2.3.tgz
npm http 200 http://nj-npm.irisnpm.com/iconv/-/iconv-1.2.3.tgz
npm http 200 http://nj-npm.irisnpm.com/iconv-lite/-/iconv-lite-0.2.5.tgz
npm http GET http://nj-npm.irisnpm.com/zeparser/0.0.5
npm http 200 http://nj-npm.irisnpm.com/zeparser/0.0.5
npm http GET http://nj-npm.irisnpm.com/zeparser/-/zeparser-0.0.5.tgz
npm http GET http://nj-npm.irisnpm.com/commander
npm http GET http://nj-npm.irisnpm.com/tinycolor
npm http GET http://nj-npm.irisnpm.com/options
npm http 200 http://nj-npm.irisnpm.com/zeparser/-/zeparser-0.0.5.tgz
npm http 200 http://nj-npm.irisnpm.com/tinycolor
npm http GET http://nj-npm.irisnpm.com/tinycolor/-/tinycolor-0.0.1.tgz
npm http 200 http://nj-npm.irisnpm.com/options
npm http 200 http://nj-npm.irisnpm.com/commander
npm http GET http://nj-npm.irisnpm.com/options/-/options-0.0.3.tgz
npm http 200 http://nj-npm.irisnpm.com/tinycolor/-/tinycolor-0.0.1.tgz
npm http 200 http://nj-npm.irisnpm.com/options/-/options-0.0.3.tgz
> ws@0.4.22 install /root/tmp/tmp-179573rdoogg/build/package/node_modules/socket.io/node_modules/socket.io-client/node_modules/ws
> node install.js
[ws v0.4.22] Attempting to compile blazing fast native extensions.
[ws v0.4.22] Native extension compilation successful!
> iconv@1.2.3 install /root/tmp/tmp-179573rdoogg/build/package/node_modules/sendgrid/node_modules/nodemailer/node_modules/mailcomposer/node_modules/mimelib/node_modules/encoding/node_modules/iconv
> node-gyp rebuild
make: Entering directory `/root/tmp/tmp-179573rdoogg/build/package/node_modules/sendgrid/node_modules/nodemailer/node_modules/mailcomposer/node_modules/mimelib/node_modules/encoding/node_modules/iconv/build'
CC(target) Release/obj.target/iconv/deps/libiconv/libcharset/lib/localcharset.o
CC(target) Release/obj.target/iconv/deps/libiconv/lib/iconv.o
CXX(target) Release/obj.target/iconv/binding.o
SOLINK_MODULE(target) Release/obj.target/iconv.node
SOLINK_MODULE(target) Release/obj.target/iconv.node: Finished
COPY Release/iconv.node
make: Leaving directory `/root/tmp/tmp-179573rdoogg/build/package/node_modules/sendgrid/node_modules/nodemailer/node_modules/mailcomposer/node_modules/mimelib/node_modules/encoding/node_modules/iconv/build'
npm ERR!
npm ERR! Additional logging details can be found in:
npm ERR! /root/tmp/tmp-179573rdoogg/build/package/npm-debug.log
npm ERR! not ok code 0
help: For help with this error contact Nodejitsu Support:
help: webchat: <http://webchat.nodejitsu.com/>
help: irc: <irc://chat.freenode.net/#nodejitsu>
help: email: <support@nodejitsu.com>
help:
help: Copy and paste this output to a gist (http://gist.github.com/)
info: Nodejitsu not ok
Sign up for free to join this conversation on GitHub. Already have an account? Sign in to comment
You can’t perform that action at this time.