Skip to content

Instantly share code, notes, and snippets.

@Rojoss
Last active Jan 26, 2017
Embed
What would you like to do?
current directory: /vagrant/plugins/curvefever/gems/2.3.1/gems/mysql2-0.4.5/ext/mysql2
/home/vagrant/.rvm/rubies/ruby-2.3.1/bin/ruby -r ./siteconf20170126-20000-1dcf6u8.rb extconf.rb
checking for rb_absint_size()... yes
checking for rb_absint_singlebit_p()... yes
checking for ruby/thread.h... yes
checking for rb_thread_call_without_gvl() in ruby/thread.h... yes
checking for rb_thread_blocking_region()... no
checking for rb_wait_for_single_fd()... yes
checking for rb_hash_dup()... yes
checking for rb_intern3()... yes
checking for rb_big_cmp()... yes
-----
Using mysql_config at /usr/bin/mysql_config
-----
checking for mysql.h... yes
checking for SSL_MODE_DISABLED in mysql.h... yes
checking for SSL_MODE_PREFERRED in mysql.h... yes
checking for SSL_MODE_REQUIRED in mysql.h... yes
checking for SSL_MODE_VERIFY_CA in mysql.h... yes
checking for SSL_MODE_VERIFY_IDENTITY in mysql.h... yes
checking for errmsg.h... yes
checking for mysqld_error.h... yes
-----
Setting libpath to /usr/lib/x86_64-linux-gnu
-----
creating Makefile
To see why this extension failed to compile, please check the mkmf.log which can be found here:
/vagrant/plugins/curvefever/gems/2.3.1/extensions/x86_64-linux/2.3.0/mysql2-0.4.5/mkmf.log
Text file busy @ unlink_internal - ./siteconf20170126-20000-1dcf6u8.rb
have_func: checking for rb_absint_size()... -------------------- yes
"gcc -o conftest -I/home/vagrant/.rvm/rubies/ruby-2.3.1/include/ruby-2.3.0/x86_64-linux -I/home/vagrant/.rvm/rubies/ruby-2.3.1/include/ruby-2.3.0/ruby/backward -I/home/vagrant/.rvm/rubies/ruby-2.3.1/include/ruby-2.3.0 -I. -O3 -fno-fast-math -ggdb3 -Wall -Wextra -Wno-unused-parameter -Wno-parentheses -Wno-long-long -Wno-missing-field-initializers -Wunused-variable -Wpointer-arith -Wwrite-strings -Wdeclaration-after-statement -Wimplicit-function-declaration -Wdeprecated-declarations -Wno-packed-bitfield-compat -Wno-maybe-uninitialized -fPIC conftest.c -L. -L/home/vagrant/.rvm/rubies/ruby-2.3.1/lib -Wl,-R/home/vagrant/.rvm/rubies/ruby-2.3.1/lib -L. -fstack-protector -rdynamic -Wl,-export-dynamic -Wl,-R/home/vagrant/.rvm/rubies/ruby-2.3.1/lib -L/home/vagrant/.rvm/rubies/ruby-2.3.1/lib -lruby -lpthread -lgmp -ldl -lcrypt -lm -lc"
checked program was:
/* begin */
1: #include "ruby.h"
2:
3: int main(int argc, char **argv)
4: {
5: return 0;
6: }
/* end */
"gcc -o conftest -I/home/vagrant/.rvm/rubies/ruby-2.3.1/include/ruby-2.3.0/x86_64-linux -I/home/vagrant/.rvm/rubies/ruby-2.3.1/include/ruby-2.3.0/ruby/backward -I/home/vagrant/.rvm/rubies/ruby-2.3.1/include/ruby-2.3.0 -I. -O3 -fno-fast-math -ggdb3 -Wall -Wextra -Wno-unused-parameter -Wno-parentheses -Wno-long-long -Wno-missing-field-initializers -Wunused-variable -Wpointer-arith -Wwrite-strings -Wdeclaration-after-statement -Wimplicit-function-declaration -Wdeprecated-declarations -Wno-packed-bitfield-compat -Wno-maybe-uninitialized -fPIC conftest.c -L. -L/home/vagrant/.rvm/rubies/ruby-2.3.1/lib -Wl,-R/home/vagrant/.rvm/rubies/ruby-2.3.1/lib -L. -fstack-protector -rdynamic -Wl,-export-dynamic -Wl,-R/home/vagrant/.rvm/rubies/ruby-2.3.1/lib -L/home/vagrant/.rvm/rubies/ruby-2.3.1/lib -lruby -lpthread -lgmp -ldl -lcrypt -lm -lc"
checked program was:
/* begin */
1: #include "ruby.h"
2:
3: /*top*/
4: extern int t(void);
5: int main(int argc, char **argv)
6: {
7: if (argc > 1000000) {
8: printf("%p", &t);
9: }
10:
11: return 0;
12: }
13: int t(void) { void ((*volatile p)()); p = (void ((*)()))rb_absint_size; return !p; }
/* end */
--------------------
have_func: checking for rb_absint_singlebit_p()... -------------------- yes
"gcc -o conftest -I/home/vagrant/.rvm/rubies/ruby-2.3.1/include/ruby-2.3.0/x86_64-linux -I/home/vagrant/.rvm/rubies/ruby-2.3.1/include/ruby-2.3.0/ruby/backward -I/home/vagrant/.rvm/rubies/ruby-2.3.1/include/ruby-2.3.0 -I. -O3 -fno-fast-math -ggdb3 -Wall -Wextra -Wno-unused-parameter -Wno-parentheses -Wno-long-long -Wno-missing-field-initializers -Wunused-variable -Wpointer-arith -Wwrite-strings -Wdeclaration-after-statement -Wimplicit-function-declaration -Wdeprecated-declarations -Wno-packed-bitfield-compat -Wno-maybe-uninitialized -fPIC conftest.c -L. -L/home/vagrant/.rvm/rubies/ruby-2.3.1/lib -Wl,-R/home/vagrant/.rvm/rubies/ruby-2.3.1/lib -L. -fstack-protector -rdynamic -Wl,-export-dynamic -Wl,-R/home/vagrant/.rvm/rubies/ruby-2.3.1/lib -L/home/vagrant/.rvm/rubies/ruby-2.3.1/lib -lruby -lpthread -lgmp -ldl -lcrypt -lm -lc"
checked program was:
/* begin */
1: #include "ruby.h"
2:
3: /*top*/
4: extern int t(void);
5: int main(int argc, char **argv)
6: {
7: if (argc > 1000000) {
8: printf("%p", &t);
9: }
10:
11: return 0;
12: }
13: int t(void) { void ((*volatile p)()); p = (void ((*)()))rb_absint_singlebit_p; return !p; }
/* end */
--------------------
have_header: checking for ruby/thread.h... -------------------- yes
"gcc -E -I/home/vagrant/.rvm/rubies/ruby-2.3.1/include/ruby-2.3.0/x86_64-linux -I/home/vagrant/.rvm/rubies/ruby-2.3.1/include/ruby-2.3.0/ruby/backward -I/home/vagrant/.rvm/rubies/ruby-2.3.1/include/ruby-2.3.0 -I. -O3 -fno-fast-math -ggdb3 -Wall -Wextra -Wno-unused-parameter -Wno-parentheses -Wno-long-long -Wno-missing-field-initializers -Wunused-variable -Wpointer-arith -Wwrite-strings -Wdeclaration-after-statement -Wimplicit-function-declaration -Wdeprecated-declarations -Wno-packed-bitfield-compat -Wno-maybe-uninitialized -fPIC conftest.c -o conftest.i"
checked program was:
/* begin */
1: #include "ruby.h"
2:
3: #include <ruby/thread.h>
/* end */
--------------------
have_func: checking for rb_thread_call_without_gvl() in ruby/thread.h... -------------------- yes
"gcc -o conftest -I/home/vagrant/.rvm/rubies/ruby-2.3.1/include/ruby-2.3.0/x86_64-linux -I/home/vagrant/.rvm/rubies/ruby-2.3.1/include/ruby-2.3.0/ruby/backward -I/home/vagrant/.rvm/rubies/ruby-2.3.1/include/ruby-2.3.0 -I. -O3 -fno-fast-math -ggdb3 -Wall -Wextra -Wno-unused-parameter -Wno-parentheses -Wno-long-long -Wno-missing-field-initializers -Wunused-variable -Wpointer-arith -Wwrite-strings -Wdeclaration-after-statement -Wimplicit-function-declaration -Wdeprecated-declarations -Wno-packed-bitfield-compat -Wno-maybe-uninitialized -fPIC conftest.c -L. -L/home/vagrant/.rvm/rubies/ruby-2.3.1/lib -Wl,-R/home/vagrant/.rvm/rubies/ruby-2.3.1/lib -L. -fstack-protector -rdynamic -Wl,-export-dynamic -Wl,-R/home/vagrant/.rvm/rubies/ruby-2.3.1/lib -L/home/vagrant/.rvm/rubies/ruby-2.3.1/lib -lruby -lpthread -lgmp -ldl -lcrypt -lm -lc"
checked program was:
/* begin */
1: #include "ruby.h"
2:
3: #include <ruby/thread.h>
4:
5: /*top*/
6: extern int t(void);
7: int main(int argc, char **argv)
8: {
9: if (argc > 1000000) {
10: printf("%p", &t);
11: }
12:
13: return 0;
14: }
15: int t(void) { void ((*volatile p)()); p = (void ((*)()))rb_thread_call_without_gvl; return !p; }
/* end */
--------------------
have_func: checking for rb_thread_blocking_region()... -------------------- no
"gcc -o conftest -I/home/vagrant/.rvm/rubies/ruby-2.3.1/include/ruby-2.3.0/x86_64-linux -I/home/vagrant/.rvm/rubies/ruby-2.3.1/include/ruby-2.3.0/ruby/backward -I/home/vagrant/.rvm/rubies/ruby-2.3.1/include/ruby-2.3.0 -I. -O3 -fno-fast-math -ggdb3 -Wall -Wextra -Wno-unused-parameter -Wno-parentheses -Wno-long-long -Wno-missing-field-initializers -Wunused-variable -Wpointer-arith -Wwrite-strings -Wdeclaration-after-statement -Wimplicit-function-declaration -Wdeprecated-declarations -Wno-packed-bitfield-compat -Wno-maybe-uninitialized -fPIC conftest.c -L. -L/home/vagrant/.rvm/rubies/ruby-2.3.1/lib -Wl,-R/home/vagrant/.rvm/rubies/ruby-2.3.1/lib -L. -fstack-protector -rdynamic -Wl,-export-dynamic -Wl,-R/home/vagrant/.rvm/rubies/ruby-2.3.1/lib -L/home/vagrant/.rvm/rubies/ruby-2.3.1/lib -lruby -lpthread -lgmp -ldl -lcrypt -lm -lc"
conftest.c: In function ‘t’:
conftest.c:13:57: error: ‘rb_thread_blocking_region’ undeclared (first use in this function)
int t(void) { void ((*volatile p)()); p = (void ((*)()))rb_thread_blocking_region; return !p; }
^
conftest.c:13:57: note: each undeclared identifier is reported only once for each function it appears in
checked program was:
/* begin */
1: #include "ruby.h"
2:
3: /*top*/
4: extern int t(void);
5: int main(int argc, char **argv)
6: {
7: if (argc > 1000000) {
8: printf("%p", &t);
9: }
10:
11: return 0;
12: }
13: int t(void) { void ((*volatile p)()); p = (void ((*)()))rb_thread_blocking_region; return !p; }
/* end */
"gcc -o conftest -I/home/vagrant/.rvm/rubies/ruby-2.3.1/include/ruby-2.3.0/x86_64-linux -I/home/vagrant/.rvm/rubies/ruby-2.3.1/include/ruby-2.3.0/ruby/backward -I/home/vagrant/.rvm/rubies/ruby-2.3.1/include/ruby-2.3.0 -I. -O3 -fno-fast-math -ggdb3 -Wall -Wextra -Wno-unused-parameter -Wno-parentheses -Wno-long-long -Wno-missing-field-initializers -Wunused-variable -Wpointer-arith -Wwrite-strings -Wdeclaration-after-statement -Wimplicit-function-declaration -Wdeprecated-declarations -Wno-packed-bitfield-compat -Wno-maybe-uninitialized -fPIC conftest.c -L. -L/home/vagrant/.rvm/rubies/ruby-2.3.1/lib -Wl,-R/home/vagrant/.rvm/rubies/ruby-2.3.1/lib -L. -fstack-protector -rdynamic -Wl,-export-dynamic -Wl,-R/home/vagrant/.rvm/rubies/ruby-2.3.1/lib -L/home/vagrant/.rvm/rubies/ruby-2.3.1/lib -lruby -lpthread -lgmp -ldl -lcrypt -lm -lc"
/tmp/ccRId0Fz.o: In function `t':
/vagrant/plugins/curvefever/gems/2.3.1/gems/mysql2-0.4.5/ext/mysql2/conftest.c:14: undefined reference to `rb_thread_blocking_region'
collect2: error: ld returned 1 exit status
checked program was:
/* begin */
1: #include "ruby.h"
2:
3: /*top*/
4: extern int t(void);
5: int main(int argc, char **argv)
6: {
7: if (argc > 1000000) {
8: printf("%p", &t);
9: }
10:
11: return 0;
12: }
13: extern void rb_thread_blocking_region();
14: int t(void) { rb_thread_blocking_region(); return 0; }
/* end */
--------------------
have_func: checking for rb_wait_for_single_fd()... -------------------- yes
"gcc -o conftest -I/home/vagrant/.rvm/rubies/ruby-2.3.1/include/ruby-2.3.0/x86_64-linux -I/home/vagrant/.rvm/rubies/ruby-2.3.1/include/ruby-2.3.0/ruby/backward -I/home/vagrant/.rvm/rubies/ruby-2.3.1/include/ruby-2.3.0 -I. -O3 -fno-fast-math -ggdb3 -Wall -Wextra -Wno-unused-parameter -Wno-parentheses -Wno-long-long -Wno-missing-field-initializers -Wunused-variable -Wpointer-arith -Wwrite-strings -Wdeclaration-after-statement -Wimplicit-function-declaration -Wdeprecated-declarations -Wno-packed-bitfield-compat -Wno-maybe-uninitialized -fPIC conftest.c -L. -L/home/vagrant/.rvm/rubies/ruby-2.3.1/lib -Wl,-R/home/vagrant/.rvm/rubies/ruby-2.3.1/lib -L. -fstack-protector -rdynamic -Wl,-export-dynamic -Wl,-R/home/vagrant/.rvm/rubies/ruby-2.3.1/lib -L/home/vagrant/.rvm/rubies/ruby-2.3.1/lib -lruby -lpthread -lgmp -ldl -lcrypt -lm -lc"
conftest.c: In function ‘t’:
conftest.c:13:57: error: ‘rb_wait_for_single_fd’ undeclared (first use in this function)
int t(void) { void ((*volatile p)()); p = (void ((*)()))rb_wait_for_single_fd; return !p; }
^
conftest.c:13:57: note: each undeclared identifier is reported only once for each function it appears in
checked program was:
/* begin */
1: #include "ruby.h"
2:
3: /*top*/
4: extern int t(void);
5: int main(int argc, char **argv)
6: {
7: if (argc > 1000000) {
8: printf("%p", &t);
9: }
10:
11: return 0;
12: }
13: int t(void) { void ((*volatile p)()); p = (void ((*)()))rb_wait_for_single_fd; return !p; }
/* end */
"gcc -o conftest -I/home/vagrant/.rvm/rubies/ruby-2.3.1/include/ruby-2.3.0/x86_64-linux -I/home/vagrant/.rvm/rubies/ruby-2.3.1/include/ruby-2.3.0/ruby/backward -I/home/vagrant/.rvm/rubies/ruby-2.3.1/include/ruby-2.3.0 -I. -O3 -fno-fast-math -ggdb3 -Wall -Wextra -Wno-unused-parameter -Wno-parentheses -Wno-long-long -Wno-missing-field-initializers -Wunused-variable -Wpointer-arith -Wwrite-strings -Wdeclaration-after-statement -Wimplicit-function-declaration -Wdeprecated-declarations -Wno-packed-bitfield-compat -Wno-maybe-uninitialized -fPIC conftest.c -L. -L/home/vagrant/.rvm/rubies/ruby-2.3.1/lib -Wl,-R/home/vagrant/.rvm/rubies/ruby-2.3.1/lib -L. -fstack-protector -rdynamic -Wl,-export-dynamic -Wl,-R/home/vagrant/.rvm/rubies/ruby-2.3.1/lib -L/home/vagrant/.rvm/rubies/ruby-2.3.1/lib -lruby -lpthread -lgmp -ldl -lcrypt -lm -lc"
checked program was:
/* begin */
1: #include "ruby.h"
2:
3: /*top*/
4: extern int t(void);
5: int main(int argc, char **argv)
6: {
7: if (argc > 1000000) {
8: printf("%p", &t);
9: }
10:
11: return 0;
12: }
13: extern void rb_wait_for_single_fd();
14: int t(void) { rb_wait_for_single_fd(); return 0; }
/* end */
--------------------
have_func: checking for rb_hash_dup()... -------------------- yes
"gcc -o conftest -I/home/vagrant/.rvm/rubies/ruby-2.3.1/include/ruby-2.3.0/x86_64-linux -I/home/vagrant/.rvm/rubies/ruby-2.3.1/include/ruby-2.3.0/ruby/backward -I/home/vagrant/.rvm/rubies/ruby-2.3.1/include/ruby-2.3.0 -I. -O3 -fno-fast-math -ggdb3 -Wall -Wextra -Wno-unused-parameter -Wno-parentheses -Wno-long-long -Wno-missing-field-initializers -Wunused-variable -Wpointer-arith -Wwrite-strings -Wdeclaration-after-statement -Wimplicit-function-declaration -Wdeprecated-declarations -Wno-packed-bitfield-compat -Wno-maybe-uninitialized -fPIC conftest.c -L. -L/home/vagrant/.rvm/rubies/ruby-2.3.1/lib -Wl,-R/home/vagrant/.rvm/rubies/ruby-2.3.1/lib -L. -fstack-protector -rdynamic -Wl,-export-dynamic -Wl,-R/home/vagrant/.rvm/rubies/ruby-2.3.1/lib -L/home/vagrant/.rvm/rubies/ruby-2.3.1/lib -lruby -lpthread -lgmp -ldl -lcrypt -lm -lc"
checked program was:
/* begin */
1: #include "ruby.h"
2:
3: /*top*/
4: extern int t(void);
5: int main(int argc, char **argv)
6: {
7: if (argc > 1000000) {
8: printf("%p", &t);
9: }
10:
11: return 0;
12: }
13: int t(void) { void ((*volatile p)()); p = (void ((*)()))rb_hash_dup; return !p; }
/* end */
--------------------
have_func: checking for rb_intern3()... -------------------- yes
"gcc -o conftest -I/home/vagrant/.rvm/rubies/ruby-2.3.1/include/ruby-2.3.0/x86_64-linux -I/home/vagrant/.rvm/rubies/ruby-2.3.1/include/ruby-2.3.0/ruby/backward -I/home/vagrant/.rvm/rubies/ruby-2.3.1/include/ruby-2.3.0 -I. -O3 -fno-fast-math -ggdb3 -Wall -Wextra -Wno-unused-parameter -Wno-parentheses -Wno-long-long -Wno-missing-field-initializers -Wunused-variable -Wpointer-arith -Wwrite-strings -Wdeclaration-after-statement -Wimplicit-function-declaration -Wdeprecated-declarations -Wno-packed-bitfield-compat -Wno-maybe-uninitialized -fPIC conftest.c -L. -L/home/vagrant/.rvm/rubies/ruby-2.3.1/lib -Wl,-R/home/vagrant/.rvm/rubies/ruby-2.3.1/lib -L. -fstack-protector -rdynamic -Wl,-export-dynamic -Wl,-R/home/vagrant/.rvm/rubies/ruby-2.3.1/lib -L/home/vagrant/.rvm/rubies/ruby-2.3.1/lib -lruby -lpthread -lgmp -ldl -lcrypt -lm -lc"
conftest.c: In function ‘t’:
conftest.c:13:57: error: ‘rb_intern3’ undeclared (first use in this function)
int t(void) { void ((*volatile p)()); p = (void ((*)()))rb_intern3; return !p; }
^
conftest.c:13:57: note: each undeclared identifier is reported only once for each function it appears in
checked program was:
/* begin */
1: #include "ruby.h"
2:
3: /*top*/
4: extern int t(void);
5: int main(int argc, char **argv)
6: {
7: if (argc > 1000000) {
8: printf("%p", &t);
9: }
10:
11: return 0;
12: }
13: int t(void) { void ((*volatile p)()); p = (void ((*)()))rb_intern3; return !p; }
/* end */
"gcc -o conftest -I/home/vagrant/.rvm/rubies/ruby-2.3.1/include/ruby-2.3.0/x86_64-linux -I/home/vagrant/.rvm/rubies/ruby-2.3.1/include/ruby-2.3.0/ruby/backward -I/home/vagrant/.rvm/rubies/ruby-2.3.1/include/ruby-2.3.0 -I. -O3 -fno-fast-math -ggdb3 -Wall -Wextra -Wno-unused-parameter -Wno-parentheses -Wno-long-long -Wno-missing-field-initializers -Wunused-variable -Wpointer-arith -Wwrite-strings -Wdeclaration-after-statement -Wimplicit-function-declaration -Wdeprecated-declarations -Wno-packed-bitfield-compat -Wno-maybe-uninitialized -fPIC conftest.c -L. -L/home/vagrant/.rvm/rubies/ruby-2.3.1/lib -Wl,-R/home/vagrant/.rvm/rubies/ruby-2.3.1/lib -L. -fstack-protector -rdynamic -Wl,-export-dynamic -Wl,-R/home/vagrant/.rvm/rubies/ruby-2.3.1/lib -L/home/vagrant/.rvm/rubies/ruby-2.3.1/lib -lruby -lpthread -lgmp -ldl -lcrypt -lm -lc"
checked program was:
/* begin */
1: #include "ruby.h"
2:
3: /*top*/
4: extern int t(void);
5: int main(int argc, char **argv)
6: {
7: if (argc > 1000000) {
8: printf("%p", &t);
9: }
10:
11: return 0;
12: }
13: extern void rb_intern3();
14: int t(void) { rb_intern3(); return 0; }
/* end */
--------------------
have_func: checking for rb_big_cmp()... -------------------- yes
"gcc -o conftest -I/home/vagrant/.rvm/rubies/ruby-2.3.1/include/ruby-2.3.0/x86_64-linux -I/home/vagrant/.rvm/rubies/ruby-2.3.1/include/ruby-2.3.0/ruby/backward -I/home/vagrant/.rvm/rubies/ruby-2.3.1/include/ruby-2.3.0 -I. -O3 -fno-fast-math -ggdb3 -Wall -Wextra -Wno-unused-parameter -Wno-parentheses -Wno-long-long -Wno-missing-field-initializers -Wunused-variable -Wpointer-arith -Wwrite-strings -Wdeclaration-after-statement -Wimplicit-function-declaration -Wdeprecated-declarations -Wno-packed-bitfield-compat -Wno-maybe-uninitialized -fPIC conftest.c -L. -L/home/vagrant/.rvm/rubies/ruby-2.3.1/lib -Wl,-R/home/vagrant/.rvm/rubies/ruby-2.3.1/lib -L. -fstack-protector -rdynamic -Wl,-export-dynamic -Wl,-R/home/vagrant/.rvm/rubies/ruby-2.3.1/lib -L/home/vagrant/.rvm/rubies/ruby-2.3.1/lib -lruby -lpthread -lgmp -ldl -lcrypt -lm -lc"
checked program was:
/* begin */
1: #include "ruby.h"
2:
3: /*top*/
4: extern int t(void);
5: int main(int argc, char **argv)
6: {
7: if (argc > 1000000) {
8: printf("%p", &t);
9: }
10:
11: return 0;
12: }
13: int t(void) { void ((*volatile p)()); p = (void ((*)()))rb_big_cmp; return !p; }
/* end */
--------------------
have_header: checking for mysql.h... -------------------- yes
"gcc -E -I/home/vagrant/.rvm/rubies/ruby-2.3.1/include/ruby-2.3.0/x86_64-linux -I/home/vagrant/.rvm/rubies/ruby-2.3.1/include/ruby-2.3.0/ruby/backward -I/home/vagrant/.rvm/rubies/ruby-2.3.1/include/ruby-2.3.0 -I. -I/usr/include/mysql -O3 -fno-fast-math -ggdb3 -Wall -Wextra -Wno-unused-parameter -Wno-parentheses -Wno-long-long -Wno-missing-field-initializers -Wunused-variable -Wpointer-arith -Wwrite-strings -Wdeclaration-after-statement -Wimplicit-function-declaration -Wdeprecated-declarations -Wno-packed-bitfield-compat -Wno-maybe-uninitialized -fPIC conftest.c -o conftest.i"
checked program was:
/* begin */
1: #include "ruby.h"
2:
3: #include <mysql.h>
/* end */
--------------------
have_const: checking for SSL_MODE_DISABLED in mysql.h... -------------------- yes
"gcc -I/home/vagrant/.rvm/rubies/ruby-2.3.1/include/ruby-2.3.0/x86_64-linux -I/home/vagrant/.rvm/rubies/ruby-2.3.1/include/ruby-2.3.0/ruby/backward -I/home/vagrant/.rvm/rubies/ruby-2.3.1/include/ruby-2.3.0 -I. -I/usr/include/mysql -O3 -fno-fast-math -ggdb3 -Wall -Wextra -Wno-unused-parameter -Wno-parentheses -Wno-long-long -Wno-missing-field-initializers -Wunused-variable -Wpointer-arith -Wwrite-strings -Wdeclaration-after-statement -Wimplicit-function-declaration -Wdeprecated-declarations -Wno-packed-bitfield-compat -Wno-maybe-uninitialized -fPIC -c conftest.c"
checked program was:
/* begin */
1: #include "ruby.h"
2:
3: #include <mysql.h>
4:
5: /*top*/
6: typedef int conftest_type;
7: conftest_type conftestval = (int)SSL_MODE_DISABLED;
/* end */
--------------------
have_const: checking for SSL_MODE_PREFERRED in mysql.h... -------------------- yes
"gcc -I/home/vagrant/.rvm/rubies/ruby-2.3.1/include/ruby-2.3.0/x86_64-linux -I/home/vagrant/.rvm/rubies/ruby-2.3.1/include/ruby-2.3.0/ruby/backward -I/home/vagrant/.rvm/rubies/ruby-2.3.1/include/ruby-2.3.0 -I. -I/usr/include/mysql -O3 -fno-fast-math -ggdb3 -Wall -Wextra -Wno-unused-parameter -Wno-parentheses -Wno-long-long -Wno-missing-field-initializers -Wunused-variable -Wpointer-arith -Wwrite-strings -Wdeclaration-after-statement -Wimplicit-function-declaration -Wdeprecated-declarations -Wno-packed-bitfield-compat -Wno-maybe-uninitialized -fPIC -c conftest.c"
checked program was:
/* begin */
1: #include "ruby.h"
2:
3: #include <mysql.h>
4:
5: /*top*/
6: typedef int conftest_type;
7: conftest_type conftestval = (int)SSL_MODE_PREFERRED;
/* end */
--------------------
have_const: checking for SSL_MODE_REQUIRED in mysql.h... -------------------- yes
"gcc -I/home/vagrant/.rvm/rubies/ruby-2.3.1/include/ruby-2.3.0/x86_64-linux -I/home/vagrant/.rvm/rubies/ruby-2.3.1/include/ruby-2.3.0/ruby/backward -I/home/vagrant/.rvm/rubies/ruby-2.3.1/include/ruby-2.3.0 -I. -I/usr/include/mysql -O3 -fno-fast-math -ggdb3 -Wall -Wextra -Wno-unused-parameter -Wno-parentheses -Wno-long-long -Wno-missing-field-initializers -Wunused-variable -Wpointer-arith -Wwrite-strings -Wdeclaration-after-statement -Wimplicit-function-declaration -Wdeprecated-declarations -Wno-packed-bitfield-compat -Wno-maybe-uninitialized -fPIC -c conftest.c"
checked program was:
/* begin */
1: #include "ruby.h"
2:
3: #include <mysql.h>
4:
5: /*top*/
6: typedef int conftest_type;
7: conftest_type conftestval = (int)SSL_MODE_REQUIRED;
/* end */
--------------------
have_const: checking for SSL_MODE_VERIFY_CA in mysql.h... -------------------- yes
"gcc -I/home/vagrant/.rvm/rubies/ruby-2.3.1/include/ruby-2.3.0/x86_64-linux -I/home/vagrant/.rvm/rubies/ruby-2.3.1/include/ruby-2.3.0/ruby/backward -I/home/vagrant/.rvm/rubies/ruby-2.3.1/include/ruby-2.3.0 -I. -I/usr/include/mysql -O3 -fno-fast-math -ggdb3 -Wall -Wextra -Wno-unused-parameter -Wno-parentheses -Wno-long-long -Wno-missing-field-initializers -Wunused-variable -Wpointer-arith -Wwrite-strings -Wdeclaration-after-statement -Wimplicit-function-declaration -Wdeprecated-declarations -Wno-packed-bitfield-compat -Wno-maybe-uninitialized -fPIC -c conftest.c"
checked program was:
/* begin */
1: #include "ruby.h"
2:
3: #include <mysql.h>
4:
5: /*top*/
6: typedef int conftest_type;
7: conftest_type conftestval = (int)SSL_MODE_VERIFY_CA;
/* end */
--------------------
have_const: checking for SSL_MODE_VERIFY_IDENTITY in mysql.h... -------------------- yes
"gcc -I/home/vagrant/.rvm/rubies/ruby-2.3.1/include/ruby-2.3.0/x86_64-linux -I/home/vagrant/.rvm/rubies/ruby-2.3.1/include/ruby-2.3.0/ruby/backward -I/home/vagrant/.rvm/rubies/ruby-2.3.1/include/ruby-2.3.0 -I. -I/usr/include/mysql -O3 -fno-fast-math -ggdb3 -Wall -Wextra -Wno-unused-parameter -Wno-parentheses -Wno-long-long -Wno-missing-field-initializers -Wunused-variable -Wpointer-arith -Wwrite-strings -Wdeclaration-after-statement -Wimplicit-function-declaration -Wdeprecated-declarations -Wno-packed-bitfield-compat -Wno-maybe-uninitialized -fPIC -c conftest.c"
checked program was:
/* begin */
1: #include "ruby.h"
2:
3: #include <mysql.h>
4:
5: /*top*/
6: typedef int conftest_type;
7: conftest_type conftestval = (int)SSL_MODE_VERIFY_IDENTITY;
/* end */
--------------------
have_header: checking for errmsg.h... -------------------- yes
"gcc -E -I/home/vagrant/.rvm/rubies/ruby-2.3.1/include/ruby-2.3.0/x86_64-linux -I/home/vagrant/.rvm/rubies/ruby-2.3.1/include/ruby-2.3.0/ruby/backward -I/home/vagrant/.rvm/rubies/ruby-2.3.1/include/ruby-2.3.0 -I. -I/usr/include/mysql -O3 -fno-fast-math -ggdb3 -Wall -Wextra -Wno-unused-parameter -Wno-parentheses -Wno-long-long -Wno-missing-field-initializers -Wunused-variable -Wpointer-arith -Wwrite-strings -Wdeclaration-after-statement -Wimplicit-function-declaration -Wdeprecated-declarations -Wno-packed-bitfield-compat -Wno-maybe-uninitialized -fPIC -DFULL_SSL_MODE_SUPPORT conftest.c -o conftest.i"
checked program was:
/* begin */
1: #include "ruby.h"
2:
3: #include <errmsg.h>
/* end */
--------------------
have_header: checking for mysqld_error.h... -------------------- yes
"gcc -E -I/home/vagrant/.rvm/rubies/ruby-2.3.1/include/ruby-2.3.0/x86_64-linux -I/home/vagrant/.rvm/rubies/ruby-2.3.1/include/ruby-2.3.0/ruby/backward -I/home/vagrant/.rvm/rubies/ruby-2.3.1/include/ruby-2.3.0 -I. -I/usr/include/mysql -O3 -fno-fast-math -ggdb3 -Wall -Wextra -Wno-unused-parameter -Wno-parentheses -Wno-long-long -Wno-missing-field-initializers -Wunused-variable -Wpointer-arith -Wwrite-strings -Wdeclaration-after-statement -Wimplicit-function-declaration -Wdeprecated-declarations -Wno-packed-bitfield-compat -Wno-maybe-uninitialized -fPIC -DFULL_SSL_MODE_SUPPORT conftest.c -o conftest.i"
checked program was:
/* begin */
1: #include "ruby.h"
2:
3: #include <mysqld_error.h>
/* end */
--------------------
"gcc -o conftest -I/home/vagrant/.rvm/rubies/ruby-2.3.1/include/ruby-2.3.0/x86_64-linux -I/home/vagrant/.rvm/rubies/ruby-2.3.1/include/ruby-2.3.0/ruby/backward -I/home/vagrant/.rvm/rubies/ruby-2.3.1/include/ruby-2.3.0 -I. -I/usr/include/mysql -O3 -fno-fast-math -ggdb3 -Wall -Wextra -Wno-unused-parameter -Wno-parentheses -Wno-long-long -Wno-missing-field-initializers -Wunused-variable -Wpointer-arith -Wwrite-strings -Wdeclaration-after-statement -Wimplicit-function-declaration -Wdeprecated-declarations -Wno-packed-bitfield-compat -Wno-maybe-uninitialized -fPIC -DFULL_SSL_MODE_SUPPORT conftest.c -L. -L/home/vagrant/.rvm/rubies/ruby-2.3.1/lib -Wl,-R/home/vagrant/.rvm/rubies/ruby-2.3.1/lib -L. -fstack-protector -rdynamic -Wl,-export-dynamic -L/usr/lib/x86_64-linux-gnu -lmysqlclient -lpthread -lz -lm -lrt -ldl -Wl,-R/home/vagrant/.rvm/rubies/ruby-2.3.1/lib -L/home/vagrant/.rvm/rubies/ruby-2.3.1/lib -lruby -Werror -Weverything -lpthread -lgmp -ldl -lcrypt -lm -lc"
gcc: error: unrecognized command line option ‘-Weverything’
checked program was:
/* begin */
1: #include "ruby.h"
2:
3: int main() {return 0;}
/* end */
"gcc -o conftest -I/home/vagrant/.rvm/rubies/ruby-2.3.1/include/ruby-2.3.0/x86_64-linux -I/home/vagrant/.rvm/rubies/ruby-2.3.1/include/ruby-2.3.0/ruby/backward -I/home/vagrant/.rvm/rubies/ruby-2.3.1/include/ruby-2.3.0 -I. -I/usr/include/mysql -O3 -fno-fast-math -ggdb3 -Wall -Wextra -Wno-unused-parameter -Wno-parentheses -Wno-long-long -Wno-missing-field-initializers -Wunused-variable -Wpointer-arith -Wwrite-strings -Wdeclaration-after-statement -Wimplicit-function-declaration -Wdeprecated-declarations -Wno-packed-bitfield-compat -Wno-maybe-uninitialized -fPIC -DFULL_SSL_MODE_SUPPORT conftest.c -L. -L/home/vagrant/.rvm/rubies/ruby-2.3.1/lib -Wl,-R/home/vagrant/.rvm/rubies/ruby-2.3.1/lib -L. -fstack-protector -rdynamic -Wl,-export-dynamic -L/usr/lib/x86_64-linux-gnu -lmysqlclient -lpthread -lz -lm -lrt -ldl -Wl,-R/home/vagrant/.rvm/rubies/ruby-2.3.1/lib -L/home/vagrant/.rvm/rubies/ruby-2.3.1/lib -lruby -Werror -Wno-bad-function-cast -lpthread -lgmp -ldl -lcrypt -lm -lc"
checked program was:
/* begin */
1: #include "ruby.h"
2:
3: int main() {return 0;}
/* end */
"gcc -o conftest -I/home/vagrant/.rvm/rubies/ruby-2.3.1/include/ruby-2.3.0/x86_64-linux -I/home/vagrant/.rvm/rubies/ruby-2.3.1/include/ruby-2.3.0/ruby/backward -I/home/vagrant/.rvm/rubies/ruby-2.3.1/include/ruby-2.3.0 -I. -I/usr/include/mysql -O3 -fno-fast-math -ggdb3 -Wall -Wextra -Wno-unused-parameter -Wno-parentheses -Wno-long-long -Wno-missing-field-initializers -Wunused-variable -Wpointer-arith -Wwrite-strings -Wdeclaration-after-statement -Wimplicit-function-declaration -Wdeprecated-declarations -Wno-packed-bitfield-compat -Wno-maybe-uninitialized -fPIC -DFULL_SSL_MODE_SUPPORT conftest.c -L. -L/home/vagrant/.rvm/rubies/ruby-2.3.1/lib -Wl,-R/home/vagrant/.rvm/rubies/ruby-2.3.1/lib -L. -fstack-protector -rdynamic -Wl,-export-dynamic -L/usr/lib/x86_64-linux-gnu -lmysqlclient -lpthread -lz -lm -lrt -ldl -Wl,-R/home/vagrant/.rvm/rubies/ruby-2.3.1/lib -L/home/vagrant/.rvm/rubies/ruby-2.3.1/lib -lruby -Werror -Wno-conditional-uninitialized -lpthread -lgmp -ldl -lcrypt -lm -lc"
checked program was:
/* begin */
1: #include "ruby.h"
2:
3: int main() {return 0;}
/* end */
"gcc -o conftest -I/home/vagrant/.rvm/rubies/ruby-2.3.1/include/ruby-2.3.0/x86_64-linux -I/home/vagrant/.rvm/rubies/ruby-2.3.1/include/ruby-2.3.0/ruby/backward -I/home/vagrant/.rvm/rubies/ruby-2.3.1/include/ruby-2.3.0 -I. -I/usr/include/mysql -O3 -fno-fast-math -ggdb3 -Wall -Wextra -Wno-unused-parameter -Wno-parentheses -Wno-long-long -Wno-missing-field-initializers -Wunused-variable -Wpointer-arith -Wwrite-strings -Wdeclaration-after-statement -Wimplicit-function-declaration -Wdeprecated-declarations -Wno-packed-bitfield-compat -Wno-maybe-uninitialized -fPIC -DFULL_SSL_MODE_SUPPORT conftest.c -L. -L/home/vagrant/.rvm/rubies/ruby-2.3.1/lib -Wl,-R/home/vagrant/.rvm/rubies/ruby-2.3.1/lib -L. -fstack-protector -rdynamic -Wl,-export-dynamic -L/usr/lib/x86_64-linux-gnu -lmysqlclient -lpthread -lz -lm -lrt -ldl -Wl,-R/home/vagrant/.rvm/rubies/ruby-2.3.1/lib -L/home/vagrant/.rvm/rubies/ruby-2.3.1/lib -lruby -Werror -Wno-covered-switch-default -lpthread -lgmp -ldl -lcrypt -lm -lc"
checked program was:
/* begin */
1: #include "ruby.h"
2:
3: int main() {return 0;}
/* end */
"gcc -o conftest -I/home/vagrant/.rvm/rubies/ruby-2.3.1/include/ruby-2.3.0/x86_64-linux -I/home/vagrant/.rvm/rubies/ruby-2.3.1/include/ruby-2.3.0/ruby/backward -I/home/vagrant/.rvm/rubies/ruby-2.3.1/include/ruby-2.3.0 -I. -I/usr/include/mysql -O3 -fno-fast-math -ggdb3 -Wall -Wextra -Wno-unused-parameter -Wno-parentheses -Wno-long-long -Wno-missing-field-initializers -Wunused-variable -Wpointer-arith -Wwrite-strings -Wdeclaration-after-statement -Wimplicit-function-declaration -Wdeprecated-declarations -Wno-packed-bitfield-compat -Wno-maybe-uninitialized -fPIC -DFULL_SSL_MODE_SUPPORT conftest.c -L. -L/home/vagrant/.rvm/rubies/ruby-2.3.1/lib -Wl,-R/home/vagrant/.rvm/rubies/ruby-2.3.1/lib -L. -fstack-protector -rdynamic -Wl,-export-dynamic -L/usr/lib/x86_64-linux-gnu -lmysqlclient -lpthread -lz -lm -lrt -ldl -Wl,-R/home/vagrant/.rvm/rubies/ruby-2.3.1/lib -L/home/vagrant/.rvm/rubies/ruby-2.3.1/lib -lruby -Werror -Wno-declaration-after-statement -lpthread -lgmp -ldl -lcrypt -lm -lc"
checked program was:
/* begin */
1: #include "ruby.h"
2:
3: int main() {return 0;}
/* end */
"gcc -o conftest -I/home/vagrant/.rvm/rubies/ruby-2.3.1/include/ruby-2.3.0/x86_64-linux -I/home/vagrant/.rvm/rubies/ruby-2.3.1/include/ruby-2.3.0/ruby/backward -I/home/vagrant/.rvm/rubies/ruby-2.3.1/include/ruby-2.3.0 -I. -I/usr/include/mysql -O3 -fno-fast-math -ggdb3 -Wall -Wextra -Wno-unused-parameter -Wno-parentheses -Wno-long-long -Wno-missing-field-initializers -Wunused-variable -Wpointer-arith -Wwrite-strings -Wdeclaration-after-statement -Wimplicit-function-declaration -Wdeprecated-declarations -Wno-packed-bitfield-compat -Wno-maybe-uninitialized -fPIC -DFULL_SSL_MODE_SUPPORT conftest.c -L. -L/home/vagrant/.rvm/rubies/ruby-2.3.1/lib -Wl,-R/home/vagrant/.rvm/rubies/ruby-2.3.1/lib -L. -fstack-protector -rdynamic -Wl,-export-dynamic -L/usr/lib/x86_64-linux-gnu -lmysqlclient -lpthread -lz -lm -lrt -ldl -Wl,-R/home/vagrant/.rvm/rubies/ruby-2.3.1/lib -L/home/vagrant/.rvm/rubies/ruby-2.3.1/lib -lruby -Werror -Wno-disabled-macro-expansion -lpthread -lgmp -ldl -lcrypt -lm -lc"
checked program was:
/* begin */
1: #include "ruby.h"
2:
3: int main() {return 0;}
/* end */
"gcc -o conftest -I/home/vagrant/.rvm/rubies/ruby-2.3.1/include/ruby-2.3.0/x86_64-linux -I/home/vagrant/.rvm/rubies/ruby-2.3.1/include/ruby-2.3.0/ruby/backward -I/home/vagrant/.rvm/rubies/ruby-2.3.1/include/ruby-2.3.0 -I. -I/usr/include/mysql -O3 -fno-fast-math -ggdb3 -Wall -Wextra -Wno-unused-parameter -Wno-parentheses -Wno-long-long -Wno-missing-field-initializers -Wunused-variable -Wpointer-arith -Wwrite-strings -Wdeclaration-after-statement -Wimplicit-function-declaration -Wdeprecated-declarations -Wno-packed-bitfield-compat -Wno-maybe-uninitialized -fPIC -DFULL_SSL_MODE_SUPPORT conftest.c -L. -L/home/vagrant/.rvm/rubies/ruby-2.3.1/lib -Wl,-R/home/vagrant/.rvm/rubies/ruby-2.3.1/lib -L. -fstack-protector -rdynamic -Wl,-export-dynamic -L/usr/lib/x86_64-linux-gnu -lmysqlclient -lpthread -lz -lm -lrt -ldl -Wl,-R/home/vagrant/.rvm/rubies/ruby-2.3.1/lib -L/home/vagrant/.rvm/rubies/ruby-2.3.1/lib -lruby -Werror -Wno-documentation-unknown-command -lpthread -lgmp -ldl -lcrypt -lm -lc"
checked program was:
/* begin */
1: #include "ruby.h"
2:
3: int main() {return 0;}
/* end */
"gcc -o conftest -I/home/vagrant/.rvm/rubies/ruby-2.3.1/include/ruby-2.3.0/x86_64-linux -I/home/vagrant/.rvm/rubies/ruby-2.3.1/include/ruby-2.3.0/ruby/backward -I/home/vagrant/.rvm/rubies/ruby-2.3.1/include/ruby-2.3.0 -I. -I/usr/include/mysql -O3 -fno-fast-math -ggdb3 -Wall -Wextra -Wno-unused-parameter -Wno-parentheses -Wno-long-long -Wno-missing-field-initializers -Wunused-variable -Wpointer-arith -Wwrite-strings -Wdeclaration-after-statement -Wimplicit-function-declaration -Wdeprecated-declarations -Wno-packed-bitfield-compat -Wno-maybe-uninitialized -fPIC -DFULL_SSL_MODE_SUPPORT conftest.c -L. -L/home/vagrant/.rvm/rubies/ruby-2.3.1/lib -Wl,-R/home/vagrant/.rvm/rubies/ruby-2.3.1/lib -L. -fstack-protector -rdynamic -Wl,-export-dynamic -L/usr/lib/x86_64-linux-gnu -lmysqlclient -lpthread -lz -lm -lrt -ldl -Wl,-R/home/vagrant/.rvm/rubies/ruby-2.3.1/lib -L/home/vagrant/.rvm/rubies/ruby-2.3.1/lib -lruby -Werror -Wno-missing-field-initializers -lpthread -lgmp -ldl -lcrypt -lm -lc"
checked program was:
/* begin */
1: #include "ruby.h"
2:
3: int main() {return 0;}
/* end */
"gcc -o conftest -I/home/vagrant/.rvm/rubies/ruby-2.3.1/include/ruby-2.3.0/x86_64-linux -I/home/vagrant/.rvm/rubies/ruby-2.3.1/include/ruby-2.3.0/ruby/backward -I/home/vagrant/.rvm/rubies/ruby-2.3.1/include/ruby-2.3.0 -I. -I/usr/include/mysql -O3 -fno-fast-math -ggdb3 -Wall -Wextra -Wno-unused-parameter -Wno-parentheses -Wno-long-long -Wno-missing-field-initializers -Wunused-variable -Wpointer-arith -Wwrite-strings -Wdeclaration-after-statement -Wimplicit-function-declaration -Wdeprecated-declarations -Wno-packed-bitfield-compat -Wno-maybe-uninitialized -fPIC -DFULL_SSL_MODE_SUPPORT conftest.c -L. -L/home/vagrant/.rvm/rubies/ruby-2.3.1/lib -Wl,-R/home/vagrant/.rvm/rubies/ruby-2.3.1/lib -L. -fstack-protector -rdynamic -Wl,-export-dynamic -L/usr/lib/x86_64-linux-gnu -lmysqlclient -lpthread -lz -lm -lrt -ldl -Wl,-R/home/vagrant/.rvm/rubies/ruby-2.3.1/lib -L/home/vagrant/.rvm/rubies/ruby-2.3.1/lib -lruby -Werror -Wno-missing-variable-declarations -lpthread -lgmp -ldl -lcrypt -lm -lc"
checked program was:
/* begin */
1: #include "ruby.h"
2:
3: int main() {return 0;}
/* end */
"gcc -o conftest -I/home/vagrant/.rvm/rubies/ruby-2.3.1/include/ruby-2.3.0/x86_64-linux -I/home/vagrant/.rvm/rubies/ruby-2.3.1/include/ruby-2.3.0/ruby/backward -I/home/vagrant/.rvm/rubies/ruby-2.3.1/include/ruby-2.3.0 -I. -I/usr/include/mysql -O3 -fno-fast-math -ggdb3 -Wall -Wextra -Wno-unused-parameter -Wno-parentheses -Wno-long-long -Wno-missing-field-initializers -Wunused-variable -Wpointer-arith -Wwrite-strings -Wdeclaration-after-statement -Wimplicit-function-declaration -Wdeprecated-declarations -Wno-packed-bitfield-compat -Wno-maybe-uninitialized -fPIC -DFULL_SSL_MODE_SUPPORT conftest.c -L. -L/home/vagrant/.rvm/rubies/ruby-2.3.1/lib -Wl,-R/home/vagrant/.rvm/rubies/ruby-2.3.1/lib -L. -fstack-protector -rdynamic -Wl,-export-dynamic -L/usr/lib/x86_64-linux-gnu -lmysqlclient -lpthread -lz -lm -lrt -ldl -Wl,-R/home/vagrant/.rvm/rubies/ruby-2.3.1/lib -L/home/vagrant/.rvm/rubies/ruby-2.3.1/lib -lruby -Werror -Wno-padded -lpthread -lgmp -ldl -lcrypt -lm -lc"
checked program was:
/* begin */
1: #include "ruby.h"
2:
3: int main() {return 0;}
/* end */
"gcc -o conftest -I/home/vagrant/.rvm/rubies/ruby-2.3.1/include/ruby-2.3.0/x86_64-linux -I/home/vagrant/.rvm/rubies/ruby-2.3.1/include/ruby-2.3.0/ruby/backward -I/home/vagrant/.rvm/rubies/ruby-2.3.1/include/ruby-2.3.0 -I. -I/usr/include/mysql -O3 -fno-fast-math -ggdb3 -Wall -Wextra -Wno-unused-parameter -Wno-parentheses -Wno-long-long -Wno-missing-field-initializers -Wunused-variable -Wpointer-arith -Wwrite-strings -Wdeclaration-after-statement -Wimplicit-function-declaration -Wdeprecated-declarations -Wno-packed-bitfield-compat -Wno-maybe-uninitialized -fPIC -DFULL_SSL_MODE_SUPPORT conftest.c -L. -L/home/vagrant/.rvm/rubies/ruby-2.3.1/lib -Wl,-R/home/vagrant/.rvm/rubies/ruby-2.3.1/lib -L. -fstack-protector -rdynamic -Wl,-export-dynamic -L/usr/lib/x86_64-linux-gnu -lmysqlclient -lpthread -lz -lm -lrt -ldl -Wl,-R/home/vagrant/.rvm/rubies/ruby-2.3.1/lib -L/home/vagrant/.rvm/rubies/ruby-2.3.1/lib -lruby -Werror -Wno-reserved-id-macro -lpthread -lgmp -ldl -lcrypt -lm -lc"
checked program was:
/* begin */
1: #include "ruby.h"
2:
3: int main() {return 0;}
/* end */
"gcc -o conftest -I/home/vagrant/.rvm/rubies/ruby-2.3.1/include/ruby-2.3.0/x86_64-linux -I/home/vagrant/.rvm/rubies/ruby-2.3.1/include/ruby-2.3.0/ruby/backward -I/home/vagrant/.rvm/rubies/ruby-2.3.1/include/ruby-2.3.0 -I. -I/usr/include/mysql -O3 -fno-fast-math -ggdb3 -Wall -Wextra -Wno-unused-parameter -Wno-parentheses -Wno-long-long -Wno-missing-field-initializers -Wunused-variable -Wpointer-arith -Wwrite-strings -Wdeclaration-after-statement -Wimplicit-function-declaration -Wdeprecated-declarations -Wno-packed-bitfield-compat -Wno-maybe-uninitialized -fPIC -DFULL_SSL_MODE_SUPPORT conftest.c -L. -L/home/vagrant/.rvm/rubies/ruby-2.3.1/lib -Wl,-R/home/vagrant/.rvm/rubies/ruby-2.3.1/lib -L. -fstack-protector -rdynamic -Wl,-export-dynamic -L/usr/lib/x86_64-linux-gnu -lmysqlclient -lpthread -lz -lm -lrt -ldl -Wl,-R/home/vagrant/.rvm/rubies/ruby-2.3.1/lib -L/home/vagrant/.rvm/rubies/ruby-2.3.1/lib -lruby -Werror -Wno-sign-conversion -lpthread -lgmp -ldl -lcrypt -lm -lc"
checked program was:
/* begin */
1: #include "ruby.h"
2:
3: int main() {return 0;}
/* end */
"gcc -o conftest -I/home/vagrant/.rvm/rubies/ruby-2.3.1/include/ruby-2.3.0/x86_64-linux -I/home/vagrant/.rvm/rubies/ruby-2.3.1/include/ruby-2.3.0/ruby/backward -I/home/vagrant/.rvm/rubies/ruby-2.3.1/include/ruby-2.3.0 -I. -I/usr/include/mysql -O3 -fno-fast-math -ggdb3 -Wall -Wextra -Wno-unused-parameter -Wno-parentheses -Wno-long-long -Wno-missing-field-initializers -Wunused-variable -Wpointer-arith -Wwrite-strings -Wdeclaration-after-statement -Wimplicit-function-declaration -Wdeprecated-declarations -Wno-packed-bitfield-compat -Wno-maybe-uninitialized -fPIC -DFULL_SSL_MODE_SUPPORT conftest.c -L. -L/home/vagrant/.rvm/rubies/ruby-2.3.1/lib -Wl,-R/home/vagrant/.rvm/rubies/ruby-2.3.1/lib -L. -fstack-protector -rdynamic -Wl,-export-dynamic -L/usr/lib/x86_64-linux-gnu -lmysqlclient -lpthread -lz -lm -lrt -ldl -Wl,-R/home/vagrant/.rvm/rubies/ruby-2.3.1/lib -L/home/vagrant/.rvm/rubies/ruby-2.3.1/lib -lruby -Werror -Wno-static-in-inline -lpthread -lgmp -ldl -lcrypt -lm -lc"
checked program was:
/* begin */
1: #include "ruby.h"
2:
3: int main() {return 0;}
/* end */
"gcc -o conftest -I/home/vagrant/.rvm/rubies/ruby-2.3.1/include/ruby-2.3.0/x86_64-linux -I/home/vagrant/.rvm/rubies/ruby-2.3.1/include/ruby-2.3.0/ruby/backward -I/home/vagrant/.rvm/rubies/ruby-2.3.1/include/ruby-2.3.0 -I. -I/usr/include/mysql -O3 -fno-fast-math -ggdb3 -Wall -Wextra -Wno-unused-parameter -Wno-parentheses -Wno-long-long -Wno-missing-field-initializers -Wunused-variable -Wpointer-arith -Wwrite-strings -Wdeclaration-after-statement -Wimplicit-function-declaration -Wdeprecated-declarations -Wno-packed-bitfield-compat -Wno-maybe-uninitialized -fPIC -DFULL_SSL_MODE_SUPPORT conftest.c -L. -L/home/vagrant/.rvm/rubies/ruby-2.3.1/lib -Wl,-R/home/vagrant/.rvm/rubies/ruby-2.3.1/lib -L. -fstack-protector -rdynamic -Wl,-export-dynamic -L/usr/lib/x86_64-linux-gnu -lmysqlclient -lpthread -lz -lm -lrt -ldl -Wl,-R/home/vagrant/.rvm/rubies/ruby-2.3.1/lib -L/home/vagrant/.rvm/rubies/ruby-2.3.1/lib -lruby -Werror -Wno-switch-enum -lpthread -lgmp -ldl -lcrypt -lm -lc"
checked program was:
/* begin */
1: #include "ruby.h"
2:
3: int main() {return 0;}
/* end */
"gcc -o conftest -I/home/vagrant/.rvm/rubies/ruby-2.3.1/include/ruby-2.3.0/x86_64-linux -I/home/vagrant/.rvm/rubies/ruby-2.3.1/include/ruby-2.3.0/ruby/backward -I/home/vagrant/.rvm/rubies/ruby-2.3.1/include/ruby-2.3.0 -I. -I/usr/include/mysql -O3 -fno-fast-math -ggdb3 -Wall -Wextra -Wno-unused-parameter -Wno-parentheses -Wno-long-long -Wno-missing-field-initializers -Wunused-variable -Wpointer-arith -Wwrite-strings -Wdeclaration-after-statement -Wimplicit-function-declaration -Wdeprecated-declarations -Wno-packed-bitfield-compat -Wno-maybe-uninitialized -fPIC -DFULL_SSL_MODE_SUPPORT conftest.c -L. -L/home/vagrant/.rvm/rubies/ruby-2.3.1/lib -Wl,-R/home/vagrant/.rvm/rubies/ruby-2.3.1/lib -L. -fstack-protector -rdynamic -Wl,-export-dynamic -L/usr/lib/x86_64-linux-gnu -lmysqlclient -lpthread -lz -lm -lrt -ldl -Wl,-R/home/vagrant/.rvm/rubies/ruby-2.3.1/lib -L/home/vagrant/.rvm/rubies/ruby-2.3.1/lib -lruby -Werror -Wno-undef -lpthread -lgmp -ldl -lcrypt -lm -lc"
checked program was:
/* begin */
1: #include "ruby.h"
2:
3: int main() {return 0;}
/* end */
"gcc -o conftest -I/home/vagrant/.rvm/rubies/ruby-2.3.1/include/ruby-2.3.0/x86_64-linux -I/home/vagrant/.rvm/rubies/ruby-2.3.1/include/ruby-2.3.0/ruby/backward -I/home/vagrant/.rvm/rubies/ruby-2.3.1/include/ruby-2.3.0 -I. -I/usr/include/mysql -O3 -fno-fast-math -ggdb3 -Wall -Wextra -Wno-unused-parameter -Wno-parentheses -Wno-long-long -Wno-missing-field-initializers -Wunused-variable -Wpointer-arith -Wwrite-strings -Wdeclaration-after-statement -Wimplicit-function-declaration -Wdeprecated-declarations -Wno-packed-bitfield-compat -Wno-maybe-uninitialized -fPIC -DFULL_SSL_MODE_SUPPORT conftest.c -L. -L/home/vagrant/.rvm/rubies/ruby-2.3.1/lib -Wl,-R/home/vagrant/.rvm/rubies/ruby-2.3.1/lib -L. -fstack-protector -rdynamic -Wl,-export-dynamic -L/usr/lib/x86_64-linux-gnu -lmysqlclient -lpthread -lz -lm -lrt -ldl -Wl,-R/home/vagrant/.rvm/rubies/ruby-2.3.1/lib -L/home/vagrant/.rvm/rubies/ruby-2.3.1/lib -lruby -Werror -Wno-unreachable-code -lpthread -lgmp -ldl -lcrypt -lm -lc"
checked program was:
/* begin */
1: #include "ruby.h"
2:
3: int main() {return 0;}
/* end */
"gcc -o conftest -I/home/vagrant/.rvm/rubies/ruby-2.3.1/include/ruby-2.3.0/x86_64-linux -I/home/vagrant/.rvm/rubies/ruby-2.3.1/include/ruby-2.3.0/ruby/backward -I/home/vagrant/.rvm/rubies/ruby-2.3.1/include/ruby-2.3.0 -I. -I/usr/include/mysql -O3 -fno-fast-math -ggdb3 -Wall -Wextra -Wno-unused-parameter -Wno-parentheses -Wno-long-long -Wno-missing-field-initializers -Wunused-variable -Wpointer-arith -Wwrite-strings -Wdeclaration-after-statement -Wimplicit-function-declaration -Wdeprecated-declarations -Wno-packed-bitfield-compat -Wno-maybe-uninitialized -fPIC -DFULL_SSL_MODE_SUPPORT conftest.c -L. -L/home/vagrant/.rvm/rubies/ruby-2.3.1/lib -Wl,-R/home/vagrant/.rvm/rubies/ruby-2.3.1/lib -L. -fstack-protector -rdynamic -Wl,-export-dynamic -L/usr/lib/x86_64-linux-gnu -lmysqlclient -lpthread -lz -lm -lrt -ldl -Wl,-R/home/vagrant/.rvm/rubies/ruby-2.3.1/lib -L/home/vagrant/.rvm/rubies/ruby-2.3.1/lib -lruby -Werror -Wno-used-but-marked-unused -lpthread -lgmp -ldl -lcrypt -lm -lc"
checked program was:
/* begin */
1: #include "ruby.h"
2:
3: int main() {return 0;}
/* end */
Sign up for free to join this conversation on GitHub. Already have an account? Sign in to comment