Skip to content

Instantly share code, notes, and snippets.

Embed
What would you like to do?
conan error while building openssl via cmake-conan
-- The C compiler identification is MSVC 19.16.27034.0
-- The CXX compiler identification is MSVC 19.16.27034.0
-- Detecting C compiler ABI info
-- Detecting C compiler ABI info - done
-- Check for working C compiler: C:/Program Files (x86)/Microsoft Visual Studio/2017/Community/VC/Tools/MSVC/14.16.27023/bin/Hostx86/x86/cl.exe - skipped
-- Detecting C compile features
-- Detecting C compile features - done
-- Detecting CXX compiler ABI info
-- Detecting CXX compiler ABI info - done
-- Check for working CXX compiler: C:/Program Files (x86)/Microsoft Visual Studio/2017/Community/VC/Tools/MSVC/14.16.27023/bin/Hostx86/x86/cl.exe - skipped
-- Detecting CXX compile features
-- Detecting CXX compile features - done
-- Conan: Automatic detection of conan settings from cmake
-- Conan: Detected VS runtime: MDd
-- Conan: Settings= -pr=C:/Users/Vincas/code/conan-test/profile.txt;-s;build_type=Debug
-- Conan: checking conan executable
-- Conan: Found program C:/Users/Vincas/code/cpp/trunk/3rdparty/Conan/_python_3.7.4_venv_conan_1.32.1/Scripts/conan.exe
-- Conan: Version found Conan version 1.32.1
-- Conan executing: C:/Users/Vincas/code/cpp/trunk/3rdparty/Conan/_python_3.7.4_venv_conan_1.32.1/Scripts/conan.exe install C:/Users/Vincas/code/conan-test/conanfile.txt -pr=C:/Users/Vincas/code/conan-test/profile.txt -s build_type=Debug -g=cmake --build=missing -if=C:/Users/Vincas/code/conan-test/build
Configuration:
[settings]
arch=x86
arch_build=x86
build_type=Debug
compiler=Visual Studio
compiler.runtime=MDd
compiler.version=15
os=Windows
os_build=Windows
[options]
[build_requires]
[env]
conanfile.txt: Installing package
Requirements
openssl/1.1.1j from 'conan-center' - Cache
Packages
openssl/1.1.1j:2c3ed620f02d73526549b31cf660e3e1dc5cd3b1 - Build
Build requirements
nasm/2.15.05 from 'conan-center' - Cache
strawberryperl/5.30.0.1 from 'conan-center' - Cache
Build requirements packages
nasm/2.15.05:45b43bcd991ec89baf1eb618b595ca3227a3cf0b - Cache
strawberryperl/5.30.0.1:b2fcbc60b3bee75023a4f7934cadb723eec550bd - Cache
Installing (downloading, building) binaries...
nasm/2.15.05: Already installed!
nasm/2.15.05: Appending PATH environment variable: C:\Users\Vincas\.conan\data\nasm\2.15.05\_\_\package\45b43bcd991ec89baf1eb618b595ca3227a3cf0b\bin
[HOOK - conan-center.py] post_package_info(): [CMAKE FILE NOT IN BUILD FOLDERS (KB-H019)] OK
strawberryperl/5.30.0.1: Already installed!
strawberryperl/5.30.0.1: Appending PATH environment variable: C:\.conan\c480a8\1\bin
[HOOK - conan-center.py] post_package_info(): [CMAKE FILE NOT IN BUILD FOLDERS (KB-H019)] OK
openssl/1.1.1j: Applying build-requirement: strawberryperl/5.30.0.1
openssl/1.1.1j: Applying build-requirement: nasm/2.15.05
openssl/1.1.1j: Copying sources to build folder
openssl/1.1.1j: Building your package in C:\Users\Vincas\.conan\data\openssl\1.1.1j\_\_\build\2c3ed620f02d73526549b31cf660e3e1dc5cd3b1
openssl/1.1.1j: Generator txt created conanbuildinfo.txt
openssl/1.1.1j: Calling build()
Conan:vcvars already set
openssl/1.1.1j: using target: VC-conan-Debug-Windows-x86-Visual Studio-15 -> VC-WIN32
openssl/1.1.1j: my %targets = (
"VC-conan-Debug-Windows-x86-Visual Studio-15" => {
inherit_from => [ "VC-WIN32" ],
cflags => add("-Zi -Ob0 -Od -MDd"),
cxxflags => add("-Zi -Ob0 -Od -MDd"),
includes => add("C:/.conan/c480a8/1/include"),
lflags => add(""),
cc => "C:/Program Files (x86)/Microsoft Visual Studio/2017/Community/VC/Tools/MSVC/14.16.27023/bin/Hostx86/x86/cl.exe",
cxx => "C:/Program Files (x86)/Microsoft Visual Studio/2017/Community/VC/Tools/MSVC/14.16.27023/bin/Hostx86/x86/cl.exe",
},
);
openssl/1.1.1j: activated option: shared
openssl/1.1.1j: activated option: shared
openssl/1.1.1j: ['"VC-conan-Debug-Windows-x86-Visual Studio-15"', 'shared', '--prefix="C:\\Users\\Vincas\\.conan\\data\\openssl\\1.1.1j\\_\\_\\package\\2c3ed620f02d73526549b31cf660e3e1dc5cd3b1"', '--openssldir="C:\\Users\\Vincas\\.conan\\data\\openssl\\1.1.1j\\_\\_\\package\\2c3ed620f02d73526549b31cf660e3e1dc5cd3b1\\res"', 'no-unit-test', 'threads', 'PERL=C:\\.conan\\c480a8\\1\\bin\\perl.exe', 'no-tests', '--debug', 'shared']
Configuring OpenSSL version 1.1.1j (0x101010afL) for VC-conan-Debug-Windows-x86-Visual Studio-15
Using os-specific seed configuration
Creating configdata.pm
Creating makefile
**********************************************************************
*** ***
*** OpenSSL has been successfully configured ***
*** ***
*** If you encounter a problem while building, please open an ***
*** issue on GitHub <https://github.com/openssl/openssl/issues> ***
*** and include the output from the following command: ***
*** ***
*** perl configdata.pm --dump ***
*** ***
*** (If you are new to OpenSSL, you might want to consult the ***
*** 'Troubleshooting' section in the INSTALL file first) ***
*** ***
**********************************************************************
Microsoft (R) Program Maintenance Utility Version 14.16.27034.0
Copyright (C) Microsoft Corporation. All rights reserved.
"C:\.conan\c480a8\1\bin\perl.exe" "-I." -Mconfigdata "util\dofile.pl" "-omakefile" "include\crypto\bn_conf.h.in" > include\crypto\bn_conf.h
"C:\.conan\c480a8\1\bin\perl.exe" "-I." -Mconfigdata "util\dofile.pl" "-omakefile" "include\crypto\dso_conf.h.in" > include\crypto\dso_conf.h
"C:\.conan\c480a8\1\bin\perl.exe" "-I." -Mconfigdata "util\dofile.pl" "-omakefile" "include\openssl\opensslconf.h.in" > include\openssl\opensslconf.h
"C:\Program Files (x86)\Microsoft Visual Studio\2017\Community\VC\Tools\MSVC\14.16.27023\bin\HostX86\x86\nmake.exe" / depend && "C:\Program Files (x86)\Microsoft Visual Studio\2017\Community\VC\Tools\MSVC\14.16.27023\bin\HostX86\x86\nmake.exe" / _all
Microsoft (R) Program Maintenance Utility Version 14.16.27034.0
Copyright (C) Microsoft Corporation. All rights reserved.
Microsoft (R) Program Maintenance Utility Version 14.16.27034.0
Copyright (C) Microsoft Corporation. All rights reserved.
C:/Program Files (x86)/Microsoft Visual Studio/2017/Community/VC/Tools/MSVC/14.16.27023/bin/Hostx86/x86/cl.exe /Zi /Fdossl_static.pdb /Gs0 /GF /Gy /MDd -Zi -Ob0 -Od -MDd /W3 /wd4090 /nologo /Od /I "." /I "include" -D"L_ENDIAN" -D"OPENSSL_PIC" -D"OPENSSL_CPUID_OBJ" -D"OPENSSL_BN_ASM_PART_WORDS" -D"OPENSSL_IA32_SSE2" -D"OPENSSL_BN_ASM_MONT" -D"OPENSSL_BN_ASM_GF2m" -D"SHA1_ASM" -D"SHA256_ASM" -D"SHA512_ASM" -D"RC4_ASM" -D"MD5_ASM" -D"RMD160_ASM" -D"AESNI_ASM" -D"VPAES_ASM" -D"WHIRLPOOL_ASM" -D"GHASH_ASM" -D"ECP_NISTZ256_ASM" -D"POLY1305_ASM" -D"OPENSSLDIR=\"C:\\Users\\Vincas\\.conan\\data\\openssl\\1.1.1j\\_\\_\\package\\2c3ed620f02d73526549b31cf660e3e1dc5cd3b1\\res\"" -D"ENGINESDIR=\"C:\\Users\\Vincas\\.conan\\data\\openssl\\1.1.1j\\_\\_\\package\\2c3ed620f02d73526549b31cf660e3e1dc5cd3b1\\lib\\engines-1_1\"" -D"OPENSSL_SYS_WIN32" -D"WIN32_LEAN_AND_MEAN" -D"UNICODE" -D"_UNICODE" -D"_CRT_SECURE_NO_DEPRECATE" -D"_WINSOCK_DEPRECATED_NO_WARNINGS" -D"DEBUG" -D"_DEBUG" -D"OPENSSL_USE_APPLINK" -I"C:/.conan/c480a8/1/include" -c /Foapps\app_rand.obj "apps\app_rand.c"
C:/Program Files (x86)/Microsoft Visual Studio/2017/Community/VC/Tools/MSVC/14.16.27023/bin/Hostx86/x86/cl.exe /Zi /Fdossl_static.pdb /Gs0 /GF /Gy /MDd -Zi -Ob0 -Od -MDd /W3 /wd4090 /nologo /Od /I "." /I "include" -D"L_ENDIAN" -D"OPENSSL_PIC" -D"OPENSSL_CPUID_OBJ" -D"OPENSSL_BN_ASM_PART_WORDS" -D"OPENSSL_IA32_SSE2" -D"OPENSSL_BN_ASM_MONT" -D"OPENSSL_BN_ASM_GF2m" -D"SHA1_ASM" -D"SHA256_ASM" -D"SHA512_ASM" -D"RC4_ASM" -D"MD5_ASM" -D"RMD160_ASM" -D"AESNI_ASM" -D"VPAES_ASM" -D"WHIRLPOOL_ASM" -D"GHASH_ASM" -D"ECP_NISTZ256_ASM" -D"POLY1305_ASM" -D"OPENSSLDIR=\"C:\\Users\\Vincas\\.conan\\data\\openssl\\1.1.1j\\_\\_\\package\\2c3ed620f02d73526549b31cf660e3e1dc5cd3b1\\res\"" -D"ENGINESDIR=\"C:\\Users\\Vincas\\.conan\\data\\openssl\\1.1.1j\\_\\_\\package\\2c3ed620f02d73526549b31cf660e3e1dc5cd3b1\\lib\\engines-1_1\"" -D"OPENSSL_SYS_WIN32" -D"WIN32_LEAN_AND_MEAN" -D"UNICODE" -D"_UNICODE" -D"_CRT_SECURE_NO_DEPRECATE" -D"_WINSOCK_DEPRECATED_NO_WARNINGS" -D"DEBUG" -D"_DEBUG" -D"OPENSSL_USE_APPLINK" -I"C:/.conan/c480a8/1/include" /Zs /showIncludes "apps\app_rand.c" 2>&1 > apps\app_rand.d
C:/Program Files (x86)/Microsoft Visual Studio/2017/Community/VC/Tools/MSVC/14.16.27023/bin/Hostx86/x86/cl.exe /Zi /Fdossl_static.pdb /Gs0 /GF /Gy /MDd -Zi -Ob0 -Od -MDd /W3 /wd4090 /nologo /Od /I "." /I "include" -D"L_ENDIAN" -D"OPENSSL_PIC" -D"OPENSSL_CPUID_OBJ" -D"OPENSSL_BN_ASM_PART_WORDS" -D"OPENSSL_IA32_SSE2" -D"OPENSSL_BN_ASM_MONT" -D"OPENSSL_BN_ASM_GF2m" -D"SHA1_ASM" -D"SHA256_ASM" -D"SHA512_ASM" -D"RC4_ASM" -D"MD5_ASM" -D"RMD160_ASM" -D"AESNI_ASM" -D"VPAES_ASM" -D"WHIRLPOOL_ASM" -D"GHASH_ASM" -D"ECP_NISTZ256_ASM" -D"POLY1305_ASM" -D"OPENSSLDIR=\"C:\\Users\\Vincas\\.conan\\data\\openssl\\1.1.1j\\_\\_\\package\\2c3ed620f02d73526549b31cf660e3e1dc5cd3b1\\res\"" -D"ENGINESDIR=\"C:\\Users\\Vincas\\.conan\\data\\openssl\\1.1.1j\\_\\_\\package\\2c3ed620f02d73526549b31cf660e3e1dc5cd3b1\\lib\\engines-1_1\"" -D"OPENSSL_SYS_WIN32" -D"WIN32_LEAN_AND_MEAN" -D"UNICODE" -D"_UNICODE" -D"_CRT_SECURE_NO_DEPRECATE" -D"_WINSOCK_DEPRECATED_NO_WARNINGS" -D"DEBUG" -D"_DEBUG" -D"OPENSSL_USE_APPLINK" -I"C:/.conan/c480a8/1/include" -c /Foapps\apps.obj "apps\apps.c"
C:/Program Files (x86)/Microsoft Visual Studio/2017/Community/VC/Tools/MSVC/14.16.27023/bin/Hostx86/x86/cl.exe /Zi /Fdossl_static.pdb /Gs0 /GF /Gy /MDd -Zi -Ob0 -Od -MDd /W3 /wd4090 /nologo /Od /I "." /I "include" -D"L_ENDIAN" -D"OPENSSL_PIC" -D"OPENSSL_CPUID_OBJ" -D"OPENSSL_BN_ASM_PART_WORDS" -D"OPENSSL_IA32_SSE2" -D"OPENSSL_BN_ASM_MONT" -D"OPENSSL_BN_ASM_GF2m" -D"SHA1_ASM" -D"SHA256_ASM" -D"SHA512_ASM" -D"RC4_ASM" -D"MD5_ASM" -D"RMD160_ASM" -D"AESNI_ASM" -D"VPAES_ASM" -D"WHIRLPOOL_ASM" -D"GHASH_ASM" -D"ECP_NISTZ256_ASM" -D"POLY1305_ASM" -D"OPENSSLDIR=\"C:\\Users\\Vincas\\.conan\\data\\openssl\\1.1.1j\\_\\_\\package\\2c3ed620f02d73526549b31cf660e3e1dc5cd3b1\\res\"" -D"ENGINESDIR=\"C:\\Users\\Vincas\\.conan\\data\\openssl\\1.1.1j\\_\\_\\package\\2c3ed620f02d73526549b31cf660e3e1dc5cd3b1\\lib\\engines-1_1\"" -D"OPENSSL_SYS_WIN32" -D"WIN32_LEAN_AND_MEAN" -D"UNICODE" -D"_UNICODE" -D"_CRT_SECURE_NO_DEPRECATE" -D"_WINSOCK_DEPRECATED_NO_WARNINGS" -D"DEBUG" -D"_DEBUG" -D"OPENSSL_USE_APPLINK" -I"C:/.conan/c480a8/1/include" /Zs /showIncludes "apps\apps.c" 2>&1 > apps\apps.d
C:/Program Files (x86)/Microsoft Visual Studio/2017/Community/VC/Tools/MSVC/14.16.27023/bin/Hostx86/x86/cl.exe /Zi /Fdossl_static.pdb /Gs0 /GF /Gy /MDd -Zi -Ob0 -Od -MDd /W3 /wd4090 /nologo /Od /I "." /I "include" -D"L_ENDIAN" -D"OPENSSL_PIC" -D"OPENSSL_CPUID_OBJ" -D"OPENSSL_BN_ASM_PART_WORDS" -D"OPENSSL_IA32_SSE2" -D"OPENSSL_BN_ASM_MONT" -D"OPENSSL_BN_ASM_GF2m" -D"SHA1_ASM" -D"SHA256_ASM" -D"SHA512_ASM" -D"RC4_ASM" -D"MD5_ASM" -D"RMD160_ASM" -D"AESNI_ASM" -D"VPAES_ASM" -D"WHIRLPOOL_ASM" -D"GHASH_ASM" -D"ECP_NISTZ256_ASM" -D"POLY1305_ASM" -D"OPENSSLDIR=\"C:\\Users\\Vincas\\.conan\\data\\openssl\\1.1.1j\\_\\_\\package\\2c3ed620f02d73526549b31cf660e3e1dc5cd3b1\\res\"" -D"ENGINESDIR=\"C:\\Users\\Vincas\\.conan\\data\\openssl\\1.1.1j\\_\\_\\package\\2c3ed620f02d73526549b31cf660e3e1dc5cd3b1\\lib\\engines-1_1\"" -D"OPENSSL_SYS_WIN32" -D"WIN32_LEAN_AND_MEAN" -D"UNICODE" -D"_UNICODE" -D"_CRT_SECURE_NO_DEPRECATE" -D"_WINSOCK_DEPRECATED_NO_WARNINGS" -D"DEBUG" -D"_DEBUG" -D"OPENSSL_USE_APPLINK" -I"C:/.conan/c480a8/1/include" -c /Foapps\bf_prefix.obj "apps\bf_prefix.c"
C:/Program Files (x86)/Microsoft Visual Studio/2017/Community/VC/Tools/MSVC/14.16.27023/bin/Hostx86/x86/cl.exe /Zi /Fdossl_static.pdb /Gs0 /GF /Gy /MDd -Zi -Ob0 -Od -MDd /W3 /wd4090 /nologo /Od /I "." /I "include" -D"L_ENDIAN" -D"OPENSSL_PIC" -D"OPENSSL_CPUID_OBJ" -D"OPENSSL_BN_ASM_PART_WORDS" -D"OPENSSL_IA32_SSE2" -D"OPENSSL_BN_ASM_MONT" -D"OPENSSL_BN_ASM_GF2m" -D"SHA1_ASM" -D"SHA256_ASM" -D"SHA512_ASM" -D"RC4_ASM" -D"MD5_ASM" -D"RMD160_ASM" -D"AESNI_ASM" -D"VPAES_ASM" -D"WHIRLPOOL_ASM" -D"GHASH_ASM" -D"ECP_NISTZ256_ASM" -D"POLY1305_ASM" -D"OPENSSLDIR=\"C:\\Users\\Vincas\\.conan\\data\\openssl\\1.1.1j\\_\\_\\package\\2c3ed620f02d73526549b31cf660e3e1dc5cd3b1\\res\"" -D"ENGINESDIR=\"C:\\Users\\Vincas\\.conan\\data\\openssl\\1.1.1j\\_\\_\\package\\2c3ed620f02d73526549b31cf660e3e1dc5cd3b1\\lib\\engines-1_1\"" -D"OPENSSL_SYS_WIN32" -D"WIN32_LEAN_AND_MEAN" -D"UNICODE" -D"_UNICODE" -D"_CRT_SECURE_NO_DEPRECATE" -D"_WINSOCK_DEPRECATED_NO_WARNINGS" -D"DEBUG" -D"_DEBUG" -D"OPENSSL_USE_APPLINK" -I"C:/.conan/c480a8/1/include" /Zs /showIncludes "apps\bf_prefix.c" 2>&1 > apps\bf_prefix.d
C:/Program Files (x86)/Microsoft Visual Studio/2017/Community/VC/Tools/MSVC/14.16.27023/bin/Hostx86/x86/cl.exe /Zi /Fdossl_static.pdb /Gs0 /GF /Gy /MDd -Zi -Ob0 -Od -MDd /W3 /wd4090 /nologo /Od /I "." /I "include" -D"L_ENDIAN" -D"OPENSSL_PIC" -D"OPENSSL_CPUID_OBJ" -D"OPENSSL_BN_ASM_PART_WORDS" -D"OPENSSL_IA32_SSE2" -D"OPENSSL_BN_ASM_MONT" -D"OPENSSL_BN_ASM_GF2m" -D"SHA1_ASM" -D"SHA256_ASM" -D"SHA512_ASM" -D"RC4_ASM" -D"MD5_ASM" -D"RMD160_ASM" -D"AESNI_ASM" -D"VPAES_ASM" -D"WHIRLPOOL_ASM" -D"GHASH_ASM" -D"ECP_NISTZ256_ASM" -D"POLY1305_ASM" -D"OPENSSLDIR=\"C:\\Users\\Vincas\\.conan\\data\\openssl\\1.1.1j\\_\\_\\package\\2c3ed620f02d73526549b31cf660e3e1dc5cd3b1\\res\"" -D"ENGINESDIR=\"C:\\Users\\Vincas\\.conan\\data\\openssl\\1.1.1j\\_\\_\\package\\2c3ed620f02d73526549b31cf660e3e1dc5cd3b1\\lib\\engines-1_1\"" -D"OPENSSL_SYS_WIN32" -D"WIN32_LEAN_AND_MEAN" -D"UNICODE" -D"_UNICODE" -D"_CRT_SECURE_NO_DEPRECATE" -D"_WINSOCK_DEPRECATED_NO_WARNINGS" -D"DEBUG" -D"_DEBUG" -D"OPENSSL_USE_APPLINK" -I"C:/.conan/c480a8/1/include" -c /Foapps\opt.obj "apps\opt.c"
C:/Program Files (x86)/Microsoft Visual Studio/2017/Community/VC/Tools/MSVC/14.16.27023/bin/Hostx86/x86/cl.exe /Zi /Fdossl_static.pdb /Gs0 /GF /Gy /MDd -Zi -Ob0 -Od -MDd /W3 /wd4090 /nologo /Od /I "." /I "include" -D"L_ENDIAN" -D"OPENSSL_PIC" -D"OPENSSL_CPUID_OBJ" -D"OPENSSL_BN_ASM_PART_WORDS" -D"OPENSSL_IA32_SSE2" -D"OPENSSL_BN_ASM_MONT" -D"OPENSSL_BN_ASM_GF2m" -D"SHA1_ASM" -D"SHA256_ASM" -D"SHA512_ASM" -D"RC4_ASM" -D"MD5_ASM" -D"RMD160_ASM" -D"AESNI_ASM" -D"VPAES_ASM" -D"WHIRLPOOL_ASM" -D"GHASH_ASM" -D"ECP_NISTZ256_ASM" -D"POLY1305_ASM" -D"OPENSSLDIR=\"C:\\Users\\Vincas\\.conan\\data\\openssl\\1.1.1j\\_\\_\\package\\2c3ed620f02d73526549b31cf660e3e1dc5cd3b1\\res\"" -D"ENGINESDIR=\"C:\\Users\\Vincas\\.conan\\data\\openssl\\1.1.1j\\_\\_\\package\\2c3ed620f02d73526549b31cf660e3e1dc5cd3b1\\lib\\engines-1_1\"" -D"OPENSSL_SYS_WIN32" -D"WIN32_LEAN_AND_MEAN" -D"UNICODE" -D"_UNICODE" -D"_CRT_SECURE_NO_DEPRECATE" -D"_WINSOCK_DEPRECATED_NO_WARNINGS" -D"DEBUG" -D"_DEBUG" -D"OPENSSL_USE_APPLINK" -I"C:/.conan/c480a8/1/include" /Zs /showIncludes "apps\opt.c" 2>&1 > apps\opt.d
C:/Program Files (x86)/Microsoft Visual Studio/2017/Community/VC/Tools/MSVC/14.16.27023/bin/Hostx86/x86/cl.exe /Zi /Fdossl_static.pdb /Gs0 /GF /Gy /MDd -Zi -Ob0 -Od -MDd /W3 /wd4090 /nologo /Od /I "." /I "include" -D"L_ENDIAN" -D"OPENSSL_PIC" -D"OPENSSL_CPUID_OBJ" -D"OPENSSL_BN_ASM_PART_WORDS" -D"OPENSSL_IA32_SSE2" -D"OPENSSL_BN_ASM_MONT" -D"OPENSSL_BN_ASM_GF2m" -D"SHA1_ASM" -D"SHA256_ASM" -D"SHA512_ASM" -D"RC4_ASM" -D"MD5_ASM" -D"RMD160_ASM" -D"AESNI_ASM" -D"VPAES_ASM" -D"WHIRLPOOL_ASM" -D"GHASH_ASM" -D"ECP_NISTZ256_ASM" -D"POLY1305_ASM" -D"OPENSSLDIR=\"C:\\Users\\Vincas\\.conan\\data\\openssl\\1.1.1j\\_\\_\\package\\2c3ed620f02d73526549b31cf660e3e1dc5cd3b1\\res\"" -D"ENGINESDIR=\"C:\\Users\\Vincas\\.conan\\data\\openssl\\1.1.1j\\_\\_\\package\\2c3ed620f02d73526549b31cf660e3e1dc5cd3b1\\lib\\engines-1_1\"" -D"OPENSSL_SYS_WIN32" -D"WIN32_LEAN_AND_MEAN" -D"UNICODE" -D"_UNICODE" -D"_CRT_SECURE_NO_DEPRECATE" -D"_WINSOCK_DEPRECATED_NO_WARNINGS" -D"DEBUG" -D"_DEBUG" -D"OPENSSL_USE_APPLINK" -I"C:/.conan/c480a8/1/include" -c /Foapps\s_cb.obj "apps\s_cb.c"
C:/Program Files (x86)/Microsoft Visual Studio/2017/Community/VC/Tools/MSVC/14.16.27023/bin/Hostx86/x86/cl.exe /Zi /Fdossl_static.pdb /Gs0 /GF /Gy /MDd -Zi -Ob0 -Od -MDd /W3 /wd4090 /nologo /Od /I "." /I "include" -D"L_ENDIAN" -D"OPENSSL_PIC" -D"OPENSSL_CPUID_OBJ" -D"OPENSSL_BN_ASM_PART_WORDS" -D"OPENSSL_IA32_SSE2" -D"OPENSSL_BN_ASM_MONT" -D"OPENSSL_BN_ASM_GF2m" -D"SHA1_ASM" -D"SHA256_ASM" -D"SHA512_ASM" -D"RC4_ASM" -D"MD5_ASM" -D"RMD160_ASM" -D"AESNI_ASM" -D"VPAES_ASM" -D"WHIRLPOOL_ASM" -D"GHASH_ASM" -D"ECP_NISTZ256_ASM" -D"POLY1305_ASM" -D"OPENSSLDIR=\"C:\\Users\\Vincas\\.conan\\data\\openssl\\1.1.1j\\_\\_\\package\\2c3ed620f02d73526549b31cf660e3e1dc5cd3b1\\res\"" -D"ENGINESDIR=\"C:\\Users\\Vincas\\.conan\\data\\openssl\\1.1.1j\\_\\_\\package\\2c3ed620f02d73526549b31cf660e3e1dc5cd3b1\\lib\\engines-1_1\"" -D"OPENSSL_SYS_WIN32" -D"WIN32_LEAN_AND_MEAN" -D"UNICODE" -D"_UNICODE" -D"_CRT_SECURE_NO_DEPRECATE" -D"_WINSOCK_DEPRECATED_NO_WARNINGS" -D"DEBUG" -D"_DEBUG" -D"OPENSSL_USE_APPLINK" -I"C:/.conan/c480a8/1/include" /Zs /showIncludes "apps\s_cb.c" 2>&1 > apps\s_cb.d
C:/Program Files (x86)/Microsoft Visual Studio/2017/Community/VC/Tools/MSVC/14.16.27023/bin/Hostx86/x86/cl.exe /Zi /Fdossl_static.pdb /Gs0 /GF /Gy /MDd -Zi -Ob0 -Od -MDd /W3 /wd4090 /nologo /Od /I "." /I "include" -D"L_ENDIAN" -D"OPENSSL_PIC" -D"OPENSSL_CPUID_OBJ" -D"OPENSSL_BN_ASM_PART_WORDS" -D"OPENSSL_IA32_SSE2" -D"OPENSSL_BN_ASM_MONT" -D"OPENSSL_BN_ASM_GF2m" -D"SHA1_ASM" -D"SHA256_ASM" -D"SHA512_ASM" -D"RC4_ASM" -D"MD5_ASM" -D"RMD160_ASM" -D"AESNI_ASM" -D"VPAES_ASM" -D"WHIRLPOOL_ASM" -D"GHASH_ASM" -D"ECP_NISTZ256_ASM" -D"POLY1305_ASM" -D"OPENSSLDIR=\"C:\\Users\\Vincas\\.conan\\data\\openssl\\1.1.1j\\_\\_\\package\\2c3ed620f02d73526549b31cf660e3e1dc5cd3b1\\res\"" -D"ENGINESDIR=\"C:\\Users\\Vincas\\.conan\\data\\openssl\\1.1.1j\\_\\_\\package\\2c3ed620f02d73526549b31cf660e3e1dc5cd3b1\\lib\\engines-1_1\"" -D"OPENSSL_SYS_WIN32" -D"WIN32_LEAN_AND_MEAN" -D"UNICODE" -D"_UNICODE" -D"_CRT_SECURE_NO_DEPRECATE" -D"_WINSOCK_DEPRECATED_NO_WARNINGS" -D"DEBUG" -D"_DEBUG" -D"OPENSSL_USE_APPLINK" -I"C:/.conan/c480a8/1/include" -c /Foapps\s_socket.obj "apps\s_socket.c"
C:/Program Files (x86)/Microsoft Visual Studio/2017/Community/VC/Tools/MSVC/14.16.27023/bin/Hostx86/x86/cl.exe /Zi /Fdossl_static.pdb /Gs0 /GF /Gy /MDd -Zi -Ob0 -Od -MDd /W3 /wd4090 /nologo /Od /I "." /I "include" -D"L_ENDIAN" -D"OPENSSL_PIC" -D"OPENSSL_CPUID_OBJ" -D"OPENSSL_BN_ASM_PART_WORDS" -D"OPENSSL_IA32_SSE2" -D"OPENSSL_BN_ASM_MONT" -D"OPENSSL_BN_ASM_GF2m" -D"SHA1_ASM" -D"SHA256_ASM" -D"SHA512_ASM" -D"RC4_ASM" -D"MD5_ASM" -D"RMD160_ASM" -D"AESNI_ASM" -D"VPAES_ASM" -D"WHIRLPOOL_ASM" -D"GHASH_ASM" -D"ECP_NISTZ256_ASM" -D"POLY1305_ASM" -D"OPENSSLDIR=\"C:\\Users\\Vincas\\.conan\\data\\openssl\\1.1.1j\\_\\_\\package\\2c3ed620f02d73526549b31cf660e3e1dc5cd3b1\\res\"" -D"ENGINESDIR=\"C:\\Users\\Vincas\\.conan\\data\\openssl\\1.1.1j\\_\\_\\package\\2c3ed620f02d73526549b31cf660e3e1dc5cd3b1\\lib\\engines-1_1\"" -D"OPENSSL_SYS_WIN32" -D"WIN32_LEAN_AND_MEAN" -D"UNICODE" -D"_UNICODE" -D"_CRT_SECURE_NO_DEPRECATE" -D"_WINSOCK_DEPRECATED_NO_WARNINGS" -D"DEBUG" -D"_DEBUG" -D"OPENSSL_USE_APPLINK" -I"C:/.conan/c480a8/1/include" /Zs /showIncludes "apps\s_socket.c" 2>&1 > apps\s_socket.d
C:/Program Files (x86)/Microsoft Visual Studio/2017/Community/VC/Tools/MSVC/14.16.27023/bin/Hostx86/x86/cl.exe /Zi /Fdossl_static.pdb /Gs0 /GF /Gy /MDd -Zi -Ob0 -Od -MDd /W3 /wd4090 /nologo /Od /I "." /I "include" -D"L_ENDIAN" -D"OPENSSL_PIC" -D"OPENSSL_CPUID_OBJ" -D"OPENSSL_BN_ASM_PART_WORDS" -D"OPENSSL_IA32_SSE2" -D"OPENSSL_BN_ASM_MONT" -D"OPENSSL_BN_ASM_GF2m" -D"SHA1_ASM" -D"SHA256_ASM" -D"SHA512_ASM" -D"RC4_ASM" -D"MD5_ASM" -D"RMD160_ASM" -D"AESNI_ASM" -D"VPAES_ASM" -D"WHIRLPOOL_ASM" -D"GHASH_ASM" -D"ECP_NISTZ256_ASM" -D"POLY1305_ASM" -D"OPENSSLDIR=\"C:\\Users\\Vincas\\.conan\\data\\openssl\\1.1.1j\\_\\_\\package\\2c3ed620f02d73526549b31cf660e3e1dc5cd3b1\\res\"" -D"ENGINESDIR=\"C:\\Users\\Vincas\\.conan\\data\\openssl\\1.1.1j\\_\\_\\package\\2c3ed620f02d73526549b31cf660e3e1dc5cd3b1\\lib\\engines-1_1\"" -D"OPENSSL_SYS_WIN32" -D"WIN32_LEAN_AND_MEAN" -D"UNICODE" -D"_UNICODE" -D"_CRT_SECURE_NO_DEPRECATE" -D"_WINSOCK_DEPRECATED_NO_WARNINGS" -D"DEBUG" -D"_DEBUG" -D"OPENSSL_USE_APPLINK" -I"C:/.conan/c480a8/1/include" -c /Foapps\win32_init.obj "apps\win32_init.c"
C:/Program Files (x86)/Microsoft Visual Studio/2017/Community/VC/Tools/MSVC/14.16.27023/bin/Hostx86/x86/cl.exe /Zi /Fdossl_static.pdb /Gs0 /GF /Gy /MDd -Zi -Ob0 -Od -MDd /W3 /wd4090 /nologo /Od /I "." /I "include" -D"L_ENDIAN" -D"OPENSSL_PIC" -D"OPENSSL_CPUID_OBJ" -D"OPENSSL_BN_ASM_PART_WORDS" -D"OPENSSL_IA32_SSE2" -D"OPENSSL_BN_ASM_MONT" -D"OPENSSL_BN_ASM_GF2m" -D"SHA1_ASM" -D"SHA256_ASM" -D"SHA512_ASM" -D"RC4_ASM" -D"MD5_ASM" -D"RMD160_ASM" -D"AESNI_ASM" -D"VPAES_ASM" -D"WHIRLPOOL_ASM" -D"GHASH_ASM" -D"ECP_NISTZ256_ASM" -D"POLY1305_ASM" -D"OPENSSLDIR=\"C:\\Users\\Vincas\\.conan\\data\\openssl\\1.1.1j\\_\\_\\package\\2c3ed620f02d73526549b31cf660e3e1dc5cd3b1\\res\"" -D"ENGINESDIR=\"C:\\Users\\Vincas\\.conan\\data\\openssl\\1.1.1j\\_\\_\\package\\2c3ed620f02d73526549b31cf660e3e1dc5cd3b1\\lib\\engines-1_1\"" -D"OPENSSL_SYS_WIN32" -D"WIN32_LEAN_AND_MEAN" -D"UNICODE" -D"_UNICODE" -D"_CRT_SECURE_NO_DEPRECATE" -D"_WINSOCK_DEPRECATED_NO_WARNINGS" -D"DEBUG" -D"_DEBUG" -D"OPENSSL_USE_APPLINK" -I"C:/.conan/c480a8/1/include" /Zs /showIncludes "apps\win32_init.c" 2>&1 > apps\win32_init.d
lib /nologo /out:apps\libapps.lib @C:\Users\Vincas\AppData\Local\Temp\nm639E.tmp
LINK : fatal error LNK1181: cannot open input file 'apps\app_rand.obj'
NMAKE : fatal error U1077: '"C:\Program Files (x86)\Microsoft Visual Studio\2017\Community\VC\Tools\MSVC\14.16.27023\bin\HostX86\x86\lib.EXE"' : return code '0x49d'
Stop.
NMAKE : fatal error U1077: '"C:\Program Files (x86)\Microsoft Visual Studio\2017\Community\VC\Tools\MSVC\14.16.27023\bin\HostX86\x86\nmake.exe"' : return code '0x2'
Stop.
openssl/1.1.1j:
openssl/1.1.1j: WARN: Package binary is corrupted, removing: 2c3ed620f02d73526549b31cf660e3e1dc5cd3b1
openssl/1.1.1j: WARN: Build folder is dirty, removing it: C:\Users\Vincas\.conan\data\openssl\1.1.1j\_\_\build\2c3ed620f02d73526549b31cf660e3e1dc5cd3b1
WARN: replace_in_file didn't find pattern '/MTd ' in 'Configurations\10-main.conf' file.
WARN: replace_in_file didn't find pattern '/MTd"' in 'Configurations\10-main.conf' file.
openssl/1.1.1j: ERROR: Package '2c3ed620f02d73526549b31cf660e3e1dc5cd3b1' build failed
openssl/1.1.1j: WARN: Build folder C:\Users\Vincas\.conan\data\openssl\1.1.1j\_\_\build\2c3ed620f02d73526549b31cf660e3e1dc5cd3b1
ERROR: openssl/1.1.1j: Error in build() method, line 692
self._make()
while calling '_make', line 646
self._run_make()
while calling '_run_make', line 604
self.run(" ".join(command), win_bash=self._win_bash)
ConanException: Error 2 while executing nmake
CMake Error at cmake-conan-0.15/conan.cmake:402 (message):
Conan install failed='1'
Call Stack (most recent call first):
cmake-conan-0.15/conan.cmake:497 (conan_cmake_install)
CMakeLists.txt:10 (conan_cmake_run)
-- Configuring incomplete, errors occurred!
See also "C:/Users/Vincas/code/conan-test/build/CMakeFiles/CMakeOutput.log".
Sign up for free to join this conversation on GitHub. Already have an account? Sign in to comment