Skip to content

Instantly share code, notes, and snippets.

@adiroiban adiroiban/gist:9125421
Last active Aug 29, 2015

Embed
What would you like to do?
(venv)
/home/adi/chevah/pydoctor/trunk ----------------------------------------- @pp
$ nosetests pydoctor
..............................E........E...F.....................
======================================================================
ERROR: Failure: ImportError (No module named py)
----------------------------------------------------------------------
Traceback (most recent call last):
File "/usr/lib/python2.7/dist-packages/nose/loader.py", line 390, in loadTestsFromName
addr.filename, addr.module)
File "/usr/lib/python2.7/dist-packages/nose/importer.py", line 39, in importFromPath
return self.importFromDir(dir_path, fqname)
File "/usr/lib/python2.7/dist-packages/nose/importer.py", line 86, in importFromDir
mod = load_module(part_fqname, fh, filename, desc)
File "/home/adi/chevah/pydoctor/trunk/pydoctor/test/test_formatting.py", line 2, in <module>
from py import test
ImportError: No module named py
======================================================================
ERROR: Failure: ImportError (No module named requesthelper)
----------------------------------------------------------------------
Traceback (most recent call last):
File "/usr/lib/python2.7/dist-packages/nose/loader.py", line 390, in loadTestsFromName
addr.filename, addr.module)
File "/usr/lib/python2.7/dist-packages/nose/importer.py", line 39, in importFromPath
return self.importFromDir(dir_path, fqname)
File "/usr/lib/python2.7/dist-packages/nose/importer.py", line 86, in importFromDir
mod = load_module(part_fqname, fh, filename, desc)
File "/home/adi/chevah/pydoctor/trunk/pydoctor/test/test_server.py", line 6, in <module>
from twisted.web.test.requesthelper import DummyChannel
ImportError: No module named requesthelper
======================================================================
FAIL: pydoctor.test.test_templatewriter.test_rest_support
----------------------------------------------------------------------
Traceback (most recent call last):
File "/usr/lib/python2.7/dist-packages/nose/case.py", line 197, in runTest
self.test(*self.arg)
File "/home/adi/chevah/pydoctor/trunk/pydoctor/test/test_templatewriter.py", line 55, in test_rest_support
assert "<pre>" not in html
AssertionError:
-------------------- >> begin captured stdout << ---------------------
Function '<test>.f'
Error trying to import 'restructuredtext' parser:
ImportError: No module named epydoc.markup.restructuredtext
Using plain text formatting only.
--------------------- >> end captured stdout << ----------------------
----------------------------------------------------------------------
Ran 65 tests in 0.418s
FAILED (errors=2, failures=1)
(venv)
/home/adi/chevah/pydoctor/trunk ----------------------------------------- @pp
$ python
Python 2.7.3 (default, Sep 26 2013, 20:08:41)
[GCC 4.6.3] on linux2
Type "help", "copyright", "credits" or "license" for more information.
>>> import epydoc
(venv)
/home/adi/chevah/pydoctor/trunk ----------------------------------------- @pp
$ bzr top
613: Michael Hudson-Doyle 2014-02-21 remove py.test vestiges
612: Michael Hudson-Doyle 2014-02-05 {release-0.5} release 0.5
Sign up for free to join this conversation on GitHub. Already have an account? Sign in to comment
You can’t perform that action at this time.